{"text_format":"1","workbook":"xlsx","n_sheets":14,"sheets":["Einführung","Daten","Grafik und Ergebnisse","Parameter","Methodik","Kalk Ergebnisse","Kalk Nutz_Bestand","Kalk Nutz_Neu","Kalk Dämmung","Kalk Bausubstanz","Quelle Bsp","Listen","Farben","Lebenszyklus"],"not_rendered":{"charts":4,"images":15,"macros":1,"external_links":0,"defined_names":0,"comments":2,"pivot_tables":0},"unopened":[],"bounds":{"document_bytes":16777216,"sheet_cells":100000,"rows_first":2000,"rows_last":500,"rows_between":2000,"halvings":0,"cell_chars":16384,"cell_head_chars":4096},"cells_cut":0,"cells_raw":0,"read":"whole","date_system":"1900"}

{"sheet":"Einführung","index":0,"n_rows":70,"n_cols":6,"rows_kept":70,"cut":false,"hidden":false,"merged":[[51,1,51,8],[1,1,1,8],[3,1,3,8],[50,1,50,8],[4,1,5,8],[14,1,14,8],[15,1,28,8]]}
[]
[null,"GREGOR - Graue Energie von Gebäuden - Ökologischer Rucksack"]
[]
[null,"12/2022"]
[null,"Zur Verfügung gestellt von klimaaktiv, der Klimaschutzinitative des Bundesministeriums für Klimaschutz, Umwelt, Energie, Mobilität, Innovation und Technologie."]
[]
[]
[]
[]
[]
[]
[]
[]
[]
[null,"Kurzbeschreibung des Tools"]
[null,"Sanierung oder Neubau? Betrachtet man ein Gebäude anhand seiner Energieeffizienz wird der Neubau der Sanierung oft vorgezogen. Aus ökologischer Sichtweise kann eine Sanierung allerdings durchwegs klimafreundlicher sein als der Abriss und Neubau des Gebäudes. Immerhin wurden durch den Bau des Gebäudes bereits Energie verbraucht und Emissionen verursacht. \n\nDieses Excel-Tool ermöglicht eine Abschätzung des 'versteckten' ökologischen Rucksacks über den Lebenszyklus eines Gebäudes. In der Betrachtung werden die Treibhausgas-Emissionen (CO2e-Emissionen) und die fossile Primärenergie (graue Energie) eines Gebäudes für die Szenarien Sanierung und Neubau miteinander verglichen. Dabei werden neben den jährlichen THG-Emissionen, welche durch die Bereistellung von Energie in der Nutzungsphase anfallen, auch jene THG-Emissionen berücksichtigt, welche über den Lebensweg der Baustoffe entstehen. Parallel dazu erfolgt eine Bilanzierung der \"grauen Energie\". Da es sich um Standardwerte handelt dient das Tool zur Einordung und Abschätzung der Größenverhältnisse. Für detaillierte Daten zu einem spezifischen Bauvorhaben ist eine umfassende Ökobilanz erforderlich."]
[]
[]
[]
[]
{"$rows_left_out":51}
{"sheet":"Daten","index":1,"n_rows":34,"n_cols":16,"rows_kept":34,"cut":false,"hidden":false,"merged":[[30,6,31,11],[33,6,34,11],[21,15,22,19],[24,15,25,19],[2,15,3,16],[6,15,7,19],[9,15,10,19],[15,15,16,19],[12,15,13,19],[18,15,19,19],[21,3,22,5],[24,3,25,5],[18,3,19,5],[18,6,19,11],[2,2,3,4],[6,6,7,11],[9,6,10,11],[12,6,13,11],[15,6,16,11],[6,3,7,5],[9,3,10,5],[12,3,13,5],[15,3,16,5],[21,6,22,11],[24,6,25,11]]}
[]
[]
[null,null,"Daten Eingabe",null,null,null,null,null,null,null,null,null,null,null,null,"Information"]
[]
[]
[]
[null,null,null,"Gebäudekategorie",null,null,"bitte auswählen",null,null,null,null,null,null,null,null,"Auswahl aus Einfamilienhaus (1-2 NE), Mehrfamilienhaus und Reihenhaus (2-10 NE), Mehrgeschossiger, großvolumiger Wohnbau (ab 11 NE), NE = Nutzeinheiten"]
[]
[]
[null,null,null,"Bauperiode Bestandsgebäude",null,null,"bitte auswählen",null,null,null,null,null,null,null,null,"Auswahl der Bauperiode zwischen bis 1918; 1918-1944; 1945-1960; 1961-1990; ab 1991"]
[]
[]
[null,null,null,"Bruttogrundfläche [m²]",null,null,0,null,null,null,null,null,null,null,null,"Angabe der Bruttogrundfläche ist die Summe aller Grundflächen des Gebäudes "]
[]
[]
[null,null,null,"Wärmebereitstellungssystem Bestandsgebäude",null,null,"bitte auswählen",null,null,null,null,null,null,null,null,"Auswahl aus Erdgas; Erdgas Brennwert; Heizöl; Holz; Fernwärme Erneuerbar; Fernwärme Österreich-Mix, Wärmepumpe (hier: Luft-WP)"]
[]
[]
[null,null,null,"Wärmebereitstellungssystem nach Sanierung bzw. Neubau",null,null,"bitte auswählen",null,null,null,null,null,null,null,null,"Auswahl aus Holz, Fernwärme Erneuerbar, Fernwärme Österreich-Mix (Annahme: 50 % erneuerbar), Wärmepumpe (hier: Luft-WP)"]
[]
{"$rows_left_out":15}
{"sheet":"Grafik und Ergebnisse","index":2,"n_rows":71,"n_cols":29,"rows_kept":71,"cut":false,"hidden":false,"merged":[[22,4,22,5],[28,4,28,5],[22,20,22,21],[28,20,28,21],[32,2,32,6],[32,8,32,12],[32,18,32,22],[22,6,22,7],[28,6,28,7],[22,8,22,9],[28,8,28,9],[22,22,22,23],[28,22,28,23],[32,24,32,28],[66,3,66,12],[66,1,66,2],[65,1,65,2],[69,1,69,2],[67,1,67,2],[65,3,65,12],[70,1,70,2],[68,1,68,2],[70,3,70,12],[67,3,67,12],[69,3,69,12],[68,3,68,12]]}
[]
[null,"Ergebnisse: Ökologischer Rucksack"]
[]
[]
[]
[]
[]
[]
[]
[]
[null,"Ökologischer Rucksack: CO2e-Emissionen",null,null,null,null,null,null,null,null,null,null,null,null,null,null,null,"Ökologischer Rucksack: Graue Energie"]
[]
[]
[null,null,{"$f":"\"Unter Berücksichtigung des Lebenszyklus des Gebäudes und einer Nutzungsdauer von \" & INT(Daten!G25) & \" Jahren werden durch die Sanierung \" & INT('Grafik und Ergebnisse'!F38) & \" Tonnen CO2e verursacht.\"","v":{"$error":"#N/A"}},null,null,null,null,null,null,null,null,null,null,null,null,null,null,null,{"$f":"\"Unter Berücksichtigung des Lebenszyklus des Gebäudes und einer Nutzungsdauer von \" & INT(Daten!G25) & \" Jahren werden durch die Sanierung \" & INT(V38) & \" MWh Energie eingesetzt.\"","v":{"$error":"#N/A"}}]
[null,null,{"$f":" \"Durch den Neubau entstehen \" & INT('Grafik und Ergebnisse'!G38) & \" Tonnen CO2e.\"","v":{"$error":"#N/A"}},null,null,null,null,null,null,null,null,null,null,null,null,null,null,null,{"$f":"\"Für den Neubau werden \" & INT('Grafik und Ergebnisse'!W38) & \" MWh Energie benötigt.\"","v":{"$error":"#N/A"}}]
[null,null,{"$f":" \"Der 'versteckte' Ökologische Rucksack durch die CO2 Emissionen der Bausubstanz des Gebäudes beträgt \" & INT(F36) & \" Tonnen CO2e für die Sanierung, und \" & INT(G36) & \" Tonnen CO2e für den Neubau.\"","v":{"$error":"#N/A"}},null,null,null,null,null,null,null,null,null,null,null,null,null,null,null,{"$f":" \"Der 'versteckte' Ökologische Rucksack durch die graue Energie der Bausubstanz des Gebäudes beträgt \" & INT(V36) & \" MWh für die Sanierung, und \" & INT(W36) & \" MWh für den Neubau.\"","v":{"$error":"#N/A"}}]
[null,null,{"$f":" \"Umgerechnet sind das: \"","v":"Umgerechnet sind das: "},null,null,null,null,null,null,null,null,null,null,null,null,null,null,null,{"$f":"\"Umgerechnet sind das: \"","v":"Umgerechnet sind das: "}]
[]
[]
[null,null,"CO2e-",null,null,null,null,null,null,null,null,null,null,null,null,null,null,null,"Graue"]
{"$rows_left_out":52}
{"sheet":"Parameter","index":3,"n_rows":45,"n_cols":10,"rows_kept":45,"cut":false,"hidden":false,"merged":[[1,1,1,10],[3,1,6,10],[28,1,28,10],[30,2,30,3],[30,4,30,5],[30,1,31,1],[8,1,8,10],[9,1,9,2],[10,2,10,3],[10,8,10,9],[10,4,10,5],[22,4,22,5],[44,1,45,6],[37,3,37,4],[37,5,37,6],[35,1,35,10],[20,1,20,10],[22,2,22,3],[37,1,38,1]]}
[]
[null,"Parameter-Anpassung"]
[]
[null,"In diesem Abschnitt können die Parameter zur Berechnung mit eigenen Werten angepasst werden, da es sich bei den Default-Werten um Standardwerte handelt. Die spezfisichen Daten für Ihr Gebäude können beispielsweise für die Materialzusammensetzung aus einem Berechnungstool (z.B. GEMIS) oder für das Energiesystem aus Ihrem  Energieausweis entnommen werden. Beim Klick auf die Schaltfläche \"Default Werte zurück setzen\" werden die Eingabe Felder auf die Default Werte zurück gesetzt."]
[]
[]
[]
[]
[null,"Parameter-Anpassung Bausubstanz [kg]"]
[]
[null,null,"Emissionsfaktor [kg CO2e/kg]",null,"PEB fossil [kWh/kg]",null,null,null,"Dichte [kg/m³]"]
[null,"Material","Eingabe","Default","Eingabe","Default",null,"Material","Eingabe","Default"]
[null,"Holz",{"$f":"D13","v":0.28499999999999998},{"$f":"'Kalk Bausubstanz'!I33","v":0.28499999999999998},{"$f":"F13","v":1.2805555555555557},{"$f":"'Kalk Bausubstanz'!I43","v":1.2805555555555557},null,"Holz",{"$f":"J13","v":529},{"$f":"'Kalk Bausubstanz'!M33","v":529}]
[null,"Ziegel",{"$f":"D14","v":0.23699999999999999},{"$f":"'Kalk Bausubstanz'!I34","v":0.23699999999999999},{"$f":"F14","v":1.1361111111111111},{"$f":"'Kalk Bausubstanz'!I44","v":1.1361111111111111},null,"Ziegel",{"$f":"J14","v":700},{"$f":"'Kalk Bausubstanz'!M34","v":700}]
[null,"Beton",8.9399999999999993E-2,{"$f":"'Kalk Bausubstanz'!I35","v":8.9399999999999993E-2},0.11888888888888888,{"$f":"'Kalk Bausubstanz'!I45","v":0.11888888888888888},null,"Beton",2400,{"$f":"'Kalk Bausubstanz'!M35","v":2400}]
[null,"Stahl",1,{"$f":"'Kalk Bausubstanz'!I36","v":1},4.166666666666667,{"$f":"'Kalk Bausubstanz'!I46","v":4.166666666666667},null,"Stahl",7900,{"$f":"'Kalk Bausubstanz'!M36","v":7900}]
[null,"Glas",1.1000000000000001,{"$f":"'Kalk Bausubstanz'!I37","v":1.1000000000000001},4.1944444444444446,{"$f":"'Kalk Bausubstanz'!I47","v":4.1944444444444446},null,"Glas",2500,{"$f":"'Kalk Bausubstanz'!M37","v":2500}]
[null,"Stahlbeton",0.13400000000000001,{"$f":"'Kalk Bausubstanz'!I38","v":0.13400000000000001},0.15611111111111112,{"$f":"'Kalk Bausubstanz'!I48","v":0.15611111111111112},null,"Stahlbeton",2400,{"$f":"'Kalk Bausubstanz'!M38","v":2400}]
[]
[]
{"$rows_left_out":26}
{"sheet":"Methodik","index":4,"n_rows":34,"n_cols":2,"rows_kept":34,"cut":false,"hidden":false,"merged":[[27,1,29,10],[33,1,63,10],[1,1,1,10],[3,1,3,10],[5,1,18,10],[31,1,31,10],[20,1,20,10],[22,1,23,10],[25,1,25,10]]}
[]
[null,"Methodik"]
[]
[null,"Hintergrund"]
[]
[null,"Sanierung oder Neubau? Betrachtet man ein Gebäude anhand seiner Energieeffizienz wird der Neubau der Sanierung oft vorgezogen. Aus ökologischer Sichtweise kann eine Sanierung allerdings durchwegs klimafreundlicher sein als der Abriss und Neubau des Gebäudes. Immerhin wurden durch den Bau des Gebäudes bereits Energie verbraucht und klimaschädlcihe Treibhausgas-Emissionen (CO2e) verursacht. Dieses Tool soll diese \"versteckten\" Verbräuche (ökologischer Rucksack) sichtbar machen um die Gebäude über ihren Lebensweg vergleichen zu können. Da es sich hierbei um Standardwerte handelt sollten die Ergebnisse jedoch als Abschätzung verstanden werden.\n\nIn diesem Tool wird der ökologische Rucksack mittels der CO2e-Emissionen und der grauen Energie des Gebäudes dargestellt. Als ökologischer Rucksack werden die gesamten Inputs bezeichnet, welche im Laufe des Lebensweges von Produkten und Materialien aufgewendet wird. Der Lebenszyklus eines Produktes oder Materials beinhaltet dabei die Prozesse der Rohstoffgewinnung, Herstellung, Verarbeitung, Instandhaltung, Entsorgung, und Transport. Treibhausgas-Emissionen beschreiben das gesamte Treibhausgaspotenzial einer Aktivität. Dies kann auf CO2-Äquivalente umgerechnet werden. Als graue Energie wird die gesamte Primärenergie bezeichnet, welche im Laufe des Lebensweges von Produkten und Materialien aufgewendet wird.  "]
[]
[]
[]
[]
[]
[]
[]
[]
[]
[]
[]
[]
[]
[]
{"$rows_left_out":15}
{"sheet":"Kalk Ergebnisse","index":5,"n_rows":29,"n_cols":9,"rows_kept":29,"cut":false,"hidden":true,"merged":[[20,6,20,8],[3,1,3,2],[4,1,4,2],[8,6,8,8],[1,1,1,8],[6,1,6,8],[18,1,18,8]]}
[]
[null,"Kalkulation Ergebnisse"]
[]
[null,"Nutzungsdauer",null,{"$f":"Daten!G25","v":30}]
[null,"BGF",null,{"$f":"Daten!G13","v":0}]
[]
[null,"Kalkulation Emissionen [t CO2e]"]
[]
[null,null,"Bestand","Sanierung","Neubau",null,"Überprüfung Einzelwerte [kg CO2]"]
[null,"Bausubstanz:",{"$f":"(INDEX('Kalk Bausubstanz'!$C$34:$E$38, MATCH(Daten!G10,'Kalk Bausubstanz'!B34:B38,0), MATCH(Daten!G7,'Kalk Bausubstanz'!C33:E33,0))*'Kalk Ergebnisse'!D5)/1000","v":{"$error":"#N/A"}},{"$f":"C10","v":{"$error":"#N/A"}},{"$f":"C10+(INDEX('Kalk Bausubstanz'!C34:E38,MATCH('Kalk Bausubstanz'!B38,'Kalk Bausubstanz'!B34:B38,0),MATCH(Daten!G7,'Kalk Bausubstanz'!C33:E33,0))*'Kalk Ergebnisse'!D5)/1000","v":{"$error":"#N/A"}},null,{"$f":"C10/D5*1000","v":{"$error":"#N/A"}},null,{"$f":"(E10-C10)/D5*1000","v":{"$error":"#N/A"}}]
[null,"Dämmung:",0,{"$f":"(SUMIFS('Kalk Dämmung'!E18:E20,'Kalk Dämmung'!B18:B20,Daten!G7)*SUMIFS('Kalk Dämmung'!K18:K19,'Kalk Dämmung'!I18:I19,Daten!G22)*D5)/1000","v":0},{"$f":"D11","v":0},null,null,{"$f":"(D11/D5)/SUMIFS('Kalk Dämmung'!E18:E20,'Kalk Dämmung'!B18:B20,Daten!G7)*1000","v":{"$error":"#DIV/0!"}}]
[null,"Nutzungsphase:",{"$f":"(Parameter!C33*D5*D4)/1000","v":0},{"$f":"(Parameter!D40*D5*D4)/1000","v":0},{"$f":"(Parameter!D41*D5*D4)/1000","v":0},null,{"$f":"C12/$D$5/$D$4*1000","v":{"$error":"#DIV/0!"}},{"$f":"D12/$D$5/$D$4*1000","v":{"$error":"#DIV/0!"}},{"$f":"E12/$D$5/$D$4*1000","v":{"$error":"#DIV/0!"}}]
[]
[null,null,"Bestand","Sanierung","Neubau",null,null,"Sanierung","Neubau"]
[null,"Bausubstanz",{"$f":"(C10+C11)","v":{"$error":"#N/A"}},{"$f":"(D10+D11)","v":{"$error":"#N/A"}},{"$f":"(E10+E11)","v":{"$error":"#N/A"}},null,"Bausubstanz",{"$f":"D15","v":{"$error":"#N/A"}},{"$f":"E15","v":{"$error":"#N/A"}}]
[null,"Nutzungsphase",{"$f":"C12","v":0},{"$f":"D12","v":0},{"$f":"E12","v":0},null,"Nutzungsphase",{"$f":"D16","v":0},{"$f":"E16","v":0}]
[null,null,null,null,null,null,"Summe",{"$f":"SUM(H15:H16)","v":{"$error":"#N/A"}},{"$f":"SUM(I15:I16)","v":{"$error":"#N/A"}}]
[]
[null,"Kalkulation PEB fossil [MWh]"]
[]
{"$rows_left_out":10}
{"sheet":"Kalk Nutz_Bestand","index":6,"n_rows":110,"n_cols":7,"rows_kept":110,"cut":false,"hidden":true,"merged":[[1,1,1,6]]}
[]
[null,"Kalkulation Nutzungsphase Bestand je m² BGF"]
[]
[]
[null,"Kürzel","Typ","Bauperiode","Heizsystem","Emissionen  [kgCO2/m²]","PEB fossil [kWh/m²]"]
[null,"EFH","Wohngebäude mit 1-2 Nutzeinheiten","1919-1944","Erdgas ",100.401,496.8]
[null,"EFH","Wohngebäude mit 1-2 Nutzeinheiten","1919-1944","Erdgas Brennwert ",95.658000000000001,473.3]
[null,"EFH","Wohngebäude mit 1-2 Nutzeinheiten","1919-1944","Heizöl ",135.92599999999999,543.79999999999995]
[null,"EFH","Wohngebäude mit 1-2 Nutzeinheiten","1919-1944","Holz ",10.443,67.900000000000006]
[null,"EFH","Wohngebäude mit 1-2 Nutzeinheiten","1919-1944","Fernwärme Erneuerbar",22.045000000000002,117.7]
[null,"EFH","Wohngebäude mit 1-2 Nutzeinheiten","1919-1944","Fernwärme Österreich-Mix",{"$f":"0.5*22.045+0.5*103.822","v":62.933500000000002},{"$f":"0.5*117.7+0.5*492.5","v":305.10000000000002}]
[null,"EFH","Wohngebäude mit 1-2 Nutzeinheiten","1919-1944","Wärmepumpe ",47.692,228.1]
[null,"EFH","Wohngebäude mit 1-2 Nutzeinheiten","1945-1960","Erdgas ",111.464,551.70000000000005]
[null,"EFH","Wohngebäude mit 1-2 Nutzeinheiten","1945-1960","Erdgas Brennwert ",106.22199999999999,525.70000000000005]
[null,"EFH","Wohngebäude mit 1-2 Nutzeinheiten","1945-1960","Heizöl ",150.16999999999999,599.29999999999995]
[null,"EFH","Wohngebäude mit 1-2 Nutzeinheiten","1945-1960","Holz ",8.8680000000000003,62]
[null,"EFH","Wohngebäude mit 1-2 Nutzeinheiten","1945-1960","Fernwärme Erneuerbar",24.152000000000001,129.30000000000001]
[null,"EFH","Wohngebäude mit 1-2 Nutzeinheiten","1945-1960","Fernwärme Österreich-Mix",{"$f":"0.5*24.152+0.5*115.767","v":69.959499999999991},{"$f":"0.5*129.3+0.5*549.2","v":339.25}]
[null,"EFH","Wohngebäude mit 1-2 Nutzeinheiten","1945-1960","Wärmepumpe ",52.765999999999998,252.4]
[null,"EFH","Wohngebäude mit 1-2 Nutzeinheiten","1961-1990","Erdgas ",81.665999999999997,404]
{"$rows_left_out":91}
{"sheet":"Kalk Nutz_Neu","index":7,"n_rows":65,"n_cols":7,"rows_kept":65,"cut":false,"hidden":true,"merged":[[1,1,1,6]]}
[]
[null,"Kalkulation Nutzungsphase Neu je m² BGF"]
[]
[]
[null,"Kürzel","Typ","Bauperiode","Heizsystem","Emissionen  [kgCO2/m²]","PEB fossil [kWh/m²]"]
[null,"EFH","Wohngebäude mit 1-2 Nutzeinheiten","bis 1918","Fernwärme Erneuerbar",8.2309999999999999,41.8]
[null,"EFH","Wohngebäude mit 1-2 Nutzeinheiten","bis 1918","Fernwärme Österreich-Mix",{"$f":"0.5*8.231+0.5*25.268","v":16.749500000000001},{"$f":"0.5*42.8+0.5*120","v":81.400000000000006}]
[null,"EFH","Wohngebäude mit 1-2 Nutzeinheiten","bis 1918","Holz ",6.01,32.4]
[null,"EFH","Wohngebäude mit 1-2 Nutzeinheiten","bis 1918","Wärmepumpe",{"$f":"AVERAGE(12.901,11.688)","v":12.294499999999999},{"$f":"AVERAGE(61.7,51.1)","v":56.400000000000006}]
[null,"EFH","Wohngebäude mit 1-2 Nutzeinheiten","1945-1960","Fernwärme Erneuerbar",8.2750000000000004,42.2]
[null,"EFH","Wohngebäude mit 1-2 Nutzeinheiten","1945-1960","Fernwärme Österreich-Mix",{"$f":"0.5*8.275+0.5*25.617","v":16.946000000000002},{"$f":"0.5*42.2+0.5*121.7","v":81.95}]
[null,"EFH","Wohngebäude mit 1-2 Nutzeinheiten","1945-1960","Holz ",5.5830000000000002,30.4]
[null,"EFH","Wohngebäude mit 1-2 Nutzeinheiten","1945-1960","Wärmepumpe",{"$f":"AVERAGE(13.028, 10.778)","v":11.903},{"$f":"AVERAGE(62.3, 51.5)","v":56.9}]
[null,"EFH","Wohngebäude mit 1-2 Nutzeinheiten","1961-1990","Fernwärme Erneuerbar",8.1579999999999995,41.5]
[null,"EFH","Wohngebäude mit 1-2 Nutzeinheiten","1961-1990","Fernwärme Österreich-Mix",{"$f":"0.5*8.158+0.5*24.955","v":16.5565},{"$f":"0.5*41.5+0.5*118.5","v":80}]
[null,"EFH","Wohngebäude mit 1-2 Nutzeinheiten","1961-1990","Holz ",5.9939999999999998,32.299999999999997]
[null,"EFH","Wohngebäude mit 1-2 Nutzeinheiten","1961-1990","Wärmepumpe",{"$f":"AVERAGE(12.788,10.607)","v":11.6975},{"$f":"AVERAGE(61.2,50.7)","v":55.95}]
[null,"EFH","Wohngebäude mit 1-2 Nutzeinheiten","1919-1944","Fernwärme Erneuerbar",8.2129999999999992,41.8]
[null,"EFH","Wohngebäude mit 1-2 Nutzeinheiten","1919-1944","Fernwärme Österreich-Mix",{"$f":"0.5*8.213+0.5*25.268","v":16.740500000000001},{"$f":"0.5*41.8+0.5*120","v":80.900000000000006}]
[null,"EFH","Wohngebäude mit 1-2 Nutzeinheiten","1919-1944","Holz ",6.01,32.4]
{"$rows_left_out":46}
{"sheet":"Kalk Dämmung","index":8,"n_rows":26,"n_cols":14,"rows_kept":26,"cut":false,"hidden":true,"merged":[[22,8,22,10],[23,8,23,10],[1,1,1,13],[16,8,16,10],[15,8,15,10],[16,1,16,4],[15,1,15,4]]}
[]
[null,"Kalkulation Dämmung je m² BGF"]
[]
[null,"Art","Größe","Anz Gesch","Höhe m","BGF m²","GF m2","Volumen m³","Hülle m²","Ch Länge m","San Dämmung m","Dämmung m³","Verhältnis Dämmung/BGF","Verhältnis Stock"]
[null,"EF","10/12m",2,10,240,120,648,477,1.36,0.16,{"$f":"I5*K5","v":76.320000000000007},{"$f":"L5/F5","v":0.318}]
[null,"EF II","10/12m",2,null,240,null,null,null,null,0.2,{"$f":"$I$5*K6","v":95.4},0.39750000000000002]
[null,"EF III","10/12m",2,null,240,null,null,null,null,0.24,{"$f":"I5*K7","v":114.47999999999999},0.47699999999999998]
[null,"MFH I","12/13m",3,null,{"$f":"G9*D8","v":468},null,973,717,1.76,0.2,{"$f":"K8*I8","v":143.4},0.30641025641025643]
[null,"MFH II","12/13m",4,16,624,{"$f":"F9/4","v":156},null,852,1.98,0.2,{"$f":"K9*I9","v":170.4},0.27307692307692311,{"$f":"L9/L8","v":1.1882845188284519}]
[null,"MGW I","13/42m",3,null,1638,{"$f":"F10/D10","v":546},4422,1983,2.23,0.2,{"$f":"K10*I10","v":396.6},0.24212454212454212]
[null,"MGW II","13/42m",4,null,{"$f":"G10*D11","v":2184},null,5897,2280,2.59,0.2,{"$f":"K11*I11","v":456},0.2087912087912088,{"$f":"L11/L10","v":1.1497730711043872}]
[null,"MGW III","13/42m",5,null,2730,null,7371,2577,2.86,0.2,{"$f":"K12*I12","v":515.4},0.18879120879120878,{"$f":"L12/L11","v":1.1302631578947369}]
[]
[]
[]
[null,"Dämmung",null,null,null,null,null,null,"Emissionsfaktor"]
[null,"[m³ Dämmung je m² BGF]",null,null,null,null,null,null," Dämmung [kg CO2e/m³ Dämmmaterial]",null,null,"Default"]
[" ","Wohngebäude mit 1-2 Nutzeinheiten",null,null,0.4,null,null,null,"Standard Dämmung",null,{"$f":"Parameter!C25","v":67},{"$f":"D25*F25","v":67}]
[" ","Wohngebäude mit 3-9 Nutzeinheiten",null,null,0.3,null,null,null,"Ökologische Dämmung ",null,{"$f":"Parameter!C26","v":60.42},{"$f":"D26*F26","v":60.42}]
[" ","Wohngebäude mit 10+ Nutzeinheiten",null,null,0.2]
{"$rows_left_out":7}
{"sheet":"Kalk Bausubstanz","index":9,"n_rows":48,"n_cols":17,"rows_kept":48,"cut":false,"hidden":true,"merged":[[1,1,1,16],[40,6,40,7],[41,6,41,7],[15,1,15,16],[40,2,40,4],[41,2,41,4],[20,21,25,21],[3,1,3,16],[30,2,30,4],[31,2,31,4],[31,6,31,7],[30,6,30,7],[31,10,31,11]]}
[]
[null,"Kalkulation Bausubstanz"]
[]
[null,"Bausubstanz [m³/m² BGF]"]
[]
[null,"Art","Wohngebäude mit 1-2 Nutzeinheiten","Wohngebäude mit 1-2 Nutzeinheiten2","Wohngebäude mit 1-2 Nutzeinheiten3","Wohngebäude mit 1-2 Nutzeinheiten4","Wohngebäude mit 1-2 Nutzeinheiten5","Wohngebäude mit 3-9 Nutzeinheiten","Wohngebäude mit 3-9 Nutzeinheiten2","Wohngebäude mit 3-9 Nutzeinheiten3","Wohngebäude mit 3-9 Nutzeinheiten4","Wohngebäude mit 3-9 Nutzeinheiten5","Wohngebäude mit 10+ Nutzeinheiten","Wohngebäude mit 10+ Nutzeinheiten2","Wohngebäude mit 10+ Nutzeinheiten3","Wohngebäude mit 10+ Nutzeinheiten4","Wohngebäude mit 10+ Nutzeinheiten5"]
[null,"Kürzel","EFH","EFH","EFH","EFH","EFH","MFH","MFH","MFH","MFH","MFH","MWB","MWB","MWB","MWB","MWB"]
[null,"Bauperiode","bis 1918","1919-1944","1945-1960","1961-1990","ab 1991","bis 1918","1919-1944","1945-1960","1961-1990","1991 bis","bis 1918","1919-1944","1945-1960","1961-1990","ab 1991"]
[null,"Holz",9.9671879396984922E-2,0,0,0,0.58281984000000009,8.4789371980676334E-2,0.14426005420054203,1.2115508021390377E-3,0,1.9980582524271845E-2,0.1692757347204161,0.10758498985801219,2.7979861796643643E-3,3.7650983746792144E-3,0]
[null,"Ziegel",0.49949748743718597,0.41209039548022597,0.24069078947368422,0,0,0.38096618357487927,0.35891598915989159,0.18088235294117644,0,0,0.37732119635890765,0.26125760649087221,0,0,0]
[null,"Beton",0.11595477386934673,0,0,0.49527950310559005,0,8.345410628019323E-2,0,0,0,0,0,8.3333333333333329E-2,0,0,0]
[null,"Stahl",5.5658291457286431E-3,0,0,0,0,0,0,0,0,0,0,0,0,0,0]
[null,"Glas",6.3754199569274932E-4,1.1127012106537531E-3,1.3637413533834583E-3,3.661935758651287E-3,5.3198262857142853E-3,8.4858523119392697E-4,6.0357723577235769E-4,8.166967150496561E-4,1.8624117049380203E-3,1.665509015256588E-3,7.8784321010588894E-4,7.2605042016806723E-4,1.8861001269214494E-3,2.5380227300501033E-3,1.8357600872410031E-3]
[null,"Stahlbeton",0,0.31728813559322033,0.31794407894736842,0.25838509316770186,0.37960000000000005,0,8.3265582655826564E-2,0.34969919786096254,0.38426742532005698,0.39750000000000002,0,0,0.23409674234945707,0.26682634730538923,0.35794529262086511]
[]
[null,"Bausubstanz [kg/m² BGF]"]
[]
[null,"Art","Wohngebäude mit 1-2 Nutzeinheiten","Wohngebäude mit 1-2 Nutzeinheiten2","Wohngebäude mit 1-2 Nutzeinheiten3","Wohngebäude mit 1-2 Nutzeinheiten4","Wohngebäude mit 1-2 Nutzeinheiten5","Wohngebäude mit 3-9 Nutzeinheiten","Wohngebäude mit 3-9 Nutzeinheiten2","Wohngebäude mit 3-9 Nutzeinheiten3","Wohngebäude mit 3-9 Nutzeinheiten4","Wohngebäude mit 3-9 Nutzeinheiten5","Wohngebäude mit 10+ Nutzeinheiten","Wohngebäude mit 10+ Nutzeinheiten2","Wohngebäude mit 10+ Nutzeinheiten3","Wohngebäude mit 10+ Nutzeinheiten4","Wohngebäude mit 10+ Nutzeinheiten5"]
[null,"Kürzel","EFH","EFH","EFH","EFH","EFH","MFH","MFH","MFH","MFH","MFH","MWB","MWB","MWB","MWB","MWB"]
[null,"Bauperiode","bis 1918","1919-1944","1945-1960","1961-1990","ab 1991","bis 1918","1919-1944","1945-1960","1961-1990","1991 bis","bis 1918","1919-1944","1945-1960","1961-1990","ab 1991"]
{"$rows_left_out":29}
{"sheet":"Quelle Bsp","index":10,"n_rows":48,"n_cols":5,"rows_kept":48,"cut":false,"hidden":true,"merged":[[7,4,10,8],[11,4,12,8],[47,4,54,8],[14,4,17,8],[19,4,22,8],[29,4,36,8],[38,4,45,8]]}
[]
[]
[]
[]
[]
[]
[]
[null,null,null,null,"https://www.ots.at/presseaussendung/OTS_20210423_OTS0078/jungwald-leistet-klimaschutz"]
[]
[]
[]
[]
[]
[]
[null,null,null,null,"https://www.umweltbundesamt.at/fileadmin/site/themen/mobilitaet/daten/ekz_fzkm_verkehrsmittel.pdf"]
[]
[]
[]
[]
[null,null,null,null,"https://co2calc.climateaustria.at/co2calculator/flightSubmitAirports"]
{"$rows_left_out":29}
{"sheet":"Listen","index":11,"n_rows":37,"n_cols":2,"rows_kept":37,"cut":false,"hidden":true,"merged":[]}
[]
[]
[null,"Bauperiode"]
[null,"bitte auswählen"]
[null,"bis 1918"]
[null,"1919-1944"]
[null,"1945-1960"]
[null,"1961-1990"]
[null,"ab 1991"]
[]
[null,"Gebäudeart"]
[null,"bitte auswählen"]
[null,"Wohngebäude mit 1-2 Nutzeinheiten"]
[null,"Wohngebäude mit 3-9 Nutzeinheiten"]
[null,"Wohngebäude mit 10+ Nutzeinheiten"]
[]
[null,"Dämmung:"]
[null,"bitte auswählen"]
[null,"Standard Dämmung"]
[null,"Ökologische Dämmung "]
{"$rows_left_out":18}
{"sheet":"Farben","index":12,"n_rows":68,"n_cols":31,"rows_kept":68,"cut":false,"hidden":true,"merged":[[1,2,1,19]]}
[]
[null,null,"Klimaaktiv Farben"]
[]
[]
[]
[null,null,"Primärfarben",null,null,null,null,"Funktionsfarben"]
[]
[null,null,null,0,0,0,null,null,239,244,247]
[null,null,null,230,50,15,null,null,228,235,240]
[null,null,null,225,50,15,null,null,217,227,232]
[null,null,null,167,39,2]
[null,null,null,null,null,null,null,null,246,244,240]
[null,null,null,null,null,null,null,null,240,236,232]
[null,null,null,null,null,null,null,null,233,228,223]
[]
[]
[]
[null,null,"ka Logo",null,null,null,null,"ka Logo 40%"]
[]
[null,null,null,252,215,0,null,null,251,237,168]
{"$rows_left_out":49}
{"sheet":"Lebenszyklus","index":13,"n_rows":19,"n_cols":18,"rows_kept":19,"cut":false,"hidden":true,"merged":[[9,4,14,4],[9,3,14,3],[9,2,14,2],[9,9,14,9],[9,8,14,8],[9,7,14,7],[9,6,14,6],[9,5,14,5],[5,17,5,18],[3,2,3,18],[6,17,7,18],[6,12,7,15],[9,15,14,15],[5,2,5,4],[5,5,5,6],[5,7,5,11],[6,2,7,4],[9,14,14,14],[9,13,14,13],[9,12,14,12],[9,11,14,11],[9,10,14,10],[8,17,12,18],[13,17,18,18],[6,5,7,6],[6,7,7,11],[16,7,16,11],[18,7,18,11],[5,12,5,15]]}
[]
[]
[]
[null,null,"Angaben zum Lebenszyklus des Gebäudes EN 15978"]
[]
[null,null,"A 1-3",null,null,"A 4-5",null,"B 1-7",null,null,null,null,"C1-4",null,null,null,null,"D"]
[null,null,"Herstellungsphase",null,null,"Errichtungs-phase",null,"Nutzungsphase",null,null,null,null,"Entsorgungsphase",null,null,null,null,"Ergänzende Informationen außerhabl des Gebäudezyklus"]
[]
[null,null,"A1","A2","A3","A4-5","A5","B1","B2","B3","B4","B5","C1","C2","C3","C4",null,"Vorteile und Belastungen außerhalb der Systemgrenze"]
[null,null,"Rohstoff-beschaffung","Transport","Produktion","Transport","Errichtung/Einbau","Nutzungsphase","Instandhaltung","Instandsetzung","Austausch","Modernisierung","Rückbau/Abriss","Transport","Abfallbehandlung","Beseitigung"]
[]
[]
[]
[null,null,null,null,null,null,null,null,null,null,null,null,null,null,null,null,null,"Potential für Wiederverwendung, Rückgewinnung und Recycling"]
[]
[]
[null,null,null,null,null,null,null,"B6 Energieverbrauch im Betrieb"]
[]
[null,null,null,null,null,null,null,"B7 Wasserverbrauch im Betrieb"]