{"text_format":"1","workbook":"xlsx","n_sheets":12,"sheets":["00_Start","01_StromListe","02_PinchKurven","03_WT_Prioritätenliste","05_WT_Auswahl","Annex CP-Werte","(hid) 03_WtRawList","(hid) 05_WtAuswahl","varHS","varCS","varHXfinder","99_Annex"],"not_rendered":{"charts":4,"images":6,"macros":1,"external_links":0,"defined_names":95,"comments":3,"pivot_tables":0},"unopened":[],"bounds":{"document_bytes":16777216,"sheet_cells":100000,"rows_first":2000,"rows_last":500,"rows_between":2000,"halvings":0,"cell_chars":16384,"cell_head_chars":4096},"cells_cut":0,"cells_raw":0,"read":"whole","date_system":"1900"}

{"sheet":"00_Start","index":0,"n_rows":47,"n_cols":1,"rows_kept":47,"cut":false,"hidden":false,"merged":[]}
[]
[]
[]
[]
[]
[]
[]
[]
[]
[]
[]
["klimaaktiv Pinch-Tool"]
["Das klimaaktiv Pinch-Tool ermöglicht eine sehr rasche und unkomplizierte Durchführung der Pinch-Analyse zur Bestimmung der optimalen Abwärmenutzung."]
["Das Tool bietet die Möglichkeit, basierend auf realen Betriebsdaten von Prozessströmen und Abwärmeströmen aus der Energieversorgung, ein \nWärmetauschernetzwerk zu kreieren und zu bewerten."]
[]
["Dazu unterstützt das Tool die Analyse in fünf Schritten:"]
["Schritt 1 Eingabe der Liste der Wärme- und Kälteströme über den Anwender"]
["Schritt 2 Darstellung der Pinch-Kurven"]
["Schritt 3 Vorschläge für die einzusetzenden Wärmetauscher "]
["Schritt 4 Möglichkeit zur manuellen Adaptierung der Wärmetauscher"]
["Schritt 5 Ökonomische und ökologische Bewertung der Wärmetauscher"]
[]
["Das klimaaktiv Pinch-Tool wurde im Programm „Energieeffiziente Betriebe\" erstellt. klimaaktiv ist die Klimaschutzinitiative des Bundesministeriums für Klimaschutz, Umwelt, Energie, Mobilität, Innovation und Technologie (BMK)."]
[]
["Strategische Gesamtkoordination"]
["Bundesministerium für Klimaschutz, Umwelt, Energie, Mobilität, Innovation und Technologie Abt. VII/3 – Nachhaltige Finanzen und Standortpolitik"]
[]
["Initiator und Auftraggeber"]
["Bundesministerium für Klimaschutz, Umwelt, Energie, Mobilität, Innovation und Technologie\nAbt. VII/3 Nachhaltige Finanzen und Standortpolitik"]
["Stubenbastei 5, 1010 Wien"]
[]
["Kontakt"]
["Programmmanagement klimaaktiv Energieeffiziente Betriebe"]
["Österreichische Energieagentur"]
["Mariahilferstraße 136\n+43 (0) 1 586 15 24 - 0 "]
["office@energyagency.at, eebetriebe@klimaaktiv.at, www.klimaaktiv.at/eebetriebe "]
[]
["Für den Inhalt verantwortlich"]
["Arbeitsgemeinschaft ERNEUERBARE ENERGIE GmbH"]
["Feldgasse 19"]
["8200 Gleisdorf"]
[]
["Stand: September 2014 "]
[]
["Urheberrecht und Haftungsausschluss"]
["Die Rechte am klimaaktiv Pinch-Tool liegen ausschließlich bei den Urhebern und dem Auftraggeber. Jede Vervielfältigung, Weitergabe, Integration in Websites ist nur mit Zustimmung des Auftraggebers zulässig."]
["Die Ergebnisse aus der Anwendung des Tools dienen lediglich zur Orientierung und gelten weder gegenüber Behörden noch Dritten als Nachweis oder Gutachten.Eine Haftung für direkte oder indirekte Schäden aufgrund der Nutzung dieses Tools und errechneter Ergebnisse wird hiermit ausdrücklich ausgeschlossen. "]

{"sheet":"01_StromListe","index":1,"n_rows":105,"n_cols":352,"rows_kept":105,"cut":false,"hidden":false,"merged":[[0,0,0,3]]}
["Schritt 1 / Stromliste"]
[1,2,3,4,5,6,7,8,9,10,11,12,13,14,15,16,17,18,19,20,21,22,23,24,25,26,27,null,null,null,null,null,null,null,null,null,null,null,null,null,null,null,null,null,null,null,null,null,null,null,null,null,null,null,null,null,null,null,null,null,null,null,null,null,null,null,null,null,null,null,null,null,null,null,null,null,null,null,null,null,null,null,null,null,null,null,null,null,null,null,null,null,null,null,null,null,null,null,null,null,null,null,null,null,null,null,null,null,null,null,null,null,null,null,null,null,null,null,null,null,null,null,null,null,null,null,null,null,null,null,null,null,null,null,null,null,null,null,null,null,null,null,null,null,null,null,null,null,null,null,null,null,null,null,null,null,null,null,null,null,null,null,null,null,null,null,null,null,null,null,null,null,null,null,null,null,null,null,null,null,null,null,null,null,null,null,null,null,null,null,null,null,null,null,null,null,null,null,null,null,null,null,null,null,null,null,null,null,null,null,null,null,null,null,null,null,null,null,null,null,null,null,null,null,null,null,null,null,null,null,null,null,null,null,null,null,null,null,null,null,null,null,null,null,null,null,null,null,null,null,"dTmin for Hot and Cold Composite Curves"]
["Strom ID","Heißer Strom ID","Kalter Strom ID","Strom Name","Start-Temperatur","End-Temperatur","Heiß/Kalt","Massenstrom","Spez.Wärmekapazität","m*cp (Produkt Massenstrom und spez. Wärmekapazität)","Spezifische Enthalpie","Leistung","Medium","heat transfer coefficient of fluid α","Start of operating time","End of operating time","Operating days per week","Operating weeks per year","Betriebs-\nstunden pro Jahr","Optionale Eingabe für jährliche Energie","Jährlich übertragbare Energie","Stromart","mcp hot","mcp cold","Rank of hot/cold mcp","Stream Name for sverweis","Check",null,null,null,null,null,null,null,"T CCC MIN",{"$f":"MIN(IF(($V$5:$V$104=\"Prozess\") * ($G$5:$G$104=\"cold\") * ($AA$5:$AA$104=1),$E$5:$E$104))","v":0},"°C",null,"Csum",null,{"$f":"SUM(AO7:AO106)","v":0},{"$f":"SUM(AP7:AP106)","v":0},{"$f":"SUM(AQ7:AQ106)","v":0},{"$f":"SUM(AR7:AR106)","v":0},0,0,0,0,0,0,0,0,0,0,0,0,0,{"$f":"SUM(BF7:BF106)","v":0},0,0,0,0,0,0,0,0,0,0,0,0,0,0,0,0,0,0,0,0,0,0,0,0,0,0,0,0,0,0,0,0,0,0,0,0,0,0,0,0,0,0,0,0,0,0,0,0,{"$f":"SUM(DC7:DC106)","v":0},0,0,0,0,0,0,0,0,0,0,0,0,0,0,0,0,0,0,0,0,0,0,0,0,0,0,0,0,0,0,0,0,0,{"$f":"SUM(EK7:EK106)","v":0},null,null,null,"Hsum",null,{"$f":"SUM(EQ7:EQ106)","v":0},{"$f":"SUM(ER7:ER106)","v":0},0,0,0,0,0,0,0,0,0,0,0,0,0,0,0,0,0,0,0,0,0,0,0,0,0,0,0,0,0,0,0,0,0,0,0,0,0,0,0,0,0,0,0,0,0,0,0,0,0,0,0,0,0,0,0,0,0,0,0,0,0,0,0,{"$f":"SUM(HD7:HD106)","v":0},0,0,0,0,0,0,0,0,0,0,0,0,0,0,0,0,0,0,0,0,0,0,0,0,0,0,0,0,0,0,0,0,0,0,{"$f":"SUM(IM7:IM106)","v":0}]
[null,null,null,null,"[°C]","[°C]",null,"[kg/s]","[kJ/kg.K]","[kJ/K.s]","[kJ/kg]","[kW]",null,"[W/m².K]","[hh:mm]","[hh:mm]","[d]","[w]","[h/Jahr]","[MWh/Jahr]","[MWh/Jahr]",null,null,null,null,null,null,null,null,null,null,null,null,null,"T CCC MAX",{"$f":"MAX(IF(($V$5:$V$104=\"Prozess\") * ($G$5:$G$104=\"cold\") * ($AA$5:$AA$104=1),$F$5:$F$104))","v":0},"°C",null,"Csumacc",null,{"$f":"AO3+AN4+PinchLoadShift","v":0},{"$f":"AP3+AO4","v":0},{"$f":"AQ3+AP4","v":0},0,0,0,0,0,0,0,0,0,0,0,0,0,0,0,0,0,0,0,0,0,0,0,0,0,0,0,0,0,0,0,0,0,0,0,0,0,0,0,0,0,0,0,0,0,0,0,0,0,0,0,0,0,0,0,0,0,0,0,0,0,0,0,{"$f":"DC3+DB4","v":0},0,0,0,0,0,0,0,0,0,0,0,0,0,0,0,0,0,0,0,0,0,0,0,0,0,0,0,0,0,0,0,0,{"$f":"EJ3+EI4","v":0},{"$f":"EK3+EJ4","v":0},null,null,null,"Hsumacc",null,{"$f":"EQ3+EP4","v":0},0,0,0,0,0,0,0,0,0,0,0,0,0,0,0,0,0,0,0,0,0,0,0,0,0,0,0,0,0,0,0,{"$f":"FW3+FV4","v":0},0,0,0,0,0,0,0,0,0,0,0,0,0,0,0,0,0,0,0,0,0,0,0,0,0,0,0,0,0,0,0,{"$f":"HC3+HB4","v":0},0,0,0,0,0,0,0,0,0,0,0,0,0,0,0,0,0,0,0,0,0,0,0,0,0,0,0,0,0,0,0,{"$f":"II3+IH4","v":0},0,0,0,0,null,null,null,"H",{"$f":"AJ9","v":0},{"$f":"IR4+($AJ$10-$AJ$9)/100","v":0},{"$f":"IS4+($AJ$10-$AJ$9)/100","v":0},0,0,0,0,0,0,0,0,0,0,0,0,0,0,0,0,0,0,0,0,0,0,0,0,0,0,0,0,0,0,{"$f":"JX4+($AJ$10-$AJ$9)/100","v":0},0,0,0,0,0,0,0,0,0,0,0,0,0,0,0,0,0,0,0,0,0,0,0,0,0,0,0,0,0,0,0,{"$f":"LD4+($AJ$10-$AJ$9)/100","v":0},0,0,0,0,0,0,0,0,0,0,0,0,0,0,0,0,0,0,0,0,0,0,0,0,0,0,0,0,0,0,0,0,0,0,0]
[1,{"$f":"IF(G5=\"hot\",COUNTIF($G$5:G5,\"hot\"),\"\")","v":1},{"$f":"IF(G5=\"cold\",COUNTIF($G$5:G5,\"cold\"),\"\")","v":""},null,null,null,{"$f":"IF(A5=\"\",\"\",IF(E5<F5,\"cold\",\"hot\"))","v":"hot"},null,null,{"$f":"IF(A5=\"\",\"\",IF(T5=\"\",H5*I5,ABS(U5/S5*1000/(E5-F5))))","v":0},{"$f":"IF(A5=\"\",\"\",ABS(I5*(F5-E5)))","v":0},{"$f":"IF(A5=\"\",\"\",IF(T5=\"\",K5*H5,U5/S5*1000))","v":0},null,null,23,1,5,48,null,null,{"$f":"IF(A5=\"\",\"\",IF(T5=\"\",S5*L5/1000,T5))","v":0},null,{"$f":"IF(G5=\"hot\",J5,\"\")","v":0},{"$f":"IF(G5=\"cold\",J5,\"\")","v":""},{"$f":"IF(G5=\"\",\"\",IF(G5=\"hot\",_xlfn.RANK.EQ(W5,$W$5:$W$104),_xlfn.RANK.EQ(X5,$X$5:$X$104)))","v":1},{"$f":"IF(D5=\"\",\"\",D5)","v":""},{"$f":"IF(D5=\"\",\"\",IF(AND(ISNUMBER(E5),ISNUMBER(F5),ISNUMBER(I5),ISNUMBER(S5),ISTEXT(D5),ISTEXT(V5),OR(ISNUMBER(H5),ISNUMBER(T5)),E5<>F5,E5>0,F5>0,I5>0,S5>0,OR(H5>0,T5>0))=TRUE,1,0))","v":""},null,null,null,null,null,null,null,null,null,null,null,null,null,{"$f":"AO6+dTminActual/2","v":0},0,0,0,0,0,0,0,0,0,0,0,0,0,0,0,0,0,0,0,0,0,0,0,0,0,0,0,0,0,0,0,{"$f":"BU6+dTminActual/2","v":0},0,0,0,0,0,0,0,0,0,0,0,0,0,0,0,0,0,0,0,0,0,0,0,0,0,0,0,0,0,0,0,{"$f":"DA6+dTminActual/2","v":0},0,0,0,0,0,0,0,0,0,0,0,0,0,0,0,0,0,0,0,0,0,0,0,0,0,0,0,0,0,0,0,{"$f":"EG6+dTminActual/2","v":0},{"$f":"EH6+dTminActual/2","v":0},{"$f":"EI6+dTminActual/2","v":0},{"$f":"EJ6+dTminActual/2","v":0},{"$f":"EK6+dTminActual/2","v":0},null,null,null,null,null,{"$f":"EQ6-dTminActual/2","v":0},0,0,0,0,0,0,0,0,0,0,0,0,0,0,0,0,0,0,0,0,0,0,0,0,0,0,0,0,0,0,0,{"$f":"FW6-dTminActual/2","v":0},0,0,0,0,0,0,0,0,0,0,0,0,0,0,0,0,0,0,0,0,0,0,0,0,0,0,0,0,0,0,0,{"$f":"HC6-dTminActual/2","v":0},0,0,0,0,0,0,0,0,0,0,0,0,0,0,0,0,0,0,0,0,0,0,0,0,0,0,0,0,0,0,0,{"$f":"II6-dTminActual/2","v":0},{"$f":"IJ6-dTminActual/2","v":0},{"$f":"IK6-dTminActual/2","v":0},{"$f":"IL6-dTminActual/2","v":0},{"$f":"IM6-dTminActual/2","v":0},null,null,null,"T CCC",{"$f":"IF(OR(IR4<$AJ$18,IR4>$AJ$17),\"\",HLOOKUP(IR4,$AN$4:$EK$6,3,TRUE))","v":0},{"$f":"IF(OR(IS4<$AJ$18,IR4>$AJ$17),\"\",HLOOKUP(IS4,$AN$4:$EK$6,3,TRUE))","v":0},0,0,0,{"$f":"IF(OR(IW4<$AJ$18,IV4>$AJ$17),\"\",HLOOKUP(IW4,$AN$4:$EK$6,3,TRUE))","v":0},{"$f":"IF(OR(IX4<$AJ$18,IW4>$AJ$17),\"\",HLOOKUP(IX4,$AN$4:$EK$6,3,TRUE))","v":0},{"$f":"IF(OR(IY4<$AJ$18,IX4>$AJ$17),\"\",HLOOKUP(IY4,$AN$4:$EK$6,3,TRUE))","v":0},{"$f":"IF(OR(IZ4<$AJ$18,IY4>$AJ$17),\"\",HLOOKUP(IZ4,$AN$4:$EK$6,3,TRUE))","v":0},{"$f":"IF(OR(JA4<$AJ$18,IZ4>$AJ$17),\"\",HLOOKUP(JA4,$AN$4:$EK$6,3,TRUE))","v":0},{"$f":"IF(OR(JB4<$AJ$18,JA4>$AJ$17),\"\",HLOOKUP(JB4,$AN$4:$EK$6,3,TRUE))","v":0},{"$f":"IF(OR(JC4<$AJ$18,JB4>$AJ$17),\"\",HLOOKUP(JC4,$AN$4:$EK$6,3,TRUE))","v":0},{"$f":"IF(OR(JD4<$AJ$18,JC4>$AJ$17),\"\",HLOOKUP(JD4,$AN$4:$EK$6,3,TRUE))","v":0},{"$f":"IF(OR(JE4<$AJ$18,JD4>$AJ$17),\"\",HLOOKUP(JE4,$AN$4:$EK$6,3,TRUE))","v":0},{"$f":"IF(OR(JF4<$AJ$18,JE4>$AJ$17),\"\",HLOOKUP(JF4,$AN$4:$EK$6,3,TRUE))","v":0},{"$f":"IF(OR(JG4<$AJ$18,JF4>$AJ$17),\"\",HLOOKUP(JG4,$AN$4:$EK$6,3,TRUE))","v":0},{"$f":"IF(OR(JH4<$AJ$18,JG4>$AJ$17),\"\",HLOOKUP(JH4,$AN$4:$EK$6,3,TRUE))","v":0},{"$f":"IF(OR(JI4<$AJ$18,JH4>$AJ$17),\"\",HLOOKUP(JI4,$AN$4:$EK$6,3,TRUE))","v":0},{"$f":"IF(OR(JJ4<$AJ$18,JI4>$AJ$17),\"\",HLOOKUP(JJ4,$AN$4:$EK$6,3,TRUE))","v":0},{"$f":"IF(OR(JK4<$AJ$18,JJ4>$AJ$17),\"\",HLOOKUP(JK4,$AN$4:$EK$6,3,TRUE))","v":0},{"$f":"IF(OR(JL4<$AJ$18,JK4>$AJ$17),\"\",HLOOKUP(JL4,$AN$4:$EK$6,3,TRUE))","v":0},{"$f":"IF(OR(JM4<$AJ$18,JL4>$AJ$17),\"\",HLOOKUP(JM4,$AN$4:$EK$6,3,TRUE))","v":0},{"$f":"IF(OR(JN4<$AJ$18,JM4>$AJ$17),\"\",HLOOKUP(JN4,$AN$4:$EK$6,3,TRUE))","v":0},{"$f":"IF(OR(JO4<$AJ$18,JN4>$AJ$17),\"\",HLOOKUP(JO4,$AN$4:$EK$6,3,TRUE))","v":0},{"$f":"IF(OR(JP4<$AJ$18,JO4>$AJ$17),\"\",HLOOKUP(JP4,$AN$4:$EK$6,3,TRUE))","v":0},{"$f":"IF(OR(JQ4<$AJ$18,JP4>$AJ$17),\"\",HLOOKUP(JQ4,$AN$4:$EK$6,3,TRUE))","v":0},{"$f":"IF(OR(JR4<$AJ$18,JQ4>$AJ$17),\"\",HLOOKUP(JR4,$AN$4:$EK$6,3,TRUE))","v":0},{"$f":"IF(OR(JS4<$AJ$18,JR4>$AJ$17),\"\",HLOOKUP(JS4,$AN$4:$EK$6,3,TRUE))","v":0},{"$f":"IF(OR(JT4<$AJ$18,JS4>$AJ$17),\"\",HLOOKUP(JT4,$AN$4:$EK$6,3,TRUE))","v":0},{"$f":"IF(OR(JU4<$AJ$18,JT4>$AJ$17),\"\",HLOOKUP(JU4,$AN$4:$EK$6,3,TRUE))","v":0},{"$f":"IF(OR(JV4<$AJ$18,JU4>$AJ$17),\"\",HLOOKUP(JV4,$AN$4:$EK$6,3,TRUE))","v":0},{"$f":"IF(OR(JW4<$AJ$18,JV4>$AJ$17),\"\",HLOOKUP(JW4,$AN$4:$EK$6,3,TRUE))","v":0},{"$f":"IF(OR(JX4<$AJ$18,JW4>$AJ$17),\"\",HLOOKUP(JX4,$AN$4:$EK$6,3,TRUE))","v":0},{"$f":"IF(OR(JY4<$AJ$18,JX4>$AJ$17),\"\",HLOOKUP(JY4,$AN$4:$EK$6,3,TRUE))","v":0},{"$f":"IF(OR(JZ4<$AJ$18,JY4>$AJ$17),\"\",HLOOKUP(JZ4,$AN$4:$EK$6,3,TRUE))","v":0},{"$f":"IF(OR(KA4<$AJ$18,JZ4>$AJ$17),\"\",HLOOKUP(KA4,$AN$4:$EK$6,3,TRUE))","v":0},{"$f":"IF(OR(KB4<$AJ$18,KA4>$AJ$17),\"\",HLOOKUP(KB4,$AN$4:$EK$6,3,TRUE))","v":0},{"$f":"IF(OR(KC4<$AJ$18,KB4>$AJ$17),\"\",HLOOKUP(KC4,$AN$4:$EK$6,3,TRUE))","v":0},{"$f":"IF(OR(KD4<$AJ$18,KC4>$AJ$17),\"\",HLOOKUP(KD4,$AN$4:$EK$6,3,TRUE))","v":0},{"$f":"IF(OR(KE4<$AJ$18,KD4>$AJ$17),\"\",HLOOKUP(KE4,$AN$4:$EK$6,3,TRUE))","v":0},{"$f":"IF(OR(KF4<$AJ$18,KE4>$AJ$17),\"\",HLOOKUP(KF4,$AN$4:$EK$6,3,TRUE))","v":0},{"$f":"IF(OR(KG4<$AJ$18,KF4>$AJ$17),\"\",HLOOKUP(KG4,$AN$4:$EK$6,3,TRUE))","v":0},{"$f":"IF(OR(KH4<$AJ$18,KG4>$AJ$17),\"\",HLOOKUP(KH4,$AN$4:$EK$6,3,TRUE))","v":0},{"$f":"IF(OR(KI4<$AJ$18,KH4>$AJ$17),\"\",HLOOKUP(KI4,$AN$4:$EK$6,3,TRUE))","v":0},{"$f":"IF(OR(KJ4<$AJ$18,KI4>$AJ$17),\"\",HLOOKUP(KJ4,$AN$4:$EK$6,3,TRUE))","v":0},{"$f":"IF(OR(KK4<$AJ$18,KJ4>$AJ$17),\"\",HLOOKUP(KK4,$AN$4:$EK$6,3,TRUE))","v":0},{"$f":"IF(OR(KL4<$AJ$18,KK4>$AJ$17),\"\",HLOOKUP(KL4,$AN$4:$EK$6,3,TRUE))","v":0},{"$f":"IF(OR(KM4<$AJ$18,KL4>$AJ$17),\"\",HLOOKUP(KM4,$AN$4:$EK$6,3,TRUE))","v":0},{"$f":"IF(OR(KN4<$AJ$18,KM4>$AJ$17),\"\",HLOOKUP(KN4,$AN$4:$EK$6,3,TRUE))","v":0},{"$f":"IF(OR(KO4<$AJ$18,KN4>$AJ$17),\"\",HLOOKUP(KO4,$AN$4:$EK$6,3,TRUE))","v":0},{"$f":"IF(OR(KP4<$AJ$18,KO4>$AJ$17),\"\",HLOOKUP(KP4,$AN$4:$EK$6,3,TRUE))","v":0},{"$f":"IF(OR(KQ4<$AJ$18,KP4>$AJ$17),\"\",HLOOKUP(KQ4,$AN$4:$EK$6,3,TRUE))","v":0},{"$f":"IF(OR(KR4<$AJ$18,KQ4>$AJ$17),\"\",HLOOKUP(KR4,$AN$4:$EK$6,3,TRUE))","v":0},{"$f":"IF(OR(KS4<$AJ$18,KR4>$AJ$17),\"\",HLOOKUP(KS4,$AN$4:$EK$6,3,TRUE))","v":0},{"$f":"IF(OR(KT4<$AJ$18,KS4>$AJ$17),\"\",HLOOKUP(KT4,$AN$4:$EK$6,3,TRUE))","v":0},{"$f":"IF(OR(KU4<$AJ$18,KT4>$AJ$17),\"\",HLOOKUP(KU4,$AN$4:$EK$6,3,TRUE))","v":0},{"$f":"IF(OR(KV4<$AJ$18,KU4>$AJ$17),\"\",HLOOKUP(KV4,$AN$4:$EK$6,3,TRUE))","v":0},{"$f":"IF(OR(KW4<$AJ$18,KV4>$AJ$17),\"\",HLOOKUP(KW4,$AN$4:$EK$6,3,TRUE))","v":0},{"$f":"IF(OR(KX4<$AJ$18,KW4>$AJ$17),\"\",HLOOKUP(KX4,$AN$4:$EK$6,3,TRUE))","v":0},{"$f":"IF(OR(KY4<$AJ$18,KX4>$AJ$17),\"\",HLOOKUP(KY4,$AN$4:$EK$6,3,TRUE))","v":0},{"$f":"IF(OR(KZ4<$AJ$18,KY4>$AJ$17),\"\",HLOOKUP(KZ4,$AN$4:$EK$6,3,TRUE))","v":0},{"$f":"IF(OR(LA4<$AJ$18,KZ4>$AJ$17),\"\",HLOOKUP(LA4,$AN$4:$EK$6,3,TRUE))","v":0},{"$f":"IF(OR(LB4<$AJ$18,LA4>$AJ$17),\"\",HLOOKUP(LB4,$AN$4:$EK$6,3,TRUE))","v":0},{"$f":"IF(OR(LC4<$AJ$18,LB4>$AJ$17),\"\",HLOOKUP(LC4,$AN$4:$EK$6,3,TRUE))","v":0},{"$f":"IF(OR(LD4<$AJ$18,LC4>$AJ$17),\"\",HLOOKUP(LD4,$AN$4:$EK$6,3,TRUE))","v":0},{"$f":"IF(OR(LE4<$AJ$18,LD4>$AJ$17),\"\",HLOOKUP(LE4,$AN$4:$EK$6,3,TRUE))","v":0},{"$f":"IF(OR(LF4<$AJ$18,LE4>$AJ$17),\"\",HLOOKUP(LF4,$AN$4:$EK$6,3,TRUE))","v":0},{"$f":"IF(OR(LG4<$AJ$18,LF4>$AJ$17),\"\",HLOOKUP(LG4,$AN$4:$EK$6,3,TRUE))","v":0},{"$f":"IF(OR(LH4<$AJ$18,LG4>$AJ$17),\"\",HLOOKUP(LH4,$AN$4:$EK$6,3,TRUE))","v":0},{"$f":"IF(OR(LI4<$AJ$18,LH4>$AJ$17),\"\",HLOOKUP(LI4,$AN$4:$EK$6,3,TRUE))","v":0},{"$f":"IF(OR(LJ4<$AJ$18,LI4>$AJ$17),\"\",HLOOKUP(LJ4,$AN$4:$EK$6,3,TRUE))","v":0},{"$f":"IF(OR(LK4<$AJ$18,LJ4>$AJ$17),\"\",HLOOKUP(LK4,$AN$4:$EK$6,3,TRUE))","v":0},{"$f":"IF(OR(LL4<$AJ$18,LK4>$AJ$17),\"\",HLOOKUP(LL4,$AN$4:$EK$6,3,TRUE))","v":0},{"$f":"IF(OR(LM4<$AJ$18,LL4>$AJ$17),\"\",HLOOKUP(LM4,$AN$4:$EK$6,3,TRUE))","v":0},{"$f":"IF(OR(LN4<$AJ$18,LM4>$AJ$17),\"\",HLOOKUP(LN4,$AN$4:$EK$6,3,TRUE))","v":0},{"$f":"IF(OR(LO4<$AJ$18,LN4>$AJ$17),\"\",HLOOKUP(LO4,$AN$4:$EK$6,3,TRUE))","v":0},{"$f":"IF(OR(LP4<$AJ$18,LO4>$AJ$17),\"\",HLOOKUP(LP4,$AN$4:$EK$6,3,TRUE))","v":0},{"$f":"IF(OR(LQ4<$AJ$18,LP4>$AJ$17),\"\",HLOOKUP(LQ4,$AN$4:$EK$6,3,TRUE))","v":0},{"$f":"IF(OR(LR4<$AJ$18,LQ4>$AJ$17),\"\",HLOOKUP(LR4,$AN$4:$EK$6,3,TRUE))","v":0},{"$f":"IF(OR(LS4<$AJ$18,LR4>$AJ$17),\"\",HLOOKUP(LS4,$AN$4:$EK$6,3,TRUE))","v":0},{"$f":"IF(OR(LT4<$AJ$18,LS4>$AJ$17),\"\",HLOOKUP(LT4,$AN$4:$EK$6,3,TRUE))","v":0},{"$f":"IF(OR(LU4<$AJ$18,LT4>$AJ$17),\"\",HLOOKUP(LU4,$AN$4:$EK$6,3,TRUE))","v":0},{"$f":"IF(OR(LV4<$AJ$18,LU4>$AJ$17),\"\",HLOOKUP(LV4,$AN$4:$EK$6,3,TRUE))","v":0},{"$f":"IF(OR(LW4<$AJ$18,LV4>$AJ$17),\"\",HLOOKUP(LW4,$AN$4:$EK$6,3,TRUE))","v":0},{"$f":"IF(OR(LX4<$AJ$18,LW4>$AJ$17),\"\",HLOOKUP(LX4,$AN$4:$EK$6,3,TRUE))","v":0},{"$f":"IF(OR(LY4<$AJ$18,LX4>$AJ$17),\"\",HLOOKUP(LY4,$AN$4:$EK$6,3,TRUE))","v":0},{"$f":"IF(OR(LZ4<$AJ$18,LY4>$AJ$17),\"\",HLOOKUP(LZ4,$AN$4:$EK$6,3,TRUE))","v":0},{"$f":"IF(OR(MA4<$AJ$18,LZ4>$AJ$17),\"\",HLOOKUP(MA4,$AN$4:$EK$6,3,TRUE))","v":0},{"$f":"IF(OR(MB4<$AJ$18,MA4>$AJ$17),\"\",HLOOKUP(MB4,$AN$4:$EK$6,3,TRUE))","v":0},{"$f":"IF(OR(MC4<$AJ$18,MB4>$AJ$17),\"\",HLOOKUP(MC4,$AN$4:$EK$6,3,TRUE))","v":0},{"$f":"IF(OR(MD4<$AJ$18,MC4>$AJ$17),\"\",HLOOKUP(MD4,$AN$4:$EK$6,3,TRUE))","v":0},{"$f":"IF(OR(ME4<$AJ$18,MD4>$AJ$17),\"\",HLOOKUP(ME4,$AN$4:$EK$6,3,TRUE))","v":0},{"$f":"IF(OR(MF4<$AJ$18,ME4>$AJ$17),\"\",HLOOKUP(MF4,$AN$4:$EK$6,3,TRUE))","v":0},{"$f":"IF(OR(MG4<$AJ$18,MF4>$AJ$17),\"\",HLOOKUP(MG4,$AN$4:$EK$6,3,TRUE))","v":0},{"$f":"IF(OR(MH4<$AJ$18,MG4>$AJ$17),\"\",HLOOKUP(MH4,$AN$4:$EK$6,3,TRUE))","v":0},{"$f":"IF(OR(MI4<$AJ$18,MH4>$AJ$17),\"\",HLOOKUP(MI4,$AN$4:$EK$6,3,TRUE))","v":0},{"$f":"IF(OR(MJ4<$AJ$18,MI4>$AJ$17),\"\",HLOOKUP(MJ4,$AN$4:$EK$6,3,TRUE))","v":0},{"$f":"IF(OR(MK4<$AJ$18,MJ4>$AJ$17),\"\",HLOOKUP(MK4,$AN$4:$EK$6,3,TRUE))","v":0},{"$f":"IF(OR(ML4<$AJ$18,MK4>$AJ$17),\"\",HLOOKUP(ML4,$AN$4:$EK$6,3,TRUE))","v":0},{"$f":"IF(OR(MM4<$AJ$18,ML4>$AJ$17),\"\",HLOOKUP(MM4,$AN$4:$EK$6,3,TRUE))","v":0},{"$f":"IF(OR(MN4<$AJ$18,MM4>$AJ$17),\"\",HLOOKUP(MN4,$AN$4:$EK$6,3,TRUE))","v":0}]
[{"$f":"IF(D6=\"\",\"\",A5+1)","v":""},{"$f":"IF(G6=\"hot\",COUNTIF($G$5:G6,\"hot\"),\"\")","v":""},{"$f":"IF(G6=\"cold\",COUNTIF($G$5:G6,\"cold\"),\"\")","v":""},null,null,null,{"$f":"IF(A6=\"\",\"\",IF(E6<F6,\"cold\",\"hot\"))","v":""},null,null,{"$f":"IF(A6=\"\",\"\",IF(T6=\"\",H6*I6,ABS(U6/S6*1000/(E6-F6))))","v":""},{"$f":"IF(A6=\"\",\"\",ABS(I6*(F6-E6)))","v":""},{"$f":"IF(A6=\"\",\"\",IF(T6=\"\",K6*H6,U6/S6*1000))","v":""},null,null,12,22,2,20,null,null,{"$f":"IF(A6=\"\",\"\",IF(T6=\"\",S6*L6/1000,T6))","v":""},null,"","","","",{"$f":"IF(D6=\"\",\"\",IF(AND(ISNUMBER(E6),ISNUMBER(F6),ISNUMBER(I6),ISNUMBER(S6),ISTEXT(D6),ISTEXT(V6),OR(ISNUMBER(H6),ISNUMBER(T6)),E6<>F6,E6>0,F6>0,I6>0,S6>0,OR(H6>0,T6>0))=TRUE,1,0))","v":""},null,null,null,null,null,null,null,"T HCC MIN",{"$f":"MIN(IF(($V$5:$V$104=\"Prozess\") * ($G$5:$G$104=\"hot\")* ($AA$5:$AA$104=1),$F$5:$F$104))","v":0},"°C",null,"T",null,{"$f":"AJ3","v":0},{"$f":"AO6+($AJ$4-$AJ$3)/100","v":0},{"$f":"AP6+($AJ$4-$AJ$3)/100","v":0},0,0,0,0,0,0,0,0,0,0,0,0,0,0,0,0,0,0,0,0,0,0,0,0,0,0,0,0,0,0,0,0,0,0,0,0,0,0,0,0,0,0,0,0,0,0,0,0,0,0,0,0,0,0,0,0,0,0,0,0,0,0,0,{"$f":"DB6+($AJ$4-$AJ$3)/100","v":0},0,0,0,0,0,0,0,0,0,0,0,0,0,0,0,0,0,0,0,0,0,0,0,0,0,0,0,0,0,0,0,0,0,0,null,null,null,"T",null,{"$f":"AJ6","v":0},{"$f":"EQ6+($AJ$7-$AJ$6)/100","v":0},{"$f":"ER6+($AJ$7-$AJ$6)/100","v":0},0,0,0,0,0,0,0,0,0,0,0,0,0,0,0,0,0,0,0,0,0,0,0,0,0,0,0,0,0,0,0,0,0,0,0,0,0,0,0,0,0,0,0,0,0,0,0,0,0,0,0,0,0,0,0,0,0,0,0,0,0,0,0,{"$f":"HD6+($AJ$7-$AJ$6)/100","v":0},0,0,0,0,0,0,0,0,0,0,0,0,0,0,0,0,0,0,0,0,0,0,0,0,0,0,0,0,0,0,0,0,0,0,null,null,null,"T HCC",{"$f":"IF(OR(IR4<$AJ$20,IR4>$AJ$19),\"\",HLOOKUP(IR4,$EP$4:$IM$6,3,TRUE))","v":0},0,0,0,0,0,0,0,0,0,0,0,0,0,0,0,0,0,0,0,0,0,0,0,0,0,0,0,0,0,0,0,{"$f":"IF(OR(JX4<$AJ$20,JX4>$AJ$19),\"\",HLOOKUP(JX4,$EP$4:$IM$6,3,TRUE))","v":0},0,0,0,0,0,0,0,0,0,0,0,0,0,0,0,0,0,0,0,0,0,0,0,0,0,0,0,0,0,0,0,{"$f":"IF(OR(LD4<$AJ$20,LD4>$AJ$19),\"\",HLOOKUP(LD4,$EP$4:$IM$6,3,TRUE))","v":0},0,0,0,0,0,0,0,0,0,0,0,0,0,0,0,0,0,0,0,0,0,0,0,0,0,0,0,0,0,0,0,0,0,0,0,0]
["",{"$f":"IF(G7=\"hot\",COUNTIF($G$5:G7,\"hot\"),\"\")","v":""},{"$f":"IF(G7=\"cold\",COUNTIF($G$5:G7,\"cold\"),\"\")","v":""},null,null,null,"",null,null,"","","",null,null,10,20,5,7,null,null,"",null,"","","","","",null,null,null,null,null,null,null,"T HCC MAX",{"$f":"MAX(IF(($V$5:$V$104=\"Prozess\") * ($G$5:$G$104=\"hot\") * ($AA$5:$AA$104=1),$E$5:$E$104))","v":0},"°C",null,{"$f":"D5","v":0},null,{"$f":"IF(OR($V5=\"Utility\",$AA5=0),\"x\",IF($G5=\"hot\",\"x\",IF(AND(AO$6>$E5,AN$6<$F5),IF(AN$6>$E5,IF(AO$6>$F5,$U5/($F5-$E5)*($F5-AN$6),$U5/($F5-$E5)*(AO$6-AN$6)),$U5/($F5-$E5)*(AO$6-$E5)),\"x\")))","v":"x"},"x","x","x","x","x","x","x","x","x","x","x","x","x","x","x","x","x","x","x","x","x","x","x","x","x","x","x","x","x","x","x",{"$f":"IF(OR($V5=\"Utility\",$AA5=0),\"x\",IF($G5=\"hot\",\"x\",IF(AND(BU$6>$E5,BT$6<$F5),IF(BT$6>$E5,IF(BU$6>$F5,$U5/($F5-$E5)*($F5-BT$6),$U5/($F5-$E5)*(BU$6-BT$6)),$U5/($F5-$E5)*(BU$6-$E5)),\"x\")))","v":"x"},"x","x","x","x","x","x","x","x","x","x","x","x","x","x","x","x","x","x","x","x","x","x","x","x","x","x","x","x","x","x","x",{"$f":"IF(OR($V5=\"Utility\",$AA5=0),\"x\",IF($G5=\"hot\",\"x\",IF(AND(DA$6>$E5,CZ$6<$F5),IF(CZ$6>$E5,IF(DA$6>$F5,$U5/($F5-$E5)*($F5-CZ$6),$U5/($F5-$E5)*(DA$6-CZ$6)),$U5/($F5-$E5)*(DA$6-$E5)),\"x\")))","v":"x"},"x","x","x","x","x","x","x","x","x","x","x","x","x","x","x","x","x","x","x","x","x","x","x","x","x","x","x","x","x","x","x","x","x","x","x","x",null,null,null,{"$f":"D5","v":0},null,{"$f":"IF(OR($V5=\"Utility\",$AA5=0),\"x\",IF($G5=\"cold\",\"x\",IF(AND(EQ$6>$F5,EP$6<$E5),IF(EP$6>$F5,IF(EQ$6>$E5,$U5/($E5-$F5)*($E5-EP$6),$U5/($E5-$F5)*(EQ$6-EP$6)),$U5/($E5-$F5)*(EQ$6-$F5)),\"x\")))","v":"x"},"x","x","x","x","x","x","x","x","x","x","x","x","x","x","x","x","x","x","x","x","x","x","x","x","x","x","x","x","x","x","x",{"$f":"IF(OR($V5=\"Utility\",$AA5=0),\"x\",IF($G5=\"cold\",\"x\",IF(AND(FW$6>$F5,FV$6<$E5),IF(FV$6>$F5,IF(FW$6>$E5,$U5/($E5-$F5)*($E5-FV$6),$U5/($E5-$F5)*(FW$6-FV$6)),$U5/($E5-$F5)*(FW$6-$F5)),\"x\")))","v":"x"},"x","x","x","x","x","x","x","x","x","x","x","x","x","x","x","x","x","x","x","x","x","x","x","x","x","x","x","x","x","x","x",{"$f":"IF(OR($V5=\"Utility\",$AA5=0),\"x\",IF($G5=\"cold\",\"x\",IF(AND(HC$6>$F5,HB$6<$E5),IF(HB$6>$F5,IF(HC$6>$E5,$U5/($E5-$F5)*($E5-HB$6),$U5/($E5-$F5)*(HC$6-HB$6)),$U5/($E5-$F5)*(HC$6-$F5)),\"x\")))","v":"x"},"x","x","x","x","x","x","x","x","x","x","x","x","x","x","x","x","x","x","x","x","x","x","x","x","x","x","x","x","x","x","x","x","x","x","x","x",null,null,null,"Diff",{"$f":"IF(OR(IR5=\"\",IR6=\"\"),\"\",IR6-IR5)","v":0},{"$f":"IF(OR(IS5=\"\",IS6=\"\"),\"\",IS6-IS5)","v":0},0,0,0,0,0,0,0,0,0,0,0,0,0,0,0,0,0,0,0,0,0,0,0,0,0,0,0,0,0,0,0,0,0,0,{"$f":"IF(OR(KB5=\"\",KB6=\"\"),\"\",KB6-KB5)","v":0},{"$f":"IF(OR(KC5=\"\",KC6=\"\"),\"\",KC6-KC5)","v":0},{"$f":"IF(OR(KD5=\"\",KD6=\"\"),\"\",KD6-KD5)","v":0},0,{"$f":"IF(OR(KF5=\"\",KF6=\"\"),\"\",KF6-KF5)","v":0},{"$f":"IF(OR(KG5=\"\",KG6=\"\"),\"\",KG6-KG5)","v":0},{"$f":"IF(OR(KH5=\"\",KH6=\"\"),\"\",KH6-KH5)","v":0},{"$f":"IF(OR(KI5=\"\",KI6=\"\"),\"\",KI6-KI5)","v":0},{"$f":"IF(OR(KJ5=\"\",KJ6=\"\"),\"\",KJ6-KJ5)","v":0},{"$f":"IF(OR(KK5=\"\",KK6=\"\"),\"\",KK6-KK5)","v":0},{"$f":"IF(OR(KL5=\"\",KL6=\"\"),\"\",KL6-KL5)","v":0},{"$f":"IF(OR(KM5=\"\",KM6=\"\"),\"\",KM6-KM5)","v":0},{"$f":"IF(OR(KN5=\"\",KN6=\"\"),\"\",KN6-KN5)","v":0},{"$f":"IF(OR(KO5=\"\",KO6=\"\"),\"\",KO6-KO5)","v":0},{"$f":"IF(OR(KP5=\"\",KP6=\"\"),\"\",KP6-KP5)","v":0},{"$f":"IF(OR(KQ5=\"\",KQ6=\"\"),\"\",KQ6-KQ5)","v":0},{"$f":"IF(OR(KR5=\"\",KR6=\"\"),\"\",KR6-KR5)","v":0},{"$f":"IF(OR(KS5=\"\",KS6=\"\"),\"\",KS6-KS5)","v":0},{"$f":"IF(OR(KT5=\"\",KT6=\"\"),\"\",KT6-KT5)","v":0},{"$f":"IF(OR(KU5=\"\",KU6=\"\"),\"\",KU6-KU5)","v":0},{"$f":"IF(OR(KV5=\"\",KV6=\"\"),\"\",KV6-KV5)","v":0},{"$f":"IF(OR(KW5=\"\",KW6=\"\"),\"\",KW6-KW5)","v":0},{"$f":"IF(OR(KX5=\"\",KX6=\"\"),\"\",KX6-KX5)","v":0},{"$f":"IF(OR(KY5=\"\",KY6=\"\"),\"\",KY6-KY5)","v":0},{"$f":"IF(OR(KZ5=\"\",KZ6=\"\"),\"\",KZ6-KZ5)","v":0},{"$f":"IF(OR(LA5=\"\",LA6=\"\"),\"\",LA6-LA5)","v":0},{"$f":"IF(OR(LB5=\"\",LB6=\"\"),\"\",LB6-LB5)","v":0},{"$f":"IF(OR(LC5=\"\",LC6=\"\"),\"\",LC6-LC5)","v":0},{"$f":"IF(OR(LD5=\"\",LD6=\"\"),\"\",LD6-LD5)","v":0},{"$f":"IF(OR(LE5=\"\",LE6=\"\"),\"\",LE6-LE5)","v":0},{"$f":"IF(OR(LF5=\"\",LF6=\"\"),\"\",LF6-LF5)","v":0},{"$f":"IF(OR(LG5=\"\",LG6=\"\"),\"\",LG6-LG5)","v":0},{"$f":"IF(OR(LH5=\"\",LH6=\"\"),\"\",LH6-LH5)","v":0},{"$f":"IF(OR(LI5=\"\",LI6=\"\"),\"\",LI6-LI5)","v":0},{"$f":"IF(OR(LJ5=\"\",LJ6=\"\"),\"\",LJ6-LJ5)","v":0},{"$f":"IF(OR(LK5=\"\",LK6=\"\"),\"\",LK6-LK5)","v":0},{"$f":"IF(OR(LL5=\"\",LL6=\"\"),\"\",LL6-LL5)","v":0},{"$f":"IF(OR(LM5=\"\",LM6=\"\"),\"\",LM6-LM5)","v":0},{"$f":"IF(OR(LN5=\"\",LN6=\"\"),\"\",LN6-LN5)","v":0},0,{"$f":"IF(OR(LP5=\"\",LP6=\"\"),\"\",LP6-LP5)","v":0},{"$f":"IF(OR(LQ5=\"\",LQ6=\"\"),\"\",LQ6-LQ5)","v":0},0,{"$f":"IF(OR(LS5=\"\",LS6=\"\"),\"\",LS6-LS5)","v":0},{"$f":"IF(OR(LT5=\"\",LT6=\"\"),\"\",LT6-LT5)","v":0},{"$f":"IF(OR(LU5=\"\",LU6=\"\"),\"\",LU6-LU5)","v":0},{"$f":"IF(OR(LV5=\"\",LV6=\"\"),\"\",LV6-LV5)","v":0},{"$f":"IF(OR(LW5=\"\",LW6=\"\"),\"\",LW6-LW5)","v":0},{"$f":"IF(OR(LX5=\"\",LX6=\"\"),\"\",LX6-LX5)","v":0},{"$f":"IF(OR(LY5=\"\",LY6=\"\"),\"\",LY6-LY5)","v":0},{"$f":"IF(OR(LZ5=\"\",LZ6=\"\"),\"\",LZ6-LZ5)","v":0},{"$f":"IF(OR(MA5=\"\",MA6=\"\"),\"\",MA6-MA5)","v":0},{"$f":"IF(OR(MB5=\"\",MB6=\"\"),\"\",MB6-MB5)","v":0},{"$f":"IF(OR(MC5=\"\",MC6=\"\"),\"\",MC6-MC5)","v":0},{"$f":"IF(OR(MD5=\"\",MD6=\"\"),\"\",MD6-MD5)","v":0},{"$f":"IF(OR(ME5=\"\",ME6=\"\"),\"\",ME6-ME5)","v":0},{"$f":"IF(OR(MF5=\"\",MF6=\"\"),\"\",MF6-MF5)","v":0},{"$f":"IF(OR(MG5=\"\",MG6=\"\"),\"\",MG6-MG5)","v":0},{"$f":"IF(OR(MH5=\"\",MH6=\"\"),\"\",MH6-MH5)","v":0},{"$f":"IF(OR(MI5=\"\",MI6=\"\"),\"\",MI6-MI5)","v":0},{"$f":"IF(OR(MJ5=\"\",MJ6=\"\"),\"\",MJ6-MJ5)","v":0},{"$f":"IF(OR(MK5=\"\",MK6=\"\"),\"\",MK6-MK5)","v":0},{"$f":"IF(OR(ML5=\"\",ML6=\"\"),\"\",ML6-ML5)","v":0},{"$f":"IF(OR(MM5=\"\",MM6=\"\"),\"\",MM6-MM5)","v":0},{"$f":"IF(OR(MN5=\"\",MN6=\"\"),\"\",MN6-MN5)","v":0}]
["",{"$f":"IF(G8=\"hot\",COUNTIF($G$5:G8,\"hot\"),\"\")","v":""},{"$f":"IF(G8=\"cold\",COUNTIF($G$5:G8,\"cold\"),\"\")","v":""},null,null,null,"",null,null,"","","",null,null,2,4,5,50,null,null,"",null,"","","","","",null,null,null,null,null,null,null,null,null,null,null,0,null,{"$f":"IF(OR($V6=\"Utility\",$AA6=0),\"x\",IF($G6=\"hot\",\"x\",IF(AND(AO$6>$E6,AN$6<$F6),IF(AN$6>$E6,IF(AO$6>$F6,$U6/($F6-$E6)*($F6-AN$6),$U6/($F6-$E6)*(AO$6-AN$6)),$U6/($F6-$E6)*(AO$6-$E6)),\"x\")))","v":"x"},"x","x","x","x","x","x","x","x","x","x","x","x","x","x","x","x","x","x","x","x","x","x","x","x","x","x","x","x","x","x","x",{"$f":"IF(OR($V6=\"Utility\",$AA6=0),\"x\",IF($G6=\"hot\",\"x\",IF(AND(BU$6>$E6,BT$6<$F6),IF(BT$6>$E6,IF(BU$6>$F6,$U6/($F6-$E6)*($F6-BT$6),$U6/($F6-$E6)*(BU$6-BT$6)),$U6/($F6-$E6)*(BU$6-$E6)),\"x\")))","v":"x"},"x","x","x","x","x","x","x","x","x","x","x","x","x","x","x","x","x","x","x","x","x","x","x","x","x","x","x","x","x","x","x",{"$f":"IF(OR($V6=\"Utility\",$AA6=0),\"x\",IF($G6=\"hot\",\"x\",IF(AND(DA$6>$E6,CZ$6<$F6),IF(CZ$6>$E6,IF(DA$6>$F6,$U6/($F6-$E6)*($F6-CZ$6),$U6/($F6-$E6)*(DA$6-CZ$6)),$U6/($F6-$E6)*(DA$6-$E6)),\"x\")))","v":"x"},"x","x","x","x","x","x","x","x","x","x","x","x","x","x","x","x","x","x","x","x","x","x","x","x","x","x","x","x","x","x","x","x","x","x","x","x",null,null,null,0,null,{"$f":"IF(OR($V6=\"Utility\",$AA6=0),\"x\",IF($G6=\"cold\",\"x\",IF(AND(EQ$6>$F6,EP$6<$E6),IF(EP$6>$F6,IF(EQ$6>$E6,$U6/($E6-$F6)*($E6-EP$6),$U6/($E6-$F6)*(EQ$6-EP$6)),$U6/($E6-$F6)*(EQ$6-$F6)),\"x\")))","v":"x"},"x","x","x","x","x","x","x","x","x","x","x","x","x","x","x","x","x","x","x","x","x","x","x","x","x","x","x","x","x","x","x",{"$f":"IF(OR($V6=\"Utility\",$AA6=0),\"x\",IF($G6=\"cold\",\"x\",IF(AND(FW$6>$F6,FV$6<$E6),IF(FV$6>$F6,IF(FW$6>$E6,$U6/($E6-$F6)*($E6-FV$6),$U6/($E6-$F6)*(FW$6-FV$6)),$U6/($E6-$F6)*(FW$6-$F6)),\"x\")))","v":"x"},"x","x","x","x","x","x","x","x","x","x","x","x","x","x","x","x","x","x","x","x","x","x","x","x","x","x","x","x","x","x","x",{"$f":"IF(OR($V6=\"Utility\",$AA6=0),\"x\",IF($G6=\"cold\",\"x\",IF(AND(HC$6>$F6,HB$6<$E6),IF(HB$6>$F6,IF(HC$6>$E6,$U6/($E6-$F6)*($E6-HB$6),$U6/($E6-$F6)*(HC$6-HB$6)),$U6/($E6-$F6)*(HC$6-$F6)),\"x\")))","v":"x"},"x","x","x","x","x","x","x","x","x","x","x","x","x","x","x","x","x","x","x","x","x","x","x","x","x","x","x","x","x","x","x","x","x","x","x","x"]
["",{"$f":"IF(G9=\"hot\",COUNTIF($G$5:G9,\"hot\"),\"\")","v":""},{"$f":"IF(G9=\"cold\",COUNTIF($G$5:G9,\"cold\"),\"\")","v":""},null,null,null,"",null,null,"","","",null,null,2,4,2,50,null,null,"",null,"","","","","",null,null,null,null,null,null,null,"H MIN",0,"MWh",null,0,null,{"$f":"IF(OR($V7=\"Utility\",$AA7=0),\"x\",IF($G7=\"hot\",\"x\",IF(AND(AO$6>$E7,AN$6<$F7),IF(AN$6>$E7,IF(AO$6>$F7,$U7/($F7-$E7)*($F7-AN$6),$U7/($F7-$E7)*(AO$6-AN$6)),$U7/($F7-$E7)*(AO$6-$E7)),\"x\")))","v":"x"},"x","x","x","x","x","x","x","x","x","x","x","x","x","x","x","x","x","x","x","x","x","x","x","x","x","x","x","x","x","x","x",{"$f":"IF(OR($V7=\"Utility\",$AA7=0),\"x\",IF($G7=\"hot\",\"x\",IF(AND(BU$6>$E7,BT$6<$F7),IF(BT$6>$E7,IF(BU$6>$F7,$U7/($F7-$E7)*($F7-BT$6),$U7/($F7-$E7)*(BU$6-BT$6)),$U7/($F7-$E7)*(BU$6-$E7)),\"x\")))","v":"x"},"x","x","x","x","x","x","x","x","x","x","x","x","x","x","x","x","x","x","x","x","x","x","x","x","x","x","x","x","x","x","x",{"$f":"IF(OR($V7=\"Utility\",$AA7=0),\"x\",IF($G7=\"hot\",\"x\",IF(AND(DA$6>$E7,CZ$6<$F7),IF(CZ$6>$E7,IF(DA$6>$F7,$U7/($F7-$E7)*($F7-CZ$6),$U7/($F7-$E7)*(DA$6-CZ$6)),$U7/($F7-$E7)*(DA$6-$E7)),\"x\")))","v":"x"},"x","x","x","x","x","x","x","x","x","x","x","x","x","x","x","x","x","x","x","x","x","x","x","x","x","x","x","x","x","x","x","x","x","x","x","x",null,null,null,0,null,{"$f":"IF(OR($V7=\"Utility\",$AA7=0),\"x\",IF($G7=\"cold\",\"x\",IF(AND(EQ$6>$F7,EP$6<$E7),IF(EP$6>$F7,IF(EQ$6>$E7,$U7/($E7-$F7)*($E7-EP$6),$U7/($E7-$F7)*(EQ$6-EP$6)),$U7/($E7-$F7)*(EQ$6-$F7)),\"x\")))","v":"x"},"x","x","x","x","x","x","x","x","x","x","x","x","x","x","x","x","x","x","x","x","x","x","x","x","x","x","x","x","x","x","x",{"$f":"IF(OR($V7=\"Utility\",$AA7=0),\"x\",IF($G7=\"cold\",\"x\",IF(AND(FW$6>$F7,FV$6<$E7),IF(FV$6>$F7,IF(FW$6>$E7,$U7/($E7-$F7)*($E7-FV$6),$U7/($E7-$F7)*(FW$6-FV$6)),$U7/($E7-$F7)*(FW$6-$F7)),\"x\")))","v":"x"},"x","x","x","x","x","x","x","x","x","x","x","x","x","x","x","x","x","x","x","x","x","x","x","x","x","x","x","x","x","x","x",{"$f":"IF(OR($V7=\"Utility\",$AA7=0),\"x\",IF($G7=\"cold\",\"x\",IF(AND(HC$6>$F7,HB$6<$E7),IF(HB$6>$F7,IF(HC$6>$E7,$U7/($E7-$F7)*($E7-HB$6),$U7/($E7-$F7)*(HC$6-HB$6)),$U7/($E7-$F7)*(HC$6-$F7)),\"x\")))","v":"x"},"x","x","x","x","x","x","x","x","x","x","x","x","x","x","x","x","x","x","x","x","x","x","x","x","x","x","x","x","x","x","x","x","x","x","x","x"]
["",{"$f":"IF(G10=\"hot\",COUNTIF($G$5:G10,\"hot\"),\"\")","v":""},{"$f":"IF(G10=\"cold\",COUNTIF($G$5:G10,\"cold\"),\"\")","v":""},null,null,null,"",null,null,"","","",null,null,2,6,5,50,null,null,"",null,"","","","","",null,null,null,null,null,null,null,"H MAX",{"$f":"ROUNDUP(MAX(IM4,EK4),2)","v":0},"MWh",null,0,null,{"$f":"IF(OR($V8=\"Utility\",$AA8=0),\"x\",IF($G8=\"hot\",\"x\",IF(AND(AO$6>$E8,AN$6<$F8),IF(AN$6>$E8,IF(AO$6>$F8,$U8/($F8-$E8)*($F8-AN$6),$U8/($F8-$E8)*(AO$6-AN$6)),$U8/($F8-$E8)*(AO$6-$E8)),\"x\")))","v":"x"},"x","x","x","x","x","x","x","x","x","x","x","x","x","x","x","x","x","x","x","x","x","x","x","x","x","x","x","x","x","x","x",{"$f":"IF(OR($V8=\"Utility\",$AA8=0),\"x\",IF($G8=\"hot\",\"x\",IF(AND(BU$6>$E8,BT$6<$F8),IF(BT$6>$E8,IF(BU$6>$F8,$U8/($F8-$E8)*($F8-BT$6),$U8/($F8-$E8)*(BU$6-BT$6)),$U8/($F8-$E8)*(BU$6-$E8)),\"x\")))","v":"x"},"x","x","x","x","x","x","x","x","x","x","x","x","x","x","x","x","x","x","x","x","x","x","x","x","x","x","x","x","x","x","x",{"$f":"IF(OR($V8=\"Utility\",$AA8=0),\"x\",IF($G8=\"hot\",\"x\",IF(AND(DA$6>$E8,CZ$6<$F8),IF(CZ$6>$E8,IF(DA$6>$F8,$U8/($F8-$E8)*($F8-CZ$6),$U8/($F8-$E8)*(DA$6-CZ$6)),$U8/($F8-$E8)*(DA$6-$E8)),\"x\")))","v":"x"},"x","x","x","x","x","x","x","x","x","x","x","x","x","x","x","x","x","x","x","x","x","x","x","x","x","x","x","x","x","x","x","x","x","x","x","x",null,null,null,0,null,{"$f":"IF(OR($V8=\"Utility\",$AA8=0),\"x\",IF($G8=\"cold\",\"x\",IF(AND(EQ$6>$F8,EP$6<$E8),IF(EP$6>$F8,IF(EQ$6>$E8,$U8/($E8-$F8)*($E8-EP$6),$U8/($E8-$F8)*(EQ$6-EP$6)),$U8/($E8-$F8)*(EQ$6-$F8)),\"x\")))","v":"x"},"x","x","x","x","x","x","x","x","x","x","x","x","x","x","x","x","x","x","x","x","x","x","x","x","x","x","x","x","x","x","x",{"$f":"IF(OR($V8=\"Utility\",$AA8=0),\"x\",IF($G8=\"cold\",\"x\",IF(AND(FW$6>$F8,FV$6<$E8),IF(FV$6>$F8,IF(FW$6>$E8,$U8/($E8-$F8)*($E8-FV$6),$U8/($E8-$F8)*(FW$6-FV$6)),$U8/($E8-$F8)*(FW$6-$F8)),\"x\")))","v":"x"},"x","x","x","x","x","x","x","x","x","x","x","x","x","x","x","x","x","x","x","x","x","x","x","x","x","x","x","x","x","x","x",{"$f":"IF(OR($V8=\"Utility\",$AA8=0),\"x\",IF($G8=\"cold\",\"x\",IF(AND(HC$6>$F8,HB$6<$E8),IF(HB$6>$F8,IF(HC$6>$E8,$U8/($E8-$F8)*($E8-HB$6),$U8/($E8-$F8)*(HC$6-HB$6)),$U8/($E8-$F8)*(HC$6-$F8)),\"x\")))","v":"x"},"x","x","x","x","x","x","x","x","x","x","x","x","x","x","x","x","x","x","x","x","x","x","x","x","x","x","x","x","x","x","x","x","x","x","x","x",null,null,null,"Grand Composite Curve"]
["",{"$f":"IF(G11=\"hot\",COUNTIF($G$5:G11,\"hot\"),\"\")","v":""},{"$f":"IF(G11=\"cold\",COUNTIF($G$5:G11,\"cold\"),\"\")","v":""},null,null,null,"",null,null,"","","",null,null,2,3,5,52,null,null,"",null,"","","","","",null,null,null,null,null,null,null,null,null,null,null,0,null,{"$f":"IF(OR($V9=\"Utility\",$AA9=0),\"x\",IF($G9=\"hot\",\"x\",IF(AND(AO$6>$E9,AN$6<$F9),IF(AN$6>$E9,IF(AO$6>$F9,$U9/($F9-$E9)*($F9-AN$6),$U9/($F9-$E9)*(AO$6-AN$6)),$U9/($F9-$E9)*(AO$6-$E9)),\"x\")))","v":"x"},"x","x","x","x","x","x","x","x","x","x","x","x","x","x","x","x","x","x","x","x","x","x","x","x","x","x","x","x","x","x","x",{"$f":"IF(OR($V9=\"Utility\",$AA9=0),\"x\",IF($G9=\"hot\",\"x\",IF(AND(BU$6>$E9,BT$6<$F9),IF(BT$6>$E9,IF(BU$6>$F9,$U9/($F9-$E9)*($F9-BT$6),$U9/($F9-$E9)*(BU$6-BT$6)),$U9/($F9-$E9)*(BU$6-$E9)),\"x\")))","v":"x"},"x","x","x","x","x","x","x","x","x","x","x","x","x","x","x","x","x","x","x","x","x","x","x","x","x","x","x","x","x","x","x",{"$f":"IF(OR($V9=\"Utility\",$AA9=0),\"x\",IF($G9=\"hot\",\"x\",IF(AND(DA$6>$E9,CZ$6<$F9),IF(CZ$6>$E9,IF(DA$6>$F9,$U9/($F9-$E9)*($F9-CZ$6),$U9/($F9-$E9)*(DA$6-CZ$6)),$U9/($F9-$E9)*(DA$6-$E9)),\"x\")))","v":"x"},"x","x","x","x","x","x","x","x","x","x","x","x","x","x","x","x","x","x","x","x","x","x","x","x","x","x","x","x","x","x","x","x","x","x","x","x",null,null,null,0,null,{"$f":"IF(OR($V9=\"Utility\",$AA9=0),\"x\",IF($G9=\"cold\",\"x\",IF(AND(EQ$6>$F9,EP$6<$E9),IF(EP$6>$F9,IF(EQ$6>$E9,$U9/($E9-$F9)*($E9-EP$6),$U9/($E9-$F9)*(EQ$6-EP$6)),$U9/($E9-$F9)*(EQ$6-$F9)),\"x\")))","v":"x"},"x","x","x","x","x","x","x","x","x","x","x","x","x","x","x","x","x","x","x","x","x","x","x","x","x","x","x","x","x","x","x",{"$f":"IF(OR($V9=\"Utility\",$AA9=0),\"x\",IF($G9=\"cold\",\"x\",IF(AND(FW$6>$F9,FV$6<$E9),IF(FV$6>$F9,IF(FW$6>$E9,$U9/($E9-$F9)*($E9-FV$6),$U9/($E9-$F9)*(FW$6-FV$6)),$U9/($E9-$F9)*(FW$6-$F9)),\"x\")))","v":"x"},"x","x","x","x","x","x","x","x","x","x","x","x","x","x","x","x","x","x","x","x","x","x","x","x","x","x","x","x","x","x","x",{"$f":"IF(OR($V9=\"Utility\",$AA9=0),\"x\",IF($G9=\"cold\",\"x\",IF(AND(HC$6>$F9,HB$6<$E9),IF(HB$6>$F9,IF(HC$6>$E9,$U9/($E9-$F9)*($E9-HB$6),$U9/($E9-$F9)*(HC$6-HB$6)),$U9/($E9-$F9)*(HC$6-$F9)),\"x\")))","v":"x"},"x","x","x","x","x","x","x","x","x","x","x","x","x","x","x","x","x","x","x","x","x","x","x","x","x","x","x","x","x","x","x","x","x","x","x","x"]
["",{"$f":"IF(G12=\"hot\",COUNTIF($G$5:G12,\"hot\"),\"\")","v":""},{"$f":"IF(G12=\"cold\",COUNTIF($G$5:G12,\"cold\"),\"\")","v":""},null,null,null,"",null,null,"","","",null,null,8,20,5,50,null,null,"",null,"","","","","",null,null,null,null,null,null,null,"dTmin required",{"$f":"'02_PinchKurven'!D6","v":0},"Kelvin",null,0,null,{"$f":"IF(OR($V10=\"Utility\",$AA10=0),\"x\",IF($G10=\"hot\",\"x\",IF(AND(AO$6>$E10,AN$6<$F10),IF(AN$6>$E10,IF(AO$6>$F10,$U10/($F10-$E10)*($F10-AN$6),$U10/($F10-$E10)*(AO$6-AN$6)),$U10/($F10-$E10)*(AO$6-$E10)),\"x\")))","v":"x"},"x","x","x","x","x","x","x","x","x","x","x","x","x","x","x","x","x","x","x","x","x","x","x","x","x","x","x","x","x","x","x",{"$f":"IF(OR($V10=\"Utility\",$AA10=0),\"x\",IF($G10=\"hot\",\"x\",IF(AND(BU$6>$E10,BT$6<$F10),IF(BT$6>$E10,IF(BU$6>$F10,$U10/($F10-$E10)*($F10-BT$6),$U10/($F10-$E10)*(BU$6-BT$6)),$U10/($F10-$E10)*(BU$6-$E10)),\"x\")))","v":"x"},"x","x","x","x","x","x","x","x","x","x","x","x","x","x","x","x","x","x","x","x","x","x","x","x","x","x","x","x","x","x","x",{"$f":"IF(OR($V10=\"Utility\",$AA10=0),\"x\",IF($G10=\"hot\",\"x\",IF(AND(DA$6>$E10,CZ$6<$F10),IF(CZ$6>$E10,IF(DA$6>$F10,$U10/($F10-$E10)*($F10-CZ$6),$U10/($F10-$E10)*(DA$6-CZ$6)),$U10/($F10-$E10)*(DA$6-$E10)),\"x\")))","v":"x"},"x","x","x","x","x","x","x","x","x","x","x","x","x","x","x","x","x","x","x","x","x","x","x","x","x","x","x","x","x","x","x","x","x","x","x","x",null,null,null,0,null,{"$f":"IF(OR($V10=\"Utility\",$AA10=0),\"x\",IF($G10=\"cold\",\"x\",IF(AND(EQ$6>$F10,EP$6<$E10),IF(EP$6>$F10,IF(EQ$6>$E10,$U10/($E10-$F10)*($E10-EP$6),$U10/($E10-$F10)*(EQ$6-EP$6)),$U10/($E10-$F10)*(EQ$6-$F10)),\"x\")))","v":"x"},"x","x","x","x","x","x","x","x","x","x","x","x","x","x","x","x","x","x","x","x","x","x","x","x","x","x","x","x","x","x","x",{"$f":"IF(OR($V10=\"Utility\",$AA10=0),\"x\",IF($G10=\"cold\",\"x\",IF(AND(FW$6>$F10,FV$6<$E10),IF(FV$6>$F10,IF(FW$6>$E10,$U10/($E10-$F10)*($E10-FV$6),$U10/($E10-$F10)*(FW$6-FV$6)),$U10/($E10-$F10)*(FW$6-$F10)),\"x\")))","v":"x"},"x","x","x","x","x","x","x","x","x","x","x","x","x","x","x","x","x","x","x","x","x","x","x","x","x","x","x","x","x","x","x",{"$f":"IF(OR($V10=\"Utility\",$AA10=0),\"x\",IF($G10=\"cold\",\"x\",IF(AND(HC$6>$F10,HB$6<$E10),IF(HB$6>$F10,IF(HC$6>$E10,$U10/($E10-$F10)*($E10-HB$6),$U10/($E10-$F10)*(HC$6-HB$6)),$U10/($E10-$F10)*(HC$6-$F10)),\"x\")))","v":"x"},"x","x","x","x","x","x","x","x","x","x","x","x","x","x","x","x","x","x","x","x","x","x","x","x","x","x","x","x","x","x","x","x","x","x","x","x",null,null,null,"T",{"$f":"MIN(AO5:IM5)","v":0},{"$f":"IR12+(MAX($AO$5:$IM$5)-MIN($AO$5:$IM$5))/100","v":0},{"$f":"IS12+(MAX($AO$5:$IM$5)-MIN($AO$5:$IM$5))/100","v":0},0,0,0,0,0,0,0,0,0,0,0,0,0,0,0,0,0,0,0,0,0,0,0,0,0,0,0,0,0,0,0,0,0,0,0,0,0,0,0,0,0,0,0,0,0,0,0,0,0,0,0,0,0,0,0,0,0,0,0,0,0,0,0,{"$f":"LE12+(MAX($AO$5:$IM$5)-MIN($AO$5:$IM$5))/100","v":0},0,0,0,0,0,0,0,0,0,0,0,0,0,0,0,0,0,0,0,0,0,0,0,0,0,0,0,0,0,0,0,0,0,0]
["",{"$f":"IF(G13=\"hot\",COUNTIF($G$5:G13,\"hot\"),\"\")","v":""},{"$f":"IF(G13=\"cold\",COUNTIF($G$5:G13,\"cold\"),\"\")","v":""},null,null,null,"",null,null,"","","",null,null,null,null,null,null,null,null,"",null,"","","","","",null,null,null,null,null,null,null,"Shift",0,"kW",null,0,null,{"$f":"IF(OR($V11=\"Utility\",$AA11=0),\"x\",IF($G11=\"hot\",\"x\",IF(AND(AO$6>$E11,AN$6<$F11),IF(AN$6>$E11,IF(AO$6>$F11,$U11/($F11-$E11)*($F11-AN$6),$U11/($F11-$E11)*(AO$6-AN$6)),$U11/($F11-$E11)*(AO$6-$E11)),\"x\")))","v":"x"},"x","x","x","x","x","x","x","x","x","x","x","x","x","x","x","x","x","x","x","x","x","x","x","x","x","x","x","x","x","x","x",{"$f":"IF(OR($V11=\"Utility\",$AA11=0),\"x\",IF($G11=\"hot\",\"x\",IF(AND(BU$6>$E11,BT$6<$F11),IF(BT$6>$E11,IF(BU$6>$F11,$U11/($F11-$E11)*($F11-BT$6),$U11/($F11-$E11)*(BU$6-BT$6)),$U11/($F11-$E11)*(BU$6-$E11)),\"x\")))","v":"x"},"x","x","x","x","x","x","x","x","x","x","x","x","x","x","x","x","x","x","x","x","x","x","x","x","x","x","x","x","x","x","x",{"$f":"IF(OR($V11=\"Utility\",$AA11=0),\"x\",IF($G11=\"hot\",\"x\",IF(AND(DA$6>$E11,CZ$6<$F11),IF(CZ$6>$E11,IF(DA$6>$F11,$U11/($F11-$E11)*($F11-CZ$6),$U11/($F11-$E11)*(DA$6-CZ$6)),$U11/($F11-$E11)*(DA$6-$E11)),\"x\")))","v":"x"},"x","x","x","x","x","x","x","x","x","x","x","x","x","x","x","x","x","x","x","x","x","x","x","x","x","x","x","x","x","x","x","x","x","x","x","x",null,null,null,0,null,{"$f":"IF(OR($V11=\"Utility\",$AA11=0),\"x\",IF($G11=\"cold\",\"x\",IF(AND(EQ$6>$F11,EP$6<$E11),IF(EP$6>$F11,IF(EQ$6>$E11,$U11/($E11-$F11)*($E11-EP$6),$U11/($E11-$F11)*(EQ$6-EP$6)),$U11/($E11-$F11)*(EQ$6-$F11)),\"x\")))","v":"x"},"x","x","x","x","x","x","x","x","x","x","x","x","x","x","x","x","x","x","x","x","x","x","x","x","x","x","x","x","x","x","x",{"$f":"IF(OR($V11=\"Utility\",$AA11=0),\"x\",IF($G11=\"cold\",\"x\",IF(AND(FW$6>$F11,FV$6<$E11),IF(FV$6>$F11,IF(FW$6>$E11,$U11/($E11-$F11)*($E11-FV$6),$U11/($E11-$F11)*(FW$6-FV$6)),$U11/($E11-$F11)*(FW$6-$F11)),\"x\")))","v":"x"},"x","x","x","x","x","x","x","x","x","x","x","x","x","x","x","x","x","x","x","x","x","x","x","x","x","x","x","x","x","x","x",{"$f":"IF(OR($V11=\"Utility\",$AA11=0),\"x\",IF($G11=\"cold\",\"x\",IF(AND(HC$6>$F11,HB$6<$E11),IF(HB$6>$F11,IF(HC$6>$E11,$U11/($E11-$F11)*($E11-HB$6),$U11/($E11-$F11)*(HC$6-HB$6)),$U11/($E11-$F11)*(HC$6-$F11)),\"x\")))","v":"x"},"x","x","x","x","x","x","x","x","x","x","x","x","x","x","x","x","x","x","x","x","x","x","x","x","x","x","x","x","x","x","x","x","x","x","x","x"]
["",{"$f":"IF(G14=\"hot\",COUNTIF($G$5:G14,\"hot\"),\"\")","v":""},{"$f":"IF(G14=\"cold\",COUNTIF($G$5:G14,\"cold\"),\"\")","v":""},null,null,null,"",null,null,"","","",null,null,10,19,5,40,null,null,"",null,"","","","","",null,null,null,null,null,null,null,"dTmin actual",{"$f":"ROUND(MIN(IR7:MN7),0)","v":0},"Kelvin",null,0,null,{"$f":"IF(OR($V12=\"Utility\",$AA12=0),\"x\",IF($G12=\"hot\",\"x\",IF(AND(AO$6>$E12,AN$6<$F12),IF(AN$6>$E12,IF(AO$6>$F12,$U12/($F12-$E12)*($F12-AN$6),$U12/($F12-$E12)*(AO$6-AN$6)),$U12/($F12-$E12)*(AO$6-$E12)),\"x\")))","v":"x"},"x","x","x","x","x","x","x","x","x","x","x","x","x","x","x","x","x","x","x","x","x","x","x","x","x","x","x","x","x","x","x",{"$f":"IF(OR($V12=\"Utility\",$AA12=0),\"x\",IF($G12=\"hot\",\"x\",IF(AND(BU$6>$E12,BT$6<$F12),IF(BT$6>$E12,IF(BU$6>$F12,$U12/($F12-$E12)*($F12-BT$6),$U12/($F12-$E12)*(BU$6-BT$6)),$U12/($F12-$E12)*(BU$6-$E12)),\"x\")))","v":"x"},"x","x","x","x","x","x","x","x","x","x","x","x","x","x","x","x","x","x","x","x","x","x","x","x","x","x","x","x","x","x","x",{"$f":"IF(OR($V12=\"Utility\",$AA12=0),\"x\",IF($G12=\"hot\",\"x\",IF(AND(DA$6>$E12,CZ$6<$F12),IF(CZ$6>$E12,IF(DA$6>$F12,$U12/($F12-$E12)*($F12-CZ$6),$U12/($F12-$E12)*(DA$6-CZ$6)),$U12/($F12-$E12)*(DA$6-$E12)),\"x\")))","v":"x"},"x","x","x","x","x","x","x","x","x","x","x","x","x","x","x","x","x","x","x","x","x","x","x","x","x","x","x","x","x","x","x","x","x","x","x","x",null,null,null,0,null,{"$f":"IF(OR($V12=\"Utility\",$AA12=0),\"x\",IF($G12=\"cold\",\"x\",IF(AND(EQ$6>$F12,EP$6<$E12),IF(EP$6>$F12,IF(EQ$6>$E12,$U12/($E12-$F12)*($E12-EP$6),$U12/($E12-$F12)*(EQ$6-EP$6)),$U12/($E12-$F12)*(EQ$6-$F12)),\"x\")))","v":"x"},"x","x","x","x","x","x","x","x","x","x","x","x","x","x","x","x","x","x","x","x","x","x","x","x","x","x","x","x","x","x","x",{"$f":"IF(OR($V12=\"Utility\",$AA12=0),\"x\",IF($G12=\"cold\",\"x\",IF(AND(FW$6>$F12,FV$6<$E12),IF(FV$6>$F12,IF(FW$6>$E12,$U12/($E12-$F12)*($E12-FV$6),$U12/($E12-$F12)*(FW$6-FV$6)),$U12/($E12-$F12)*(FW$6-$F12)),\"x\")))","v":"x"},"x","x","x","x","x","x","x","x","x","x","x","x","x","x","x","x","x","x","x","x","x","x","x","x","x","x","x","x","x","x","x",{"$f":"IF(OR($V12=\"Utility\",$AA12=0),\"x\",IF($G12=\"cold\",\"x\",IF(AND(HC$6>$F12,HB$6<$E12),IF(HB$6>$F12,IF(HC$6>$E12,$U12/($E12-$F12)*($E12-HB$6),$U12/($E12-$F12)*(HC$6-HB$6)),$U12/($E12-$F12)*(HC$6-$F12)),\"x\")))","v":"x"},"x","x","x","x","x","x","x","x","x","x","x","x","x","x","x","x","x","x","x","x","x","x","x","x","x","x","x","x","x","x","x","x","x","x","x","x"]
["",{"$f":"IF(G15=\"hot\",COUNTIF($G$5:G15,\"hot\"),\"\")","v":""},{"$f":"IF(G15=\"cold\",COUNTIF($G$5:G15,\"cold\"),\"\")","v":""},null,null,null,"",null,null,"","","",null,null,2,20,5,50,null,null,"",null,"","","","","",null,null,null,null,null,null,null,null,null,null,null,0,null,{"$f":"IF(OR($V13=\"Utility\",$AA13=0),\"x\",IF($G13=\"hot\",\"x\",IF(AND(AO$6>$E13,AN$6<$F13),IF(AN$6>$E13,IF(AO$6>$F13,$U13/($F13-$E13)*($F13-AN$6),$U13/($F13-$E13)*(AO$6-AN$6)),$U13/($F13-$E13)*(AO$6-$E13)),\"x\")))","v":"x"},"x","x","x","x","x","x","x","x","x","x","x","x","x","x","x","x","x","x","x","x","x","x","x","x","x","x","x","x","x","x","x",{"$f":"IF(OR($V13=\"Utility\",$AA13=0),\"x\",IF($G13=\"hot\",\"x\",IF(AND(BU$6>$E13,BT$6<$F13),IF(BT$6>$E13,IF(BU$6>$F13,$U13/($F13-$E13)*($F13-BT$6),$U13/($F13-$E13)*(BU$6-BT$6)),$U13/($F13-$E13)*(BU$6-$E13)),\"x\")))","v":"x"},"x","x","x","x","x","x","x","x","x","x","x","x","x","x","x","x","x","x","x","x","x","x","x","x","x","x","x","x","x","x","x",{"$f":"IF(OR($V13=\"Utility\",$AA13=0),\"x\",IF($G13=\"hot\",\"x\",IF(AND(DA$6>$E13,CZ$6<$F13),IF(CZ$6>$E13,IF(DA$6>$F13,$U13/($F13-$E13)*($F13-CZ$6),$U13/($F13-$E13)*(DA$6-CZ$6)),$U13/($F13-$E13)*(DA$6-$E13)),\"x\")))","v":"x"},"x","x","x","x","x","x","x","x","x","x","x","x","x","x","x","x","x","x","x","x","x","x","x","x","x","x","x","x","x","x","x","x","x","x","x","x",null,null,null,0,null,{"$f":"IF(OR($V13=\"Utility\",$AA13=0),\"x\",IF($G13=\"cold\",\"x\",IF(AND(EQ$6>$F13,EP$6<$E13),IF(EP$6>$F13,IF(EQ$6>$E13,$U13/($E13-$F13)*($E13-EP$6),$U13/($E13-$F13)*(EQ$6-EP$6)),$U13/($E13-$F13)*(EQ$6-$F13)),\"x\")))","v":"x"},"x","x","x","x","x","x","x","x","x","x","x","x","x","x","x","x","x","x","x","x","x","x","x","x","x","x","x","x","x","x","x",{"$f":"IF(OR($V13=\"Utility\",$AA13=0),\"x\",IF($G13=\"cold\",\"x\",IF(AND(FW$6>$F13,FV$6<$E13),IF(FV$6>$F13,IF(FW$6>$E13,$U13/($E13-$F13)*($E13-FV$6),$U13/($E13-$F13)*(FW$6-FV$6)),$U13/($E13-$F13)*(FW$6-$F13)),\"x\")))","v":"x"},"x","x","x","x","x","x","x","x","x","x","x","x","x","x","x","x","x","x","x","x","x","x","x","x","x","x","x","x","x","x","x",{"$f":"IF(OR($V13=\"Utility\",$AA13=0),\"x\",IF($G13=\"cold\",\"x\",IF(AND(HC$6>$F13,HB$6<$E13),IF(HB$6>$F13,IF(HC$6>$E13,$U13/($E13-$F13)*($E13-HB$6),$U13/($E13-$F13)*(HC$6-HB$6)),$U13/($E13-$F13)*(HC$6-$F13)),\"x\")))","v":"x"},"x","x","x","x","x","x","x","x","x","x","x","x","x","x","x","x","x","x","x","x","x","x","x","x","x","x","x","x","x","x","x","x","x","x","x","x",null,null,null,"Slope CCC",{"$f":"IF(OR(IR12<$AJ$3+dTminActual/2,IR12>=$AJ$4+dTminActual/2),0,INDEX($AO$3:$EK$6,1,IR23+1)/(INDEX($AO$3:$EK$6,3,IR23+1)-INDEX($AO$3:$EK$6,3,IR23)))","v":0},0,0,0,0,0,0,0,0,0,0,0,0,0,0,0,0,0,0,0,0,0,0,0,0,0,0,0,0,0,0,0,{"$f":"IF(OR(JX12<$AJ$3+dTminActual/2,JX12>=$AJ$4+dTminActual/2),0,INDEX($AO$3:$EK$6,1,JX23+1)/(INDEX($AO$3:$EK$6,3,JX23+1)-INDEX($AO$3:$EK$6,3,JX23)))","v":0},0,0,0,0,0,0,0,0,0,0,0,0,0,0,0,0,0,0,0,0,0,0,0,0,0,0,0,0,0,0,0,{"$f":"IF(OR(LD12<$AJ$3+dTminActual/2,LD12>=$AJ$4+dTminActual/2),0,INDEX($AO$3:$EK$6,1,LD23+1)/(INDEX($AO$3:$EK$6,3,LD23+1)-INDEX($AO$3:$EK$6,3,LD23)))","v":0},0,0,0,0,0,0,0,0,0,0,0,0,0,0,0,0,0,0,0,0,0,0,0,0,0,0,0,0,0,0,0,0,0,0,0,0]
["",{"$f":"IF(G16=\"hot\",COUNTIF($G$5:G16,\"hot\"),\"\")","v":""},{"$f":"IF(G16=\"cold\",COUNTIF($G$5:G16,\"cold\"),\"\")","v":""},null,null,null,"",null,null,"","","",null,null,2,20,5,50,null,null,"",null,"","","","","",null,null,null,null,null,null,null,null,null,null,null,0,null,{"$f":"IF(OR($V14=\"Utility\",$AA14=0),\"x\",IF($G14=\"hot\",\"x\",IF(AND(AO$6>$E14,AN$6<$F14),IF(AN$6>$E14,IF(AO$6>$F14,$U14/($F14-$E14)*($F14-AN$6),$U14/($F14-$E14)*(AO$6-AN$6)),$U14/($F14-$E14)*(AO$6-$E14)),\"x\")))","v":"x"},"x","x","x","x","x","x","x","x","x","x","x","x","x","x","x","x","x","x","x","x","x","x","x","x","x","x","x","x","x","x","x",{"$f":"IF(OR($V14=\"Utility\",$AA14=0),\"x\",IF($G14=\"hot\",\"x\",IF(AND(BU$6>$E14,BT$6<$F14),IF(BT$6>$E14,IF(BU$6>$F14,$U14/($F14-$E14)*($F14-BT$6),$U14/($F14-$E14)*(BU$6-BT$6)),$U14/($F14-$E14)*(BU$6-$E14)),\"x\")))","v":"x"},"x","x","x","x","x","x","x","x","x","x","x","x","x","x","x","x","x","x","x","x","x","x","x","x","x","x","x","x","x","x","x",{"$f":"IF(OR($V14=\"Utility\",$AA14=0),\"x\",IF($G14=\"hot\",\"x\",IF(AND(DA$6>$E14,CZ$6<$F14),IF(CZ$6>$E14,IF(DA$6>$F14,$U14/($F14-$E14)*($F14-CZ$6),$U14/($F14-$E14)*(DA$6-CZ$6)),$U14/($F14-$E14)*(DA$6-$E14)),\"x\")))","v":"x"},"x","x","x","x","x","x","x","x","x","x","x","x","x","x","x","x","x","x","x","x","x","x","x","x","x","x","x","x","x","x","x","x","x","x","x","x",null,null,null,0,null,{"$f":"IF(OR($V14=\"Utility\",$AA14=0),\"x\",IF($G14=\"cold\",\"x\",IF(AND(EQ$6>$F14,EP$6<$E14),IF(EP$6>$F14,IF(EQ$6>$E14,$U14/($E14-$F14)*($E14-EP$6),$U14/($E14-$F14)*(EQ$6-EP$6)),$U14/($E14-$F14)*(EQ$6-$F14)),\"x\")))","v":"x"},"x","x","x","x","x","x","x","x","x","x","x","x","x","x","x","x","x","x","x","x","x","x","x","x","x","x","x","x","x","x","x",{"$f":"IF(OR($V14=\"Utility\",$AA14=0),\"x\",IF($G14=\"cold\",\"x\",IF(AND(FW$6>$F14,FV$6<$E14),IF(FV$6>$F14,IF(FW$6>$E14,$U14/($E14-$F14)*($E14-FV$6),$U14/($E14-$F14)*(FW$6-FV$6)),$U14/($E14-$F14)*(FW$6-$F14)),\"x\")))","v":"x"},"x","x","x","x","x","x","x","x","x","x","x","x","x","x","x","x","x","x","x","x","x","x","x","x","x","x","x","x","x","x","x",{"$f":"IF(OR($V14=\"Utility\",$AA14=0),\"x\",IF($G14=\"cold\",\"x\",IF(AND(HC$6>$F14,HB$6<$E14),IF(HB$6>$F14,IF(HC$6>$E14,$U14/($E14-$F14)*($E14-HB$6),$U14/($E14-$F14)*(HC$6-HB$6)),$U14/($E14-$F14)*(HC$6-$F14)),\"x\")))","v":"x"},"x","x","x","x","x","x","x","x","x","x","x","x","x","x","x","x","x","x","x","x","x","x","x","x","x","x","x","x","x","x","x","x","x","x","x","x",null,null,null,"Slope HCC",{"$f":"IF(OR(IR12<$AJ$6-dTminActual/2,IR12>=$AJ$7-dTminActual/2),0,INDEX($EQ$3:$IM$6,1,IR24+1)/(INDEX($EQ$3:$IM$6,3,IR24+1)-INDEX($EQ$3:$IM$6,3,IR24)))","v":0},0,0,0,0,0,0,0,0,0,0,0,0,0,0,0,0,0,0,0,0,0,0,0,0,0,0,0,0,0,0,0,{"$f":"IF(OR(JX12<$AJ$6-dTminActual/2,JX12>=$AJ$7-dTminActual/2),0,INDEX($EQ$3:$IM$6,1,JX24+1)/(INDEX($EQ$3:$IM$6,3,JX24+1)-INDEX($EQ$3:$IM$6,3,JX24)))","v":0},0,0,0,0,0,0,0,0,0,0,0,0,0,0,0,0,0,0,0,0,0,0,0,10,{"$f":"IF(OR(KW12<$AJ$6-dTminActual/2,KW12>=$AJ$7-dTminActual/2),0,INDEX($EQ$3:$IM$6,1,KW24+1)/(INDEX($EQ$3:$IM$6,3,KW24+1)-INDEX($EQ$3:$IM$6,3,KW24)))","v":0},0,0,0,0,0,0,0,0,0,0,0,0,0,0,0,0,0,0,0,0,0,0,0,0,0,0,0,0,0,0,0,0,0,0,0,0,0,0,0,0,0,0,0]
["",{"$f":"IF(G17=\"hot\",COUNTIF($G$5:G17,\"hot\"),\"\")","v":""},{"$f":"IF(G17=\"cold\",COUNTIF($G$5:G17,\"cold\"),\"\")","v":""},null,null,null,"",null,null,"","","",null,null,2,20,5,50,null,null,"",null,"","","","","",null,null,null,null,null,null,null,"CCC high",{"$f":"EK4","v":0},"MWh",null,0,null,{"$f":"IF(OR($V15=\"Utility\",$AA15=0),\"x\",IF($G15=\"hot\",\"x\",IF(AND(AO$6>$E15,AN$6<$F15),IF(AN$6>$E15,IF(AO$6>$F15,$U15/($F15-$E15)*($F15-AN$6),$U15/($F15-$E15)*(AO$6-AN$6)),$U15/($F15-$E15)*(AO$6-$E15)),\"x\")))","v":"x"},"x","x","x","x","x","x","x","x","x","x","x","x","x","x","x","x","x","x","x","x","x","x","x","x","x","x","x","x","x","x","x",{"$f":"IF(OR($V15=\"Utility\",$AA15=0),\"x\",IF($G15=\"hot\",\"x\",IF(AND(BU$6>$E15,BT$6<$F15),IF(BT$6>$E15,IF(BU$6>$F15,$U15/($F15-$E15)*($F15-BT$6),$U15/($F15-$E15)*(BU$6-BT$6)),$U15/($F15-$E15)*(BU$6-$E15)),\"x\")))","v":"x"},"x","x","x","x","x","x","x","x","x","x","x","x","x","x","x","x","x","x","x","x","x","x","x","x","x","x","x","x","x","x","x",{"$f":"IF(OR($V15=\"Utility\",$AA15=0),\"x\",IF($G15=\"hot\",\"x\",IF(AND(DA$6>$E15,CZ$6<$F15),IF(CZ$6>$E15,IF(DA$6>$F15,$U15/($F15-$E15)*($F15-CZ$6),$U15/($F15-$E15)*(DA$6-CZ$6)),$U15/($F15-$E15)*(DA$6-$E15)),\"x\")))","v":"x"},"x","x","x","x","x","x","x","x","x","x","x","x","x","x","x","x","x","x","x","x","x","x","x","x","x","x","x","x","x","x","x","x","x","x","x","x",null,null,null,0,null,{"$f":"IF(OR($V15=\"Utility\",$AA15=0),\"x\",IF($G15=\"cold\",\"x\",IF(AND(EQ$6>$F15,EP$6<$E15),IF(EP$6>$F15,IF(EQ$6>$E15,$U15/($E15-$F15)*($E15-EP$6),$U15/($E15-$F15)*(EQ$6-EP$6)),$U15/($E15-$F15)*(EQ$6-$F15)),\"x\")))","v":"x"},"x","x","x","x","x","x","x","x","x","x","x","x","x","x","x","x","x","x","x","x","x","x","x","x","x","x","x","x","x","x","x",{"$f":"IF(OR($V15=\"Utility\",$AA15=0),\"x\",IF($G15=\"cold\",\"x\",IF(AND(FW$6>$F15,FV$6<$E15),IF(FV$6>$F15,IF(FW$6>$E15,$U15/($E15-$F15)*($E15-FV$6),$U15/($E15-$F15)*(FW$6-FV$6)),$U15/($E15-$F15)*(FW$6-$F15)),\"x\")))","v":"x"},"x","x","x","x","x","x","x","x","x","x","x","x","x","x","x","x","x","x","x","x","x","x","x","x","x","x","x","x","x","x","x",{"$f":"IF(OR($V15=\"Utility\",$AA15=0),\"x\",IF($G15=\"cold\",\"x\",IF(AND(HC$6>$F15,HB$6<$E15),IF(HB$6>$F15,IF(HC$6>$E15,$U15/($E15-$F15)*($E15-HB$6),$U15/($E15-$F15)*(HC$6-HB$6)),$U15/($E15-$F15)*(HC$6-$F15)),\"x\")))","v":"x"},"x","x","x","x","x","x","x","x","x","x","x","x","x","x","x","x","x","x","x","x","x","x","x","x","x","x","x","x","x","x","x","x","x","x","x","x",null,null,null,"H CCC",{"$f":"IR15*(IS12-IR12)","v":0},{"$f":"IS15*(IT12-IS12)","v":0},0,0,0,0,0,0,0,0,0,0,0,0,0,0,0,0,0,0,0,0,0,0,0,0,0,0,0,0,0,0,0,0,0,0,0,0,0,0,0,0,0,0,0,0,0,0,0,0,0,0,0,0,0,0,0,0,0,0,0,0,0,0,0,{"$f":"LE15*(LF12-LE12)","v":0},0,0,0,0,0,0,0,0,0,0,0,0,0,0,0,0,0,0,0,0,0,0,0,0,0,0,0,0,0,0,0,0,0,0,0]
[{"$f":"IF(D18=\"\",\"\",A17+1)","v":""},{"$f":"IF(G18=\"hot\",COUNTIF($G$5:G18,\"hot\"),\"\")","v":""},{"$f":"IF(G18=\"cold\",COUNTIF($G$5:G18,\"cold\"),\"\")","v":""},null,null,null,"",null,null,"","","",null,null,null,null,null,null,null,null,"",null,"","","","","",null,null,null,null,null,null,null,"CCC low",{"$f":"AO4","v":0},"MWh",null,0,null,{"$f":"IF(OR($V16=\"Utility\",$AA16=0),\"x\",IF($G16=\"hot\",\"x\",IF(AND(AO$6>$E16,AN$6<$F16),IF(AN$6>$E16,IF(AO$6>$F16,$U16/($F16-$E16)*($F16-AN$6),$U16/($F16-$E16)*(AO$6-AN$6)),$U16/($F16-$E16)*(AO$6-$E16)),\"x\")))","v":"x"},"x","x","x","x","x","x","x","x","x","x","x","x","x","x","x","x","x","x","x","x","x","x","x","x","x","x","x","x","x","x","x",{"$f":"IF(OR($V16=\"Utility\",$AA16=0),\"x\",IF($G16=\"hot\",\"x\",IF(AND(BU$6>$E16,BT$6<$F16),IF(BT$6>$E16,IF(BU$6>$F16,$U16/($F16-$E16)*($F16-BT$6),$U16/($F16-$E16)*(BU$6-BT$6)),$U16/($F16-$E16)*(BU$6-$E16)),\"x\")))","v":"x"},"x","x","x","x","x","x","x","x","x","x","x","x","x","x","x","x","x","x","x","x","x","x","x","x","x","x","x","x","x","x","x",{"$f":"IF(OR($V16=\"Utility\",$AA16=0),\"x\",IF($G16=\"hot\",\"x\",IF(AND(DA$6>$E16,CZ$6<$F16),IF(CZ$6>$E16,IF(DA$6>$F16,$U16/($F16-$E16)*($F16-CZ$6),$U16/($F16-$E16)*(DA$6-CZ$6)),$U16/($F16-$E16)*(DA$6-$E16)),\"x\")))","v":"x"},"x","x","x","x","x","x","x","x","x","x","x","x","x","x","x","x","x","x","x","x","x","x","x","x","x","x","x","x","x","x","x","x","x","x","x","x",null,null,null,0,null,{"$f":"IF(OR($V16=\"Utility\",$AA16=0),\"x\",IF($G16=\"cold\",\"x\",IF(AND(EQ$6>$F16,EP$6<$E16),IF(EP$6>$F16,IF(EQ$6>$E16,$U16/($E16-$F16)*($E16-EP$6),$U16/($E16-$F16)*(EQ$6-EP$6)),$U16/($E16-$F16)*(EQ$6-$F16)),\"x\")))","v":"x"},"x","x","x","x","x","x","x","x","x","x","x","x","x","x","x","x","x","x","x","x","x","x","x","x","x","x","x","x","x","x","x",{"$f":"IF(OR($V16=\"Utility\",$AA16=0),\"x\",IF($G16=\"cold\",\"x\",IF(AND(FW$6>$F16,FV$6<$E16),IF(FV$6>$F16,IF(FW$6>$E16,$U16/($E16-$F16)*($E16-FV$6),$U16/($E16-$F16)*(FW$6-FV$6)),$U16/($E16-$F16)*(FW$6-$F16)),\"x\")))","v":"x"},"x","x","x","x","x","x","x","x","x","x","x","x","x","x","x","x","x","x","x","x","x","x","x","x","x","x","x","x","x","x","x",{"$f":"IF(OR($V16=\"Utility\",$AA16=0),\"x\",IF($G16=\"cold\",\"x\",IF(AND(HC$6>$F16,HB$6<$E16),IF(HB$6>$F16,IF(HC$6>$E16,$U16/($E16-$F16)*($E16-HB$6),$U16/($E16-$F16)*(HC$6-HB$6)),$U16/($E16-$F16)*(HC$6-$F16)),\"x\")))","v":"x"},"x","x","x","x","x","x","x","x","x","x","x","x","x","x","x","x","x","x","x","x","x","x","x","x","x","x","x","x","x","x","x","x","x","x","x","x",null,null,null,"H HCC",{"$f":"IR16*(IS12-IR12)","v":0},{"$f":"IS16*(IT12-IS12)","v":0},0,0,0,0,0,0,0,0,0,0,0,0,0,0,0,0,0,0,0,0,0,0,0,0,0,0,0,0,0,0,0,0,0,0,0,0,0,0,0,0,0,0,0,0,0,0,0,0,0,0,0,0,0,0,0,0,0,0,0,0,0,0,0,{"$f":"LE16*(LF12-LE12)","v":0},0,0,0,0,0,0,0,0,0,0,0,0,0,0,0,0,0,0,0,0,0,0,0,0,0,0,0,0,0,0,0,0,0,0,0]
[{"$f":"IF(D19=\"\",\"\",A18+1)","v":""},{"$f":"IF(G19=\"hot\",COUNTIF($G$5:G19,\"hot\"),\"\")","v":""},{"$f":"IF(G19=\"cold\",COUNTIF($G$5:G19,\"cold\"),\"\")","v":""},null,null,null,"",null,null,"","","",null,null,null,null,null,null,null,null,"",null,"","","","","",null,null,null,null,null,null,null,"HCC high",{"$f":"IM4","v":0},"MWh",null,0,null,{"$f":"IF(OR($V17=\"Utility\",$AA17=0),\"x\",IF($G17=\"hot\",\"x\",IF(AND(AO$6>$E17,AN$6<$F17),IF(AN$6>$E17,IF(AO$6>$F17,$U17/($F17-$E17)*($F17-AN$6),$U17/($F17-$E17)*(AO$6-AN$6)),$U17/($F17-$E17)*(AO$6-$E17)),\"x\")))","v":"x"},"x","x","x","x","x","x","x","x","x","x","x","x","x","x","x","x","x","x","x","x","x","x","x","x","x","x","x","x","x","x","x",{"$f":"IF(OR($V17=\"Utility\",$AA17=0),\"x\",IF($G17=\"hot\",\"x\",IF(AND(BU$6>$E17,BT$6<$F17),IF(BT$6>$E17,IF(BU$6>$F17,$U17/($F17-$E17)*($F17-BT$6),$U17/($F17-$E17)*(BU$6-BT$6)),$U17/($F17-$E17)*(BU$6-$E17)),\"x\")))","v":"x"},"x","x","x","x","x","x","x","x","x","x","x","x","x","x","x","x","x","x","x","x","x","x","x","x","x","x","x","x","x","x","x",{"$f":"IF(OR($V17=\"Utility\",$AA17=0),\"x\",IF($G17=\"hot\",\"x\",IF(AND(DA$6>$E17,CZ$6<$F17),IF(CZ$6>$E17,IF(DA$6>$F17,$U17/($F17-$E17)*($F17-CZ$6),$U17/($F17-$E17)*(DA$6-CZ$6)),$U17/($F17-$E17)*(DA$6-$E17)),\"x\")))","v":"x"},"x","x","x","x","x","x","x","x","x","x","x","x","x","x","x","x","x","x","x","x","x","x","x","x","x","x","x","x","x","x","x","x","x","x","x","x",null,null,null,0,null,{"$f":"IF(OR($V17=\"Utility\",$AA17=0),\"x\",IF($G17=\"cold\",\"x\",IF(AND(EQ$6>$F17,EP$6<$E17),IF(EP$6>$F17,IF(EQ$6>$E17,$U17/($E17-$F17)*($E17-EP$6),$U17/($E17-$F17)*(EQ$6-EP$6)),$U17/($E17-$F17)*(EQ$6-$F17)),\"x\")))","v":"x"},"x","x","x","x","x","x","x","x","x","x","x","x","x","x","x","x","x","x","x","x","x","x","x","x","x","x","x","x","x","x","x",{"$f":"IF(OR($V17=\"Utility\",$AA17=0),\"x\",IF($G17=\"cold\",\"x\",IF(AND(FW$6>$F17,FV$6<$E17),IF(FV$6>$F17,IF(FW$6>$E17,$U17/($E17-$F17)*($E17-FV$6),$U17/($E17-$F17)*(FW$6-FV$6)),$U17/($E17-$F17)*(FW$6-$F17)),\"x\")))","v":"x"},"x","x","x","x","x","x","x","x","x","x","x","x","x","x","x","x","x","x","x","x","x","x","x","x","x","x","x","x","x","x","x",{"$f":"IF(OR($V17=\"Utility\",$AA17=0),\"x\",IF($G17=\"cold\",\"x\",IF(AND(HC$6>$F17,HB$6<$E17),IF(HB$6>$F17,IF(HC$6>$E17,$U17/($E17-$F17)*($E17-HB$6),$U17/($E17-$F17)*(HC$6-HB$6)),$U17/($E17-$F17)*(HC$6-$F17)),\"x\")))","v":"x"},"x","x","x","x","x","x","x","x","x","x","x","x","x","x","x","x","x","x","x","x","x","x","x","x","x","x","x","x","x","x","x","x","x","x","x","x",null,null,null,"acc",{"$f":"IR17","v":0},{"$f":"IS17+IR19","v":0},{"$f":"IT17+IS19","v":0},0,0,0,0,0,0,0,0,0,0,0,0,0,0,0,0,0,0,0,0,0,0,0,0,0,0,0,0,0,0,0,0,0,0,0,0,0,0,0,0,0,0,0,0,0,0,0,0,0,0,0,0,0,0,0,0,0,0,0,0,0,0,0,{"$f":"LF17+LE19","v":0},0,0,0,0,{"$f":"LK17+LJ19","v":0},{"$f":"LL17+LK19","v":0},0,0,0,0,0,0,0,0,0,0,0,0,0,0,0,0,0,0,0,0,0,0,0,0,0,0,0,0]
["",{"$f":"IF(G20=\"hot\",COUNTIF($G$5:G20,\"hot\"),\"\")","v":""},{"$f":"IF(G20=\"cold\",COUNTIF($G$5:G20,\"cold\"),\"\")","v":""},null,null,null,"",null,null,"","","",null,null,null,null,null,null,null,null,"",null,"","","","","",null,null,null,null,null,null,null,"HCC low",{"$f":"EQ4","v":0},"MWh",null,0,null,{"$f":"IF(OR($V18=\"Utility\",$AA18=0),\"x\",IF($G18=\"hot\",\"x\",IF(AND(AO$6>$E18,AN$6<$F18),IF(AN$6>$E18,IF(AO$6>$F18,$U18/($F18-$E18)*($F18-AN$6),$U18/($F18-$E18)*(AO$6-AN$6)),$U18/($F18-$E18)*(AO$6-$E18)),\"x\")))","v":"x"},"x","x","x","x","x","x","x","x","x","x","x","x","x","x","x","x","x","x","x","x","x","x","x","x","x","x","x","x","x","x","x",{"$f":"IF(OR($V18=\"Utility\",$AA18=0),\"x\",IF($G18=\"hot\",\"x\",IF(AND(BU$6>$E18,BT$6<$F18),IF(BT$6>$E18,IF(BU$6>$F18,$U18/($F18-$E18)*($F18-BT$6),$U18/($F18-$E18)*(BU$6-BT$6)),$U18/($F18-$E18)*(BU$6-$E18)),\"x\")))","v":"x"},"x","x","x","x","x","x","x","x","x","x","x","x","x","x","x","x","x","x","x","x","x","x","x","x","x","x","x","x","x","x","x",{"$f":"IF(OR($V18=\"Utility\",$AA18=0),\"x\",IF($G18=\"hot\",\"x\",IF(AND(DA$6>$E18,CZ$6<$F18),IF(CZ$6>$E18,IF(DA$6>$F18,$U18/($F18-$E18)*($F18-CZ$6),$U18/($F18-$E18)*(DA$6-CZ$6)),$U18/($F18-$E18)*(DA$6-$E18)),\"x\")))","v":"x"},"x","x","x","x","x","x","x","x","x","x","x","x","x","x","x","x","x","x","x","x","x","x","x","x","x","x","x","x","x","x","x","x","x","x","x","x",null,null,null,0,null,{"$f":"IF(OR($V18=\"Utility\",$AA18=0),\"x\",IF($G18=\"cold\",\"x\",IF(AND(EQ$6>$F18,EP$6<$E18),IF(EP$6>$F18,IF(EQ$6>$E18,$U18/($E18-$F18)*($E18-EP$6),$U18/($E18-$F18)*(EQ$6-EP$6)),$U18/($E18-$F18)*(EQ$6-$F18)),\"x\")))","v":"x"},"x","x","x","x","x","x","x","x","x","x","x","x","x","x","x","x","x","x","x","x","x","x","x","x","x","x","x","x","x","x","x",{"$f":"IF(OR($V18=\"Utility\",$AA18=0),\"x\",IF($G18=\"cold\",\"x\",IF(AND(FW$6>$F18,FV$6<$E18),IF(FV$6>$F18,IF(FW$6>$E18,$U18/($E18-$F18)*($E18-FV$6),$U18/($E18-$F18)*(FW$6-FV$6)),$U18/($E18-$F18)*(FW$6-$F18)),\"x\")))","v":"x"},"x","x","x","x","x","x","x","x","x","x","x","x","x","x","x","x","x","x","x","x","x","x","x","x","x","x","x","x","x","x","x",{"$f":"IF(OR($V18=\"Utility\",$AA18=0),\"x\",IF($G18=\"cold\",\"x\",IF(AND(HC$6>$F18,HB$6<$E18),IF(HB$6>$F18,IF(HC$6>$E18,$U18/($E18-$F18)*($E18-HB$6),$U18/($E18-$F18)*(HC$6-HB$6)),$U18/($E18-$F18)*(HC$6-$F18)),\"x\")))","v":"x"},"x","x","x","x","x","x","x","x","x","x","x","x","x","x","x","x","x","x","x","x","x","x","x","x","x","x","x","x","x","x","x","x","x","x","x","x",null,null,null,"acc",{"$f":"IR18","v":0},{"$f":"IS18+IR20","v":0},{"$f":"IT18+IS20","v":0},0,0,0,0,0,0,0,0,0,0,0,0,0,0,0,0,0,0,0,0,0,0,0,0,0,0,0,0,0,0,0,0,0,0,0,0,0,0,0,0,0,0,0,0,0,0,0,0,0,0,0,0,0,0,0,0,0,0,0,0,0,0,0,{"$f":"LF18+LE20","v":0},0,0,0,0,{"$f":"LK18+LJ20","v":0},{"$f":"LL18+LK20","v":0},0,0,0,0,0,0,0,0,0,0,0,0,0,0,0,0,0,0,0,0,0,0,0,0,0,0,0,0]
["",{"$f":"IF(G21=\"hot\",COUNTIF($G$5:G21,\"hot\"),\"\")","v":""},{"$f":"IF(G21=\"cold\",COUNTIF($G$5:G21,\"cold\"),\"\")","v":""},null,null,null,"",null,null,"","","",null,null,null,null,null,null,null,null,"",null,"","","","","",null,null,null,null,null,null,null,null,null,null,null,0,null,{"$f":"IF(OR($V19=\"Utility\",$AA19=0),\"x\",IF($G19=\"hot\",\"x\",IF(AND(AO$6>$E19,AN$6<$F19),IF(AN$6>$E19,IF(AO$6>$F19,$U19/($F19-$E19)*($F19-AN$6),$U19/($F19-$E19)*(AO$6-AN$6)),$U19/($F19-$E19)*(AO$6-$E19)),\"x\")))","v":"x"},"x","x","x","x","x","x","x","x","x","x","x","x","x","x","x","x","x","x","x","x","x","x","x","x","x","x","x","x","x","x","x",{"$f":"IF(OR($V19=\"Utility\",$AA19=0),\"x\",IF($G19=\"hot\",\"x\",IF(AND(BU$6>$E19,BT$6<$F19),IF(BT$6>$E19,IF(BU$6>$F19,$U19/($F19-$E19)*($F19-BT$6),$U19/($F19-$E19)*(BU$6-BT$6)),$U19/($F19-$E19)*(BU$6-$E19)),\"x\")))","v":"x"},"x","x","x","x","x","x","x","x","x","x","x","x","x","x","x","x","x","x","x","x","x","x","x","x","x","x","x","x","x","x","x",{"$f":"IF(OR($V19=\"Utility\",$AA19=0),\"x\",IF($G19=\"hot\",\"x\",IF(AND(DA$6>$E19,CZ$6<$F19),IF(CZ$6>$E19,IF(DA$6>$F19,$U19/($F19-$E19)*($F19-CZ$6),$U19/($F19-$E19)*(DA$6-CZ$6)),$U19/($F19-$E19)*(DA$6-$E19)),\"x\")))","v":"x"},"x","x","x","x","x","x","x","x","x","x","x","x","x","x","x","x","x","x","x","x","x","x","x","x","x","x","x","x","x","x","x","x","x","x","x","x",null,null,null,0,null,{"$f":"IF(OR($V19=\"Utility\",$AA19=0),\"x\",IF($G19=\"cold\",\"x\",IF(AND(EQ$6>$F19,EP$6<$E19),IF(EP$6>$F19,IF(EQ$6>$E19,$U19/($E19-$F19)*($E19-EP$6),$U19/($E19-$F19)*(EQ$6-EP$6)),$U19/($E19-$F19)*(EQ$6-$F19)),\"x\")))","v":"x"},"x","x","x","x","x","x","x","x","x","x","x","x","x","x","x","x","x","x","x","x","x","x","x","x","x","x","x","x","x","x","x",{"$f":"IF(OR($V19=\"Utility\",$AA19=0),\"x\",IF($G19=\"cold\",\"x\",IF(AND(FW$6>$F19,FV$6<$E19),IF(FV$6>$F19,IF(FW$6>$E19,$U19/($E19-$F19)*($E19-FV$6),$U19/($E19-$F19)*(FW$6-FV$6)),$U19/($E19-$F19)*(FW$6-$F19)),\"x\")))","v":"x"},"x","x","x","x","x","x","x","x","x","x","x","x","x","x","x","x","x","x","x","x","x","x","x","x","x","x","x","x","x","x","x",{"$f":"IF(OR($V19=\"Utility\",$AA19=0),\"x\",IF($G19=\"cold\",\"x\",IF(AND(HC$6>$F19,HB$6<$E19),IF(HB$6>$F19,IF(HC$6>$E19,$U19/($E19-$F19)*($E19-HB$6),$U19/($E19-$F19)*(HC$6-HB$6)),$U19/($E19-$F19)*(HC$6-$F19)),\"x\")))","v":"x"},"x","x","x","x","x","x","x","x","x","x","x","x","x","x","x","x","x","x","x","x","x","x","x","x","x","x","x","x","x","x","x","x","x","x","x","x",null,null,null,"dH",{"$f":"IR19-IR20+ShiftGCC","v":0},{"$f":"IS19-IS20+ShiftGCC","v":0},{"$f":"IT19-IT20+ShiftGCC","v":0},0,0,0,0,0,{"$f":"IZ19-IZ20+ShiftGCC","v":0},0,0,0,0,0,0,0,0,0,0,0,0,0,0,0,0,0,0,0,0,0,0,0,0,0,0,0,0,0,0,0,0,0,0,0,0,0,0,0,0,0,0,0,0,0,0,0,0,0,0,0,0,0,0,0,0,0,{"$f":"LF19-LF20+ShiftGCC","v":0},0,0,0,0,0,0,0,0,0,0,0,0,0,0,0,0,0,0,0,0,0,0,0,0,0,0,0,0,0,0,0,0,0,0]
["",{"$f":"IF(G22=\"hot\",COUNTIF($G$5:G22,\"hot\"),\"\")","v":""},{"$f":"IF(G22=\"cold\",COUNTIF($G$5:G22,\"cold\"),\"\")","v":""},null,null,null,"",null,null,"","","",null,null,null,null,null,null,null,null,"",null,"","","","","",null,null,null,null,null,null,null,null,null,null,null,0,null,{"$f":"IF(OR($V20=\"Utility\",$AA20=0),\"x\",IF($G20=\"hot\",\"x\",IF(AND(AO$6>$E20,AN$6<$F20),IF(AN$6>$E20,IF(AO$6>$F20,$U20/($F20-$E20)*($F20-AN$6),$U20/($F20-$E20)*(AO$6-AN$6)),$U20/($F20-$E20)*(AO$6-$E20)),\"x\")))","v":"x"},"x","x","x","x","x","x","x","x","x","x","x","x","x","x","x","x","x","x","x","x","x","x","x","x","x","x","x","x","x","x","x",{"$f":"IF(OR($V20=\"Utility\",$AA20=0),\"x\",IF($G20=\"hot\",\"x\",IF(AND(BU$6>$E20,BT$6<$F20),IF(BT$6>$E20,IF(BU$6>$F20,$U20/($F20-$E20)*($F20-BT$6),$U20/($F20-$E20)*(BU$6-BT$6)),$U20/($F20-$E20)*(BU$6-$E20)),\"x\")))","v":"x"},"x","x","x","x","x","x","x","x","x","x","x","x","x","x","x","x","x","x","x","x","x","x","x","x","x","x","x","x","x","x","x",{"$f":"IF(OR($V20=\"Utility\",$AA20=0),\"x\",IF($G20=\"hot\",\"x\",IF(AND(DA$6>$E20,CZ$6<$F20),IF(CZ$6>$E20,IF(DA$6>$F20,$U20/($F20-$E20)*($F20-CZ$6),$U20/($F20-$E20)*(DA$6-CZ$6)),$U20/($F20-$E20)*(DA$6-$E20)),\"x\")))","v":"x"},"x","x","x","x","x","x","x","x","x","x","x","x","x","x","x","x","x","x","x","x","x","x","x","x","x","x","x","x","x","x","x","x","x","x","x","x",null,null,null,0,null,{"$f":"IF(OR($V20=\"Utility\",$AA20=0),\"x\",IF($G20=\"cold\",\"x\",IF(AND(EQ$6>$F20,EP$6<$E20),IF(EP$6>$F20,IF(EQ$6>$E20,$U20/($E20-$F20)*($E20-EP$6),$U20/($E20-$F20)*(EQ$6-EP$6)),$U20/($E20-$F20)*(EQ$6-$F20)),\"x\")))","v":"x"},"x","x","x","x","x","x","x","x","x","x","x","x","x","x","x","x","x","x","x","x","x","x","x","x","x","x","x","x","x","x","x",{"$f":"IF(OR($V20=\"Utility\",$AA20=0),\"x\",IF($G20=\"cold\",\"x\",IF(AND(FW$6>$F20,FV$6<$E20),IF(FV$6>$F20,IF(FW$6>$E20,$U20/($E20-$F20)*($E20-FV$6),$U20/($E20-$F20)*(FW$6-FV$6)),$U20/($E20-$F20)*(FW$6-$F20)),\"x\")))","v":"x"},"x","x","x","x","x","x","x","x","x","x","x","x","x","x","x","x","x","x","x","x","x","x","x","x","x","x","x","x","x","x","x",{"$f":"IF(OR($V20=\"Utility\",$AA20=0),\"x\",IF($G20=\"cold\",\"x\",IF(AND(HC$6>$F20,HB$6<$E20),IF(HB$6>$F20,IF(HC$6>$E20,$U20/($E20-$F20)*($E20-HB$6),$U20/($E20-$F20)*(HC$6-HB$6)),$U20/($E20-$F20)*(HC$6-$F20)),\"x\")))","v":"x"},"x","x","x","x","x","x","x","x","x","x","x","x","x","x","x","x","x","x","x","x","x","x","x","x","x","x","x","x","x","x","x","x","x","x","x","x"]
["",{"$f":"IF(G23=\"hot\",COUNTIF($G$5:G23,\"hot\"),\"\")","v":""},{"$f":"IF(G23=\"cold\",COUNTIF($G$5:G23,\"cold\"),\"\")","v":""},null,null,null,"",null,null,"","","",null,null,null,null,null,null,null,null,"",null,"","","","","",null,null,null,null,null,null,null,null,null,null,null,0,null,{"$f":"IF(OR($V21=\"Utility\",$AA21=0),\"x\",IF($G21=\"hot\",\"x\",IF(AND(AO$6>$E21,AN$6<$F21),IF(AN$6>$E21,IF(AO$6>$F21,$U21/($F21-$E21)*($F21-AN$6),$U21/($F21-$E21)*(AO$6-AN$6)),$U21/($F21-$E21)*(AO$6-$E21)),\"x\")))","v":"x"},"x","x","x","x","x","x","x","x","x","x","x","x","x","x","x","x","x","x","x","x","x","x","x","x","x","x","x","x","x","x","x",{"$f":"IF(OR($V21=\"Utility\",$AA21=0),\"x\",IF($G21=\"hot\",\"x\",IF(AND(BU$6>$E21,BT$6<$F21),IF(BT$6>$E21,IF(BU$6>$F21,$U21/($F21-$E21)*($F21-BT$6),$U21/($F21-$E21)*(BU$6-BT$6)),$U21/($F21-$E21)*(BU$6-$E21)),\"x\")))","v":"x"},"x","x","x","x","x","x","x","x","x","x","x","x","x","x","x","x","x","x","x","x","x","x","x","x","x","x","x","x","x","x","x",{"$f":"IF(OR($V21=\"Utility\",$AA21=0),\"x\",IF($G21=\"hot\",\"x\",IF(AND(DA$6>$E21,CZ$6<$F21),IF(CZ$6>$E21,IF(DA$6>$F21,$U21/($F21-$E21)*($F21-CZ$6),$U21/($F21-$E21)*(DA$6-CZ$6)),$U21/($F21-$E21)*(DA$6-$E21)),\"x\")))","v":"x"},"x","x","x","x","x","x","x","x","x","x","x","x","x","x","x","x","x","x","x","x","x","x","x","x","x","x","x","x","x","x","x","x","x","x","x","x",null,null,null,0,null,{"$f":"IF(OR($V21=\"Utility\",$AA21=0),\"x\",IF($G21=\"cold\",\"x\",IF(AND(EQ$6>$F21,EP$6<$E21),IF(EP$6>$F21,IF(EQ$6>$E21,$U21/($E21-$F21)*($E21-EP$6),$U21/($E21-$F21)*(EQ$6-EP$6)),$U21/($E21-$F21)*(EQ$6-$F21)),\"x\")))","v":"x"},"x","x","x","x","x","x","x","x","x","x","x","x","x","x","x","x","x","x","x","x","x","x","x","x","x","x","x","x","x","x","x",{"$f":"IF(OR($V21=\"Utility\",$AA21=0),\"x\",IF($G21=\"cold\",\"x\",IF(AND(FW$6>$F21,FV$6<$E21),IF(FV$6>$F21,IF(FW$6>$E21,$U21/($E21-$F21)*($E21-FV$6),$U21/($E21-$F21)*(FW$6-FV$6)),$U21/($E21-$F21)*(FW$6-$F21)),\"x\")))","v":"x"},"x","x","x","x","x","x","x","x","x","x","x","x","x","x","x","x","x","x","x","x","x","x","x","x","x","x","x","x","x","x","x",{"$f":"IF(OR($V21=\"Utility\",$AA21=0),\"x\",IF($G21=\"cold\",\"x\",IF(AND(HC$6>$F21,HB$6<$E21),IF(HB$6>$F21,IF(HC$6>$E21,$U21/($E21-$F21)*($E21-HB$6),$U21/($E21-$F21)*(HC$6-HB$6)),$U21/($E21-$F21)*(HC$6-$F21)),\"x\")))","v":"x"},"x","x","x","x","x","x","x","x","x","x","x","x","x","x","x","x","x","x","x","x","x","x","x","x","x","x","x","x","x","x","x","x","x","x","x","x",null,null,null,"Column CCC",{"$f":"MATCH(IR12,$AO$5:$EK$5,1)","v":101},101,101,101,101,101,101,101,101,101,101,101,101,101,101,101,101,101,101,101,101,101,101,101,101,101,101,101,101,101,101,101,{"$f":"MATCH(JX12,$AO$5:$EK$5,1)","v":101},101,101,101,101,101,101,101,101,101,101,101,101,101,101,101,101,101,101,101,101,101,101,101,101,101,101,101,101,101,101,101,{"$f":"MATCH(LD12,$AO$5:$EK$5,1)","v":101},101,101,101,101,101,101,101,101,101,101,101,101,101,101,101,101,101,101,101,101,101,101,101,101,101,101,101,101,101,101,101,101,101,101,101,101]
["",{"$f":"IF(G24=\"hot\",COUNTIF($G$5:G24,\"hot\"),\"\")","v":""},{"$f":"IF(G24=\"cold\",COUNTIF($G$5:G24,\"cold\"),\"\")","v":""},null,null,null,"",null,null,"","","",null,null,null,null,null,null,null,null,"",null,"","","","","",null,null,null,null,null,null,null,"Maximal Heat Recovery",{"$f":"IF(MinHU=0,AJ17-AJ18,AJ19-AJ18)","v":0},"MWh",null,0,null,{"$f":"IF(OR($V22=\"Utility\",$AA22=0),\"x\",IF($G22=\"hot\",\"x\",IF(AND(AO$6>$E22,AN$6<$F22),IF(AN$6>$E22,IF(AO$6>$F22,$U22/($F22-$E22)*($F22-AN$6),$U22/($F22-$E22)*(AO$6-AN$6)),$U22/($F22-$E22)*(AO$6-$E22)),\"x\")))","v":"x"},"x","x","x","x","x","x","x","x","x","x","x","x","x","x","x","x","x","x","x","x","x","x","x","x","x","x","x","x","x","x","x",{"$f":"IF(OR($V22=\"Utility\",$AA22=0),\"x\",IF($G22=\"hot\",\"x\",IF(AND(BU$6>$E22,BT$6<$F22),IF(BT$6>$E22,IF(BU$6>$F22,$U22/($F22-$E22)*($F22-BT$6),$U22/($F22-$E22)*(BU$6-BT$6)),$U22/($F22-$E22)*(BU$6-$E22)),\"x\")))","v":"x"},"x","x","x","x","x","x","x","x","x","x","x","x","x","x","x","x","x","x","x","x","x","x","x","x","x","x","x","x","x","x","x",{"$f":"IF(OR($V22=\"Utility\",$AA22=0),\"x\",IF($G22=\"hot\",\"x\",IF(AND(DA$6>$E22,CZ$6<$F22),IF(CZ$6>$E22,IF(DA$6>$F22,$U22/($F22-$E22)*($F22-CZ$6),$U22/($F22-$E22)*(DA$6-CZ$6)),$U22/($F22-$E22)*(DA$6-$E22)),\"x\")))","v":"x"},"x","x","x","x","x","x","x","x","x","x","x","x","x","x","x","x","x","x","x","x","x","x","x","x","x","x","x","x","x","x","x","x","x","x","x","x",null,null,null,0,null,{"$f":"IF(OR($V22=\"Utility\",$AA22=0),\"x\",IF($G22=\"cold\",\"x\",IF(AND(EQ$6>$F22,EP$6<$E22),IF(EP$6>$F22,IF(EQ$6>$E22,$U22/($E22-$F22)*($E22-EP$6),$U22/($E22-$F22)*(EQ$6-EP$6)),$U22/($E22-$F22)*(EQ$6-$F22)),\"x\")))","v":"x"},"x","x","x","x","x","x","x","x","x","x","x","x","x","x","x","x","x","x","x","x","x","x","x","x","x","x","x","x","x","x","x",{"$f":"IF(OR($V22=\"Utility\",$AA22=0),\"x\",IF($G22=\"cold\",\"x\",IF(AND(FW$6>$F22,FV$6<$E22),IF(FV$6>$F22,IF(FW$6>$E22,$U22/($E22-$F22)*($E22-FV$6),$U22/($E22-$F22)*(FW$6-FV$6)),$U22/($E22-$F22)*(FW$6-$F22)),\"x\")))","v":"x"},"x","x","x","x","x","x","x","x","x","x","x","x","x","x","x","x","x","x","x","x","x","x","x","x","x","x","x","x","x","x","x",{"$f":"IF(OR($V22=\"Utility\",$AA22=0),\"x\",IF($G22=\"cold\",\"x\",IF(AND(HC$6>$F22,HB$6<$E22),IF(HB$6>$F22,IF(HC$6>$E22,$U22/($E22-$F22)*($E22-HB$6),$U22/($E22-$F22)*(HC$6-HB$6)),$U22/($E22-$F22)*(HC$6-$F22)),\"x\")))","v":"x"},"x","x","x","x","x","x","x","x","x","x","x","x","x","x","x","x","x","x","x","x","x","x","x","x","x","x","x","x","x","x","x","x","x","x","x","x",null,null,null,"Column HCCC",{"$f":"MATCH(IR12,$EQ$5:$IM$5,1)","v":101},101,101,101,101,101,101,101,101,101,101,101,101,101,101,101,101,101,101,101,101,101,101,101,101,101,101,101,101,101,101,101,{"$f":"MATCH(JX12,$EQ$5:$IM$5,1)","v":101},101,101,101,101,101,101,101,101,101,101,101,101,101,101,101,101,101,101,101,101,101,101,101,101,101,101,101,101,101,101,101,{"$f":"MATCH(LD12,$EQ$5:$IM$5,1)","v":101},101,101,101,101,101,101,101,101,101,101,101,101,101,101,101,101,101,101,101,101,101,101,101,101,101,101,101,101,101,101,101,101,101,101,101,101]
["",{"$f":"IF(G25=\"hot\",COUNTIF($G$5:G25,\"hot\"),\"\")","v":""},{"$f":"IF(G25=\"cold\",COUNTIF($G$5:G25,\"cold\"),\"\")","v":""},null,null,null,"",null,null,"","","",null,null,null,null,null,null,null,null,"",null,"","","","","",null,null,null,null,null,null,null,"Minimal Hot Utility",{"$f":"IF(AJ17-AJ19<0,0,AJ17-AJ19)","v":0},"MWh",null,0,null,{"$f":"IF(OR($V23=\"Utility\",$AA23=0),\"x\",IF($G23=\"hot\",\"x\",IF(AND(AO$6>$E23,AN$6<$F23),IF(AN$6>$E23,IF(AO$6>$F23,$U23/($F23-$E23)*($F23-AN$6),$U23/($F23-$E23)*(AO$6-AN$6)),$U23/($F23-$E23)*(AO$6-$E23)),\"x\")))","v":"x"},"x","x","x","x","x","x","x","x","x","x","x","x","x","x","x","x","x","x","x","x","x","x","x","x","x","x","x","x","x","x","x",{"$f":"IF(OR($V23=\"Utility\",$AA23=0),\"x\",IF($G23=\"hot\",\"x\",IF(AND(BU$6>$E23,BT$6<$F23),IF(BT$6>$E23,IF(BU$6>$F23,$U23/($F23-$E23)*($F23-BT$6),$U23/($F23-$E23)*(BU$6-BT$6)),$U23/($F23-$E23)*(BU$6-$E23)),\"x\")))","v":"x"},"x","x","x","x","x","x","x","x","x","x","x","x","x","x","x","x","x","x","x","x","x","x","x","x","x","x","x","x","x","x","x",{"$f":"IF(OR($V23=\"Utility\",$AA23=0),\"x\",IF($G23=\"hot\",\"x\",IF(AND(DA$6>$E23,CZ$6<$F23),IF(CZ$6>$E23,IF(DA$6>$F23,$U23/($F23-$E23)*($F23-CZ$6),$U23/($F23-$E23)*(DA$6-CZ$6)),$U23/($F23-$E23)*(DA$6-$E23)),\"x\")))","v":"x"},"x","x","x","x","x","x","x","x","x","x","x","x","x","x","x","x","x","x","x","x","x","x","x","x","x","x","x","x","x","x","x","x","x","x","x","x",null,null,null,0,null,{"$f":"IF(OR($V23=\"Utility\",$AA23=0),\"x\",IF($G23=\"cold\",\"x\",IF(AND(EQ$6>$F23,EP$6<$E23),IF(EP$6>$F23,IF(EQ$6>$E23,$U23/($E23-$F23)*($E23-EP$6),$U23/($E23-$F23)*(EQ$6-EP$6)),$U23/($E23-$F23)*(EQ$6-$F23)),\"x\")))","v":"x"},"x","x","x","x","x","x","x","x","x","x","x","x","x","x","x","x","x","x","x","x","x","x","x","x","x","x","x","x","x","x","x",{"$f":"IF(OR($V23=\"Utility\",$AA23=0),\"x\",IF($G23=\"cold\",\"x\",IF(AND(FW$6>$F23,FV$6<$E23),IF(FV$6>$F23,IF(FW$6>$E23,$U23/($E23-$F23)*($E23-FV$6),$U23/($E23-$F23)*(FW$6-FV$6)),$U23/($E23-$F23)*(FW$6-$F23)),\"x\")))","v":"x"},"x","x","x","x","x","x","x","x","x","x","x","x","x","x","x","x","x","x","x","x","x","x","x","x","x","x","x","x","x","x","x",{"$f":"IF(OR($V23=\"Utility\",$AA23=0),\"x\",IF($G23=\"cold\",\"x\",IF(AND(HC$6>$F23,HB$6<$E23),IF(HB$6>$F23,IF(HC$6>$E23,$U23/($E23-$F23)*($E23-HB$6),$U23/($E23-$F23)*(HC$6-HB$6)),$U23/($E23-$F23)*(HC$6-$F23)),\"x\")))","v":"x"},"x","x","x","x","x","x","x","x","x","x","x","x","x","x","x","x","x","x","x","x","x","x","x","x","x","x","x","x","x","x","x","x","x","x","x","x"]
["",{"$f":"IF(G26=\"hot\",COUNTIF($G$5:G26,\"hot\"),\"\")","v":""},{"$f":"IF(G26=\"cold\",COUNTIF($G$5:G26,\"cold\"),\"\")","v":""},null,null,null,"",null,null,"","","",null,null,null,null,null,null,null,null,"",null,"","","","","",null,null,null,null,null,null,null,"Minimal Cold Utility",{"$f":"AJ18-AJ20","v":0},"MWh",null,0,null,{"$f":"IF(OR($V24=\"Utility\",$AA24=0),\"x\",IF($G24=\"hot\",\"x\",IF(AND(AO$6>$E24,AN$6<$F24),IF(AN$6>$E24,IF(AO$6>$F24,$U24/($F24-$E24)*($F24-AN$6),$U24/($F24-$E24)*(AO$6-AN$6)),$U24/($F24-$E24)*(AO$6-$E24)),\"x\")))","v":"x"},"x","x","x","x","x","x","x","x","x","x","x","x","x","x","x","x","x","x","x","x","x","x","x","x","x","x","x","x","x","x","x",{"$f":"IF(OR($V24=\"Utility\",$AA24=0),\"x\",IF($G24=\"hot\",\"x\",IF(AND(BU$6>$E24,BT$6<$F24),IF(BT$6>$E24,IF(BU$6>$F24,$U24/($F24-$E24)*($F24-BT$6),$U24/($F24-$E24)*(BU$6-BT$6)),$U24/($F24-$E24)*(BU$6-$E24)),\"x\")))","v":"x"},"x","x","x","x","x","x","x","x","x","x","x","x","x","x","x","x","x","x","x","x","x","x","x","x","x","x","x","x","x","x","x",{"$f":"IF(OR($V24=\"Utility\",$AA24=0),\"x\",IF($G24=\"hot\",\"x\",IF(AND(DA$6>$E24,CZ$6<$F24),IF(CZ$6>$E24,IF(DA$6>$F24,$U24/($F24-$E24)*($F24-CZ$6),$U24/($F24-$E24)*(DA$6-CZ$6)),$U24/($F24-$E24)*(DA$6-$E24)),\"x\")))","v":"x"},"x","x","x","x","x","x","x","x","x","x","x","x","x","x","x","x","x","x","x","x","x","x","x","x","x","x","x","x","x","x","x","x","x","x","x","x",null,null,null,0,null,{"$f":"IF(OR($V24=\"Utility\",$AA24=0),\"x\",IF($G24=\"cold\",\"x\",IF(AND(EQ$6>$F24,EP$6<$E24),IF(EP$6>$F24,IF(EQ$6>$E24,$U24/($E24-$F24)*($E24-EP$6),$U24/($E24-$F24)*(EQ$6-EP$6)),$U24/($E24-$F24)*(EQ$6-$F24)),\"x\")))","v":"x"},"x","x","x","x","x","x","x","x","x","x","x","x","x","x","x","x","x","x","x","x","x","x","x","x","x","x","x","x","x","x","x",{"$f":"IF(OR($V24=\"Utility\",$AA24=0),\"x\",IF($G24=\"cold\",\"x\",IF(AND(FW$6>$F24,FV$6<$E24),IF(FV$6>$F24,IF(FW$6>$E24,$U24/($E24-$F24)*($E24-FV$6),$U24/($E24-$F24)*(FW$6-FV$6)),$U24/($E24-$F24)*(FW$6-$F24)),\"x\")))","v":"x"},"x","x","x","x","x","x","x","x","x","x","x","x","x","x","x","x","x","x","x","x","x","x","x","x","x","x","x","x","x","x","x",{"$f":"IF(OR($V24=\"Utility\",$AA24=0),\"x\",IF($G24=\"cold\",\"x\",IF(AND(HC$6>$F24,HB$6<$E24),IF(HB$6>$F24,IF(HC$6>$E24,$U24/($E24-$F24)*($E24-HB$6),$U24/($E24-$F24)*(HC$6-HB$6)),$U24/($E24-$F24)*(HC$6-$F24)),\"x\")))","v":"x"},"x","x","x","x","x","x","x","x","x","x","x","x","x","x","x","x","x","x","x","x","x","x","x","x","x","x","x","x","x","x","x","x","x","x","x","x"]
["",{"$f":"IF(G27=\"hot\",COUNTIF($G$5:G27,\"hot\"),\"\")","v":""},{"$f":"IF(G27=\"cold\",COUNTIF($G$5:G27,\"cold\"),\"\")","v":""},null,null,null,"",null,null,"","","",null,null,null,null,null,null,null,null,"",null,"","","","","",null,null,null,null,null,null,null,null,null,null,null,0,null,{"$f":"IF(OR($V25=\"Utility\",$AA25=0),\"x\",IF($G25=\"hot\",\"x\",IF(AND(AO$6>$E25,AN$6<$F25),IF(AN$6>$E25,IF(AO$6>$F25,$U25/($F25-$E25)*($F25-AN$6),$U25/($F25-$E25)*(AO$6-AN$6)),$U25/($F25-$E25)*(AO$6-$E25)),\"x\")))","v":"x"},"x","x","x","x","x","x","x","x","x","x","x","x","x","x","x","x","x","x","x","x","x","x","x","x","x","x","x","x","x","x","x",{"$f":"IF(OR($V25=\"Utility\",$AA25=0),\"x\",IF($G25=\"hot\",\"x\",IF(AND(BU$6>$E25,BT$6<$F25),IF(BT$6>$E25,IF(BU$6>$F25,$U25/($F25-$E25)*($F25-BT$6),$U25/($F25-$E25)*(BU$6-BT$6)),$U25/($F25-$E25)*(BU$6-$E25)),\"x\")))","v":"x"},"x","x","x","x","x","x","x","x","x","x","x","x","x","x","x","x","x","x","x","x","x","x","x","x","x","x","x","x","x","x","x",{"$f":"IF(OR($V25=\"Utility\",$AA25=0),\"x\",IF($G25=\"hot\",\"x\",IF(AND(DA$6>$E25,CZ$6<$F25),IF(CZ$6>$E25,IF(DA$6>$F25,$U25/($F25-$E25)*($F25-CZ$6),$U25/($F25-$E25)*(DA$6-CZ$6)),$U25/($F25-$E25)*(DA$6-$E25)),\"x\")))","v":"x"},"x","x","x","x","x","x","x","x","x","x","x","x","x","x","x","x","x","x","x","x","x","x","x","x","x","x","x","x","x","x","x","x","x","x","x","x",null,null,null,0,null,{"$f":"IF(OR($V25=\"Utility\",$AA25=0),\"x\",IF($G25=\"cold\",\"x\",IF(AND(EQ$6>$F25,EP$6<$E25),IF(EP$6>$F25,IF(EQ$6>$E25,$U25/($E25-$F25)*($E25-EP$6),$U25/($E25-$F25)*(EQ$6-EP$6)),$U25/($E25-$F25)*(EQ$6-$F25)),\"x\")))","v":"x"},"x","x","x","x","x","x","x","x","x","x","x","x","x","x","x","x","x","x","x","x","x","x","x","x","x","x","x","x","x","x","x",{"$f":"IF(OR($V25=\"Utility\",$AA25=0),\"x\",IF($G25=\"cold\",\"x\",IF(AND(FW$6>$F25,FV$6<$E25),IF(FV$6>$F25,IF(FW$6>$E25,$U25/($E25-$F25)*($E25-FV$6),$U25/($E25-$F25)*(FW$6-FV$6)),$U25/($E25-$F25)*(FW$6-$F25)),\"x\")))","v":"x"},"x","x","x","x","x","x","x","x","x","x","x","x","x","x","x","x","x","x","x","x","x","x","x","x","x","x","x","x","x","x","x",{"$f":"IF(OR($V25=\"Utility\",$AA25=0),\"x\",IF($G25=\"cold\",\"x\",IF(AND(HC$6>$F25,HB$6<$E25),IF(HB$6>$F25,IF(HC$6>$E25,$U25/($E25-$F25)*($E25-HB$6),$U25/($E25-$F25)*(HC$6-HB$6)),$U25/($E25-$F25)*(HC$6-$F25)),\"x\")))","v":"x"},"x","x","x","x","x","x","x","x","x","x","x","x","x","x","x","x","x","x","x","x","x","x","x","x","x","x","x","x","x","x","x","x","x","x","x","x"]
["",{"$f":"IF(G28=\"hot\",COUNTIF($G$5:G28,\"hot\"),\"\")","v":""},{"$f":"IF(G28=\"cold\",COUNTIF($G$5:G28,\"cold\"),\"\")","v":""},null,null,null,"",null,null,"","","",null,null,null,null,null,null,null,null,"",null,"","","","","",null,null,null,null,null,null,null,null,null,null,null,0,null,{"$f":"IF(OR($V26=\"Utility\",$AA26=0),\"x\",IF($G26=\"hot\",\"x\",IF(AND(AO$6>$E26,AN$6<$F26),IF(AN$6>$E26,IF(AO$6>$F26,$U26/($F26-$E26)*($F26-AN$6),$U26/($F26-$E26)*(AO$6-AN$6)),$U26/($F26-$E26)*(AO$6-$E26)),\"x\")))","v":"x"},"x","x","x","x","x","x","x","x","x","x","x","x","x","x","x","x","x","x","x","x","x","x","x","x","x","x","x","x","x","x","x",{"$f":"IF(OR($V26=\"Utility\",$AA26=0),\"x\",IF($G26=\"hot\",\"x\",IF(AND(BU$6>$E26,BT$6<$F26),IF(BT$6>$E26,IF(BU$6>$F26,$U26/($F26-$E26)*($F26-BT$6),$U26/($F26-$E26)*(BU$6-BT$6)),$U26/($F26-$E26)*(BU$6-$E26)),\"x\")))","v":"x"},"x","x","x","x","x","x","x","x","x","x","x","x","x","x","x","x","x","x","x","x","x","x","x","x","x","x","x","x","x","x","x",{"$f":"IF(OR($V26=\"Utility\",$AA26=0),\"x\",IF($G26=\"hot\",\"x\",IF(AND(DA$6>$E26,CZ$6<$F26),IF(CZ$6>$E26,IF(DA$6>$F26,$U26/($F26-$E26)*($F26-CZ$6),$U26/($F26-$E26)*(DA$6-CZ$6)),$U26/($F26-$E26)*(DA$6-$E26)),\"x\")))","v":"x"},"x","x","x","x","x","x","x","x","x","x","x","x","x","x","x","x","x","x","x","x","x","x","x","x","x","x","x","x","x","x","x","x","x","x","x","x",null,null,null,0,null,{"$f":"IF(OR($V26=\"Utility\",$AA26=0),\"x\",IF($G26=\"cold\",\"x\",IF(AND(EQ$6>$F26,EP$6<$E26),IF(EP$6>$F26,IF(EQ$6>$E26,$U26/($E26-$F26)*($E26-EP$6),$U26/($E26-$F26)*(EQ$6-EP$6)),$U26/($E26-$F26)*(EQ$6-$F26)),\"x\")))","v":"x"},"x","x","x","x","x","x","x","x","x","x","x","x","x","x","x","x","x","x","x","x","x","x","x","x","x","x","x","x","x","x","x",{"$f":"IF(OR($V26=\"Utility\",$AA26=0),\"x\",IF($G26=\"cold\",\"x\",IF(AND(FW$6>$F26,FV$6<$E26),IF(FV$6>$F26,IF(FW$6>$E26,$U26/($E26-$F26)*($E26-FV$6),$U26/($E26-$F26)*(FW$6-FV$6)),$U26/($E26-$F26)*(FW$6-$F26)),\"x\")))","v":"x"},"x","x","x","x","x","x","x","x","x","x","x","x","x","x","x","x","x","x","x","x","x","x","x","x","x","x","x","x","x","x","x",{"$f":"IF(OR($V26=\"Utility\",$AA26=0),\"x\",IF($G26=\"cold\",\"x\",IF(AND(HC$6>$F26,HB$6<$E26),IF(HB$6>$F26,IF(HC$6>$E26,$U26/($E26-$F26)*($E26-HB$6),$U26/($E26-$F26)*(HC$6-HB$6)),$U26/($E26-$F26)*(HC$6-$F26)),\"x\")))","v":"x"},"x","x","x","x","x","x","x","x","x","x","x","x","x","x","x","x","x","x","x","x","x","x","x","x","x","x","x","x","x","x","x","x","x","x","x","x"]
["",{"$f":"IF(G29=\"hot\",COUNTIF($G$5:G29,\"hot\"),\"\")","v":""},{"$f":"IF(G29=\"cold\",COUNTIF($G$5:G29,\"cold\"),\"\")","v":""},null,null,null,"",null,null,"","","",null,null,null,null,null,null,null,null,"",null,"","","","","",null,null,null,null,null,null,null,"Shift GCC",0,"MWh",null,0,null,{"$f":"IF(OR($V27=\"Utility\",$AA27=0),\"x\",IF($G27=\"hot\",\"x\",IF(AND(AO$6>$E27,AN$6<$F27),IF(AN$6>$E27,IF(AO$6>$F27,$U27/($F27-$E27)*($F27-AN$6),$U27/($F27-$E27)*(AO$6-AN$6)),$U27/($F27-$E27)*(AO$6-$E27)),\"x\")))","v":"x"},"x","x","x","x","x","x","x","x","x","x","x","x","x","x","x","x","x","x","x","x","x","x","x","x","x","x","x","x","x","x","x",{"$f":"IF(OR($V27=\"Utility\",$AA27=0),\"x\",IF($G27=\"hot\",\"x\",IF(AND(BU$6>$E27,BT$6<$F27),IF(BT$6>$E27,IF(BU$6>$F27,$U27/($F27-$E27)*($F27-BT$6),$U27/($F27-$E27)*(BU$6-BT$6)),$U27/($F27-$E27)*(BU$6-$E27)),\"x\")))","v":"x"},"x","x","x","x","x","x","x","x","x","x","x","x","x","x","x","x","x","x","x","x","x","x","x","x","x","x","x","x","x","x","x",{"$f":"IF(OR($V27=\"Utility\",$AA27=0),\"x\",IF($G27=\"hot\",\"x\",IF(AND(DA$6>$E27,CZ$6<$F27),IF(CZ$6>$E27,IF(DA$6>$F27,$U27/($F27-$E27)*($F27-CZ$6),$U27/($F27-$E27)*(DA$6-CZ$6)),$U27/($F27-$E27)*(DA$6-$E27)),\"x\")))","v":"x"},"x","x","x","x","x","x","x","x","x","x","x","x","x","x","x","x","x","x","x","x","x","x","x","x","x","x","x","x","x","x","x","x","x","x","x","x",null,null,null,0,null,{"$f":"IF(OR($V27=\"Utility\",$AA27=0),\"x\",IF($G27=\"cold\",\"x\",IF(AND(EQ$6>$F27,EP$6<$E27),IF(EP$6>$F27,IF(EQ$6>$E27,$U27/($E27-$F27)*($E27-EP$6),$U27/($E27-$F27)*(EQ$6-EP$6)),$U27/($E27-$F27)*(EQ$6-$F27)),\"x\")))","v":"x"},"x","x","x","x","x","x","x","x","x","x","x","x","x","x","x","x","x","x","x","x","x","x","x","x","x","x","x","x","x","x","x",{"$f":"IF(OR($V27=\"Utility\",$AA27=0),\"x\",IF($G27=\"cold\",\"x\",IF(AND(FW$6>$F27,FV$6<$E27),IF(FV$6>$F27,IF(FW$6>$E27,$U27/($E27-$F27)*($E27-FV$6),$U27/($E27-$F27)*(FW$6-FV$6)),$U27/($E27-$F27)*(FW$6-$F27)),\"x\")))","v":"x"},"x","x","x","x","x","x","x","x","x","x","x","x","x","x","x","x","x","x","x","x","x","x","x","x","x","x","x","x","x","x","x",{"$f":"IF(OR($V27=\"Utility\",$AA27=0),\"x\",IF($G27=\"cold\",\"x\",IF(AND(HC$6>$F27,HB$6<$E27),IF(HB$6>$F27,IF(HC$6>$E27,$U27/($E27-$F27)*($E27-HB$6),$U27/($E27-$F27)*(HC$6-HB$6)),$U27/($E27-$F27)*(HC$6-$F27)),\"x\")))","v":"x"},"x","x","x","x","x","x","x","x","x","x","x","x","x","x","x","x","x","x","x","x","x","x","x","x","x","x","x","x","x","x","x","x","x","x","x","x"]
["",{"$f":"IF(G30=\"hot\",COUNTIF($G$5:G30,\"hot\"),\"\")","v":""},{"$f":"IF(G30=\"cold\",COUNTIF($G$5:G30,\"cold\"),\"\")","v":""},null,null,null,"",null,null,"","","",null,null,null,null,null,null,null,null,"",null,"","","","","",null,null,null,null,null,null,null,"Diff to Y-Axis",{"$f":"MIN($IR$21:$MN$21)","v":0},"MWh",null,0,null,{"$f":"IF(OR($V28=\"Utility\",$AA28=0),\"x\",IF($G28=\"hot\",\"x\",IF(AND(AO$6>$E28,AN$6<$F28),IF(AN$6>$E28,IF(AO$6>$F28,$U28/($F28-$E28)*($F28-AN$6),$U28/($F28-$E28)*(AO$6-AN$6)),$U28/($F28-$E28)*(AO$6-$E28)),\"x\")))","v":"x"},"x","x","x","x","x","x","x","x","x","x","x","x","x","x","x","x","x","x","x","x","x","x","x","x","x","x","x","x","x","x","x",{"$f":"IF(OR($V28=\"Utility\",$AA28=0),\"x\",IF($G28=\"hot\",\"x\",IF(AND(BU$6>$E28,BT$6<$F28),IF(BT$6>$E28,IF(BU$6>$F28,$U28/($F28-$E28)*($F28-BT$6),$U28/($F28-$E28)*(BU$6-BT$6)),$U28/($F28-$E28)*(BU$6-$E28)),\"x\")))","v":"x"},"x","x","x","x","x","x","x","x","x","x","x","x","x","x","x","x","x","x","x","x","x","x","x","x","x","x","x","x","x","x","x",{"$f":"IF(OR($V28=\"Utility\",$AA28=0),\"x\",IF($G28=\"hot\",\"x\",IF(AND(DA$6>$E28,CZ$6<$F28),IF(CZ$6>$E28,IF(DA$6>$F28,$U28/($F28-$E28)*($F28-CZ$6),$U28/($F28-$E28)*(DA$6-CZ$6)),$U28/($F28-$E28)*(DA$6-$E28)),\"x\")))","v":"x"},"x","x","x","x","x","x","x","x","x","x","x","x","x","x","x","x","x","x","x","x","x","x","x","x","x","x","x","x","x","x","x","x","x","x","x","x",null,null,null,0,null,{"$f":"IF(OR($V28=\"Utility\",$AA28=0),\"x\",IF($G28=\"cold\",\"x\",IF(AND(EQ$6>$F28,EP$6<$E28),IF(EP$6>$F28,IF(EQ$6>$E28,$U28/($E28-$F28)*($E28-EP$6),$U28/($E28-$F28)*(EQ$6-EP$6)),$U28/($E28-$F28)*(EQ$6-$F28)),\"x\")))","v":"x"},"x","x","x","x","x","x","x","x","x","x","x","x","x","x","x","x","x","x","x","x","x","x","x","x","x","x","x","x","x","x","x",{"$f":"IF(OR($V28=\"Utility\",$AA28=0),\"x\",IF($G28=\"cold\",\"x\",IF(AND(FW$6>$F28,FV$6<$E28),IF(FV$6>$F28,IF(FW$6>$E28,$U28/($E28-$F28)*($E28-FV$6),$U28/($E28-$F28)*(FW$6-FV$6)),$U28/($E28-$F28)*(FW$6-$F28)),\"x\")))","v":"x"},"x","x","x","x","x","x","x","x","x","x","x","x","x","x","x","x","x","x","x","x","x","x","x","x","x","x","x","x","x","x","x",{"$f":"IF(OR($V28=\"Utility\",$AA28=0),\"x\",IF($G28=\"cold\",\"x\",IF(AND(HC$6>$F28,HB$6<$E28),IF(HB$6>$F28,IF(HC$6>$E28,$U28/($E28-$F28)*($E28-HB$6),$U28/($E28-$F28)*(HC$6-HB$6)),$U28/($E28-$F28)*(HC$6-$F28)),\"x\")))","v":"x"},"x","x","x","x","x","x","x","x","x","x","x","x","x","x","x","x","x","x","x","x","x","x","x","x","x","x","x","x","x","x","x","x","x","x","x","x"]
["",{"$f":"IF(G31=\"hot\",COUNTIF($G$5:G31,\"hot\"),\"\")","v":""},{"$f":"IF(G31=\"cold\",COUNTIF($G$5:G31,\"cold\"),\"\")","v":""},null,null,null,"",null,null,"","","",null,null,null,null,null,null,null,null,"",null,"","","","","",null,null,null,null,null,null,null,null,null,null,null,0,null,{"$f":"IF(OR($V29=\"Utility\",$AA29=0),\"x\",IF($G29=\"hot\",\"x\",IF(AND(AO$6>$E29,AN$6<$F29),IF(AN$6>$E29,IF(AO$6>$F29,$U29/($F29-$E29)*($F29-AN$6),$U29/($F29-$E29)*(AO$6-AN$6)),$U29/($F29-$E29)*(AO$6-$E29)),\"x\")))","v":"x"},"x","x","x","x","x","x","x","x","x","x","x","x","x","x","x","x","x","x","x","x","x","x","x","x","x","x","x","x","x","x","x",{"$f":"IF(OR($V29=\"Utility\",$AA29=0),\"x\",IF($G29=\"hot\",\"x\",IF(AND(BU$6>$E29,BT$6<$F29),IF(BT$6>$E29,IF(BU$6>$F29,$U29/($F29-$E29)*($F29-BT$6),$U29/($F29-$E29)*(BU$6-BT$6)),$U29/($F29-$E29)*(BU$6-$E29)),\"x\")))","v":"x"},"x","x","x","x","x","x","x","x","x","x","x","x","x","x","x","x","x","x","x","x","x","x","x","x","x","x","x","x","x","x","x",{"$f":"IF(OR($V29=\"Utility\",$AA29=0),\"x\",IF($G29=\"hot\",\"x\",IF(AND(DA$6>$E29,CZ$6<$F29),IF(CZ$6>$E29,IF(DA$6>$F29,$U29/($F29-$E29)*($F29-CZ$6),$U29/($F29-$E29)*(DA$6-CZ$6)),$U29/($F29-$E29)*(DA$6-$E29)),\"x\")))","v":"x"},"x","x","x","x","x","x","x","x","x","x","x","x","x","x","x","x","x","x","x","x","x","x","x","x","x","x","x","x","x","x","x","x","x","x","x","x",null,null,null,0,null,{"$f":"IF(OR($V29=\"Utility\",$AA29=0),\"x\",IF($G29=\"cold\",\"x\",IF(AND(EQ$6>$F29,EP$6<$E29),IF(EP$6>$F29,IF(EQ$6>$E29,$U29/($E29-$F29)*($E29-EP$6),$U29/($E29-$F29)*(EQ$6-EP$6)),$U29/($E29-$F29)*(EQ$6-$F29)),\"x\")))","v":"x"},"x","x","x","x","x","x","x","x","x","x","x","x","x","x","x","x","x","x","x","x","x","x","x","x","x","x","x","x","x","x","x",{"$f":"IF(OR($V29=\"Utility\",$AA29=0),\"x\",IF($G29=\"cold\",\"x\",IF(AND(FW$6>$F29,FV$6<$E29),IF(FV$6>$F29,IF(FW$6>$E29,$U29/($E29-$F29)*($E29-FV$6),$U29/($E29-$F29)*(FW$6-FV$6)),$U29/($E29-$F29)*(FW$6-$F29)),\"x\")))","v":"x"},"x","x","x","x","x","x","x","x","x","x","x","x","x","x","x","x","x","x","x","x","x","x","x","x","x","x","x","x","x","x","x",{"$f":"IF(OR($V29=\"Utility\",$AA29=0),\"x\",IF($G29=\"cold\",\"x\",IF(AND(HC$6>$F29,HB$6<$E29),IF(HB$6>$F29,IF(HC$6>$E29,$U29/($E29-$F29)*($E29-HB$6),$U29/($E29-$F29)*(HC$6-HB$6)),$U29/($E29-$F29)*(HC$6-$F29)),\"x\")))","v":"x"},"x","x","x","x","x","x","x","x","x","x","x","x","x","x","x","x","x","x","x","x","x","x","x","x","x","x","x","x","x","x","x","x","x","x","x","x"]
["",{"$f":"IF(G32=\"hot\",COUNTIF($G$5:G32,\"hot\"),\"\")","v":""},{"$f":"IF(G32=\"cold\",COUNTIF($G$5:G32,\"cold\"),\"\")","v":""},null,null,null,"",null,null,"","","",null,null,null,null,null,null,null,null,"",null,"","","","","",null,null,null,null,null,null,null,"Nebenbedingung 1",{"$f":"SUMIF($G$5:$G$104,\"hot\",$L$5:$L$104)","v":0},"MWh",null,0,null,{"$f":"IF(OR($V30=\"Utility\",$AA30=0),\"x\",IF($G30=\"hot\",\"x\",IF(AND(AO$6>$E30,AN$6<$F30),IF(AN$6>$E30,IF(AO$6>$F30,$U30/($F30-$E30)*($F30-AN$6),$U30/($F30-$E30)*(AO$6-AN$6)),$U30/($F30-$E30)*(AO$6-$E30)),\"x\")))","v":"x"},"x","x","x","x","x","x","x","x","x","x","x","x","x","x","x","x","x","x","x","x","x","x","x","x","x","x","x","x","x","x","x",{"$f":"IF(OR($V30=\"Utility\",$AA30=0),\"x\",IF($G30=\"hot\",\"x\",IF(AND(BU$6>$E30,BT$6<$F30),IF(BT$6>$E30,IF(BU$6>$F30,$U30/($F30-$E30)*($F30-BT$6),$U30/($F30-$E30)*(BU$6-BT$6)),$U30/($F30-$E30)*(BU$6-$E30)),\"x\")))","v":"x"},"x","x","x","x","x","x","x","x","x","x","x","x","x","x","x","x","x","x","x","x","x","x","x","x","x","x","x","x","x","x","x",{"$f":"IF(OR($V30=\"Utility\",$AA30=0),\"x\",IF($G30=\"hot\",\"x\",IF(AND(DA$6>$E30,CZ$6<$F30),IF(CZ$6>$E30,IF(DA$6>$F30,$U30/($F30-$E30)*($F30-CZ$6),$U30/($F30-$E30)*(DA$6-CZ$6)),$U30/($F30-$E30)*(DA$6-$E30)),\"x\")))","v":"x"},"x","x","x","x","x","x","x","x","x","x","x","x","x","x","x","x","x","x","x","x","x","x","x","x","x","x","x","x","x","x","x","x","x","x","x","x",null,null,null,0,null,{"$f":"IF(OR($V30=\"Utility\",$AA30=0),\"x\",IF($G30=\"cold\",\"x\",IF(AND(EQ$6>$F30,EP$6<$E30),IF(EP$6>$F30,IF(EQ$6>$E30,$U30/($E30-$F30)*($E30-EP$6),$U30/($E30-$F30)*(EQ$6-EP$6)),$U30/($E30-$F30)*(EQ$6-$F30)),\"x\")))","v":"x"},"x","x","x","x","x","x","x","x","x","x","x","x","x","x","x","x","x","x","x","x","x","x","x","x","x","x","x","x","x","x","x",{"$f":"IF(OR($V30=\"Utility\",$AA30=0),\"x\",IF($G30=\"cold\",\"x\",IF(AND(FW$6>$F30,FV$6<$E30),IF(FV$6>$F30,IF(FW$6>$E30,$U30/($E30-$F30)*($E30-FV$6),$U30/($E30-$F30)*(FW$6-FV$6)),$U30/($E30-$F30)*(FW$6-$F30)),\"x\")))","v":"x"},"x","x","x","x","x","x","x","x","x","x","x","x","x","x","x","x","x","x","x","x","x","x","x","x","x","x","x","x","x","x","x",{"$f":"IF(OR($V30=\"Utility\",$AA30=0),\"x\",IF($G30=\"cold\",\"x\",IF(AND(HC$6>$F30,HB$6<$E30),IF(HB$6>$F30,IF(HC$6>$E30,$U30/($E30-$F30)*($E30-HB$6),$U30/($E30-$F30)*(HC$6-HB$6)),$U30/($E30-$F30)*(HC$6-$F30)),\"x\")))","v":"x"},"x","x","x","x","x","x","x","x","x","x","x","x","x","x","x","x","x","x","x","x","x","x","x","x","x","x","x","x","x","x","x","x","x","x","x","x"]
["",{"$f":"IF(G33=\"hot\",COUNTIF($G$5:G33,\"hot\"),\"\")","v":""},{"$f":"IF(G33=\"cold\",COUNTIF($G$5:G33,\"cold\"),\"\")","v":""},null,null,null,"",null,null,"","","",null,null,null,null,null,null,null,null,"",null,"","","","","",null,null,null,null,null,null,null,"Startwert",{"$f":"lngMaxShift/3","v":0},"MWh",null,0,null,{"$f":"IF(OR($V31=\"Utility\",$AA31=0),\"x\",IF($G31=\"hot\",\"x\",IF(AND(AO$6>$E31,AN$6<$F31),IF(AN$6>$E31,IF(AO$6>$F31,$U31/($F31-$E31)*($F31-AN$6),$U31/($F31-$E31)*(AO$6-AN$6)),$U31/($F31-$E31)*(AO$6-$E31)),\"x\")))","v":"x"},"x","x","x","x","x","x","x","x","x","x","x","x","x","x","x","x","x","x","x","x","x","x","x","x","x","x","x","x","x","x","x",{"$f":"IF(OR($V31=\"Utility\",$AA31=0),\"x\",IF($G31=\"hot\",\"x\",IF(AND(BU$6>$E31,BT$6<$F31),IF(BT$6>$E31,IF(BU$6>$F31,$U31/($F31-$E31)*($F31-BT$6),$U31/($F31-$E31)*(BU$6-BT$6)),$U31/($F31-$E31)*(BU$6-$E31)),\"x\")))","v":"x"},"x","x","x","x","x","x","x","x","x","x","x","x","x","x","x","x","x","x","x","x","x","x","x","x","x","x","x","x","x","x","x",{"$f":"IF(OR($V31=\"Utility\",$AA31=0),\"x\",IF($G31=\"hot\",\"x\",IF(AND(DA$6>$E31,CZ$6<$F31),IF(CZ$6>$E31,IF(DA$6>$F31,$U31/($F31-$E31)*($F31-CZ$6),$U31/($F31-$E31)*(DA$6-CZ$6)),$U31/($F31-$E31)*(DA$6-$E31)),\"x\")))","v":"x"},"x","x","x","x","x","x","x","x","x","x","x","x","x","x","x","x","x","x","x","x","x","x","x","x","x","x","x","x","x","x","x","x","x","x","x","x",null,null,null,0,null,{"$f":"IF(OR($V31=\"Utility\",$AA31=0),\"x\",IF($G31=\"cold\",\"x\",IF(AND(EQ$6>$F31,EP$6<$E31),IF(EP$6>$F31,IF(EQ$6>$E31,$U31/($E31-$F31)*($E31-EP$6),$U31/($E31-$F31)*(EQ$6-EP$6)),$U31/($E31-$F31)*(EQ$6-$F31)),\"x\")))","v":"x"},"x","x","x","x","x","x","x","x","x","x","x","x","x","x","x","x","x","x","x","x","x","x","x","x","x","x","x","x","x","x","x",{"$f":"IF(OR($V31=\"Utility\",$AA31=0),\"x\",IF($G31=\"cold\",\"x\",IF(AND(FW$6>$F31,FV$6<$E31),IF(FV$6>$F31,IF(FW$6>$E31,$U31/($E31-$F31)*($E31-FV$6),$U31/($E31-$F31)*(FW$6-FV$6)),$U31/($E31-$F31)*(FW$6-$F31)),\"x\")))","v":"x"},"x","x","x","x","x","x","x","x","x","x","x","x","x","x","x","x","x","x","x","x","x","x","x","x","x","x","x","x","x","x","x",{"$f":"IF(OR($V31=\"Utility\",$AA31=0),\"x\",IF($G31=\"cold\",\"x\",IF(AND(HC$6>$F31,HB$6<$E31),IF(HB$6>$F31,IF(HC$6>$E31,$U31/($E31-$F31)*($E31-HB$6),$U31/($E31-$F31)*(HC$6-HB$6)),$U31/($E31-$F31)*(HC$6-$F31)),\"x\")))","v":"x"},"x","x","x","x","x","x","x","x","x","x","x","x","x","x","x","x","x","x","x","x","x","x","x","x","x","x","x","x","x","x","x","x","x","x","x","x"]
["",{"$f":"IF(G34=\"hot\",COUNTIF($G$5:G34,\"hot\"),\"\")","v":""},{"$f":"IF(G34=\"cold\",COUNTIF($G$5:G34,\"cold\"),\"\")","v":""},null,null,null,"",null,null,"","","",null,null,null,null,null,null,null,null,"",null,"","","","","",null,null,null,null,null,null,null,null,null,null,null,0,null,{"$f":"IF(OR($V32=\"Utility\",$AA32=0),\"x\",IF($G32=\"hot\",\"x\",IF(AND(AO$6>$E32,AN$6<$F32),IF(AN$6>$E32,IF(AO$6>$F32,$U32/($F32-$E32)*($F32-AN$6),$U32/($F32-$E32)*(AO$6-AN$6)),$U32/($F32-$E32)*(AO$6-$E32)),\"x\")))","v":"x"},"x","x","x","x","x","x","x","x","x","x","x","x","x","x","x","x","x","x","x","x","x","x","x","x","x","x","x","x","x","x","x",{"$f":"IF(OR($V32=\"Utility\",$AA32=0),\"x\",IF($G32=\"hot\",\"x\",IF(AND(BU$6>$E32,BT$6<$F32),IF(BT$6>$E32,IF(BU$6>$F32,$U32/($F32-$E32)*($F32-BT$6),$U32/($F32-$E32)*(BU$6-BT$6)),$U32/($F32-$E32)*(BU$6-$E32)),\"x\")))","v":"x"},"x","x","x","x","x","x","x","x","x","x","x","x","x","x","x","x","x","x","x","x","x","x","x","x","x","x","x","x","x","x","x",{"$f":"IF(OR($V32=\"Utility\",$AA32=0),\"x\",IF($G32=\"hot\",\"x\",IF(AND(DA$6>$E32,CZ$6<$F32),IF(CZ$6>$E32,IF(DA$6>$F32,$U32/($F32-$E32)*($F32-CZ$6),$U32/($F32-$E32)*(DA$6-CZ$6)),$U32/($F32-$E32)*(DA$6-$E32)),\"x\")))","v":"x"},"x","x","x","x","x","x","x","x","x","x","x","x","x","x","x","x","x","x","x","x","x","x","x","x","x","x","x","x","x","x","x","x","x","x","x","x",null,null,null,0,null,{"$f":"IF(OR($V32=\"Utility\",$AA32=0),\"x\",IF($G32=\"cold\",\"x\",IF(AND(EQ$6>$F32,EP$6<$E32),IF(EP$6>$F32,IF(EQ$6>$E32,$U32/($E32-$F32)*($E32-EP$6),$U32/($E32-$F32)*(EQ$6-EP$6)),$U32/($E32-$F32)*(EQ$6-$F32)),\"x\")))","v":"x"},"x","x","x","x","x","x","x","x","x","x","x","x","x","x","x","x","x","x","x","x","x","x","x","x","x","x","x","x","x","x","x",{"$f":"IF(OR($V32=\"Utility\",$AA32=0),\"x\",IF($G32=\"cold\",\"x\",IF(AND(FW$6>$F32,FV$6<$E32),IF(FV$6>$F32,IF(FW$6>$E32,$U32/($E32-$F32)*($E32-FV$6),$U32/($E32-$F32)*(FW$6-FV$6)),$U32/($E32-$F32)*(FW$6-$F32)),\"x\")))","v":"x"},"x","x","x","x","x","x","x","x","x","x","x","x","x","x","x","x","x","x","x","x","x","x","x","x","x","x","x","x","x","x","x",{"$f":"IF(OR($V32=\"Utility\",$AA32=0),\"x\",IF($G32=\"cold\",\"x\",IF(AND(HC$6>$F32,HB$6<$E32),IF(HB$6>$F32,IF(HC$6>$E32,$U32/($E32-$F32)*($E32-HB$6),$U32/($E32-$F32)*(HC$6-HB$6)),$U32/($E32-$F32)*(HC$6-$F32)),\"x\")))","v":"x"},"x","x","x","x","x","x","x","x","x","x","x","x","x","x","x","x","x","x","x","x","x","x","x","x","x","x","x","x","x","x","x","x","x","x","x","x"]
["",{"$f":"IF(G35=\"hot\",COUNTIF($G$5:G35,\"hot\"),\"\")","v":""},{"$f":"IF(G35=\"cold\",COUNTIF($G$5:G35,\"cold\"),\"\")","v":""},null,null,null,"",null,null,"","","",null,null,null,null,null,null,null,null,"",null,"","","","","",null,null,null,null,null,null,null,"Pinch T high",{"$f":"INDEX($IR$5:$MN$6,2,$AJ$37)","v":0},"°C",null,0,null,{"$f":"IF(OR($V33=\"Utility\",$AA33=0),\"x\",IF($G33=\"hot\",\"x\",IF(AND(AO$6>$E33,AN$6<$F33),IF(AN$6>$E33,IF(AO$6>$F33,$U33/($F33-$E33)*($F33-AN$6),$U33/($F33-$E33)*(AO$6-AN$6)),$U33/($F33-$E33)*(AO$6-$E33)),\"x\")))","v":"x"},"x","x","x","x","x","x","x","x","x","x","x","x","x","x","x","x","x","x","x","x","x","x","x","x","x","x","x","x","x","x","x",{"$f":"IF(OR($V33=\"Utility\",$AA33=0),\"x\",IF($G33=\"hot\",\"x\",IF(AND(BU$6>$E33,BT$6<$F33),IF(BT$6>$E33,IF(BU$6>$F33,$U33/($F33-$E33)*($F33-BT$6),$U33/($F33-$E33)*(BU$6-BT$6)),$U33/($F33-$E33)*(BU$6-$E33)),\"x\")))","v":"x"},"x","x","x","x","x","x","x","x","x","x","x","x","x","x","x","x","x","x","x","x","x","x","x","x","x","x","x","x","x","x","x",{"$f":"IF(OR($V33=\"Utility\",$AA33=0),\"x\",IF($G33=\"hot\",\"x\",IF(AND(DA$6>$E33,CZ$6<$F33),IF(CZ$6>$E33,IF(DA$6>$F33,$U33/($F33-$E33)*($F33-CZ$6),$U33/($F33-$E33)*(DA$6-CZ$6)),$U33/($F33-$E33)*(DA$6-$E33)),\"x\")))","v":"x"},"x","x","x","x","x","x","x","x","x","x","x","x","x","x","x","x","x","x","x","x","x","x","x","x","x","x","x","x","x","x","x","x","x","x","x","x",null,null,null,0,null,{"$f":"IF(OR($V33=\"Utility\",$AA33=0),\"x\",IF($G33=\"cold\",\"x\",IF(AND(EQ$6>$F33,EP$6<$E33),IF(EP$6>$F33,IF(EQ$6>$E33,$U33/($E33-$F33)*($E33-EP$6),$U33/($E33-$F33)*(EQ$6-EP$6)),$U33/($E33-$F33)*(EQ$6-$F33)),\"x\")))","v":"x"},"x","x","x","x","x","x","x","x","x","x","x","x","x","x","x","x","x","x","x","x","x","x","x","x","x","x","x","x","x","x","x",{"$f":"IF(OR($V33=\"Utility\",$AA33=0),\"x\",IF($G33=\"cold\",\"x\",IF(AND(FW$6>$F33,FV$6<$E33),IF(FV$6>$F33,IF(FW$6>$E33,$U33/($E33-$F33)*($E33-FV$6),$U33/($E33-$F33)*(FW$6-FV$6)),$U33/($E33-$F33)*(FW$6-$F33)),\"x\")))","v":"x"},"x","x","x","x","x","x","x","x","x","x","x","x","x","x","x","x","x","x","x","x","x","x","x","x","x","x","x","x","x","x","x",{"$f":"IF(OR($V33=\"Utility\",$AA33=0),\"x\",IF($G33=\"cold\",\"x\",IF(AND(HC$6>$F33,HB$6<$E33),IF(HB$6>$F33,IF(HC$6>$E33,$U33/($E33-$F33)*($E33-HB$6),$U33/($E33-$F33)*(HC$6-HB$6)),$U33/($E33-$F33)*(HC$6-$F33)),\"x\")))","v":"x"},"x","x","x","x","x","x","x","x","x","x","x","x","x","x","x","x","x","x","x","x","x","x","x","x","x","x","x","x","x","x","x","x","x","x","x","x"]
["",{"$f":"IF(G36=\"hot\",COUNTIF($G$5:G36,\"hot\"),\"\")","v":""},{"$f":"IF(G36=\"cold\",COUNTIF($G$5:G36,\"cold\"),\"\")","v":""},null,null,null,"",null,null,"","","",null,null,null,null,null,null,null,null,"",null,"","","","","",null,null,null,null,null,null,null,"Pinch T low",{"$f":"INDEX($IR$5:$MN$6,1,$AJ$37)","v":0},"°C",null,0,null,{"$f":"IF(OR($V34=\"Utility\",$AA34=0),\"x\",IF($G34=\"hot\",\"x\",IF(AND(AO$6>$E34,AN$6<$F34),IF(AN$6>$E34,IF(AO$6>$F34,$U34/($F34-$E34)*($F34-AN$6),$U34/($F34-$E34)*(AO$6-AN$6)),$U34/($F34-$E34)*(AO$6-$E34)),\"x\")))","v":"x"},"x","x","x","x","x","x","x","x","x","x","x","x","x","x","x","x","x","x","x","x","x","x","x","x","x","x","x","x","x","x","x",{"$f":"IF(OR($V34=\"Utility\",$AA34=0),\"x\",IF($G34=\"hot\",\"x\",IF(AND(BU$6>$E34,BT$6<$F34),IF(BT$6>$E34,IF(BU$6>$F34,$U34/($F34-$E34)*($F34-BT$6),$U34/($F34-$E34)*(BU$6-BT$6)),$U34/($F34-$E34)*(BU$6-$E34)),\"x\")))","v":"x"},"x","x","x","x","x","x","x","x","x","x","x","x","x","x","x","x","x","x","x","x","x","x","x","x","x","x","x","x","x","x","x",{"$f":"IF(OR($V34=\"Utility\",$AA34=0),\"x\",IF($G34=\"hot\",\"x\",IF(AND(DA$6>$E34,CZ$6<$F34),IF(CZ$6>$E34,IF(DA$6>$F34,$U34/($F34-$E34)*($F34-CZ$6),$U34/($F34-$E34)*(DA$6-CZ$6)),$U34/($F34-$E34)*(DA$6-$E34)),\"x\")))","v":"x"},"x","x","x","x","x","x","x","x","x","x","x","x","x","x","x","x","x","x","x","x","x","x","x","x","x","x","x","x","x","x","x","x","x","x","x","x",null,null,null,0,null,{"$f":"IF(OR($V34=\"Utility\",$AA34=0),\"x\",IF($G34=\"cold\",\"x\",IF(AND(EQ$6>$F34,EP$6<$E34),IF(EP$6>$F34,IF(EQ$6>$E34,$U34/($E34-$F34)*($E34-EP$6),$U34/($E34-$F34)*(EQ$6-EP$6)),$U34/($E34-$F34)*(EQ$6-$F34)),\"x\")))","v":"x"},"x","x","x","x","x","x","x","x","x","x","x","x","x","x","x","x","x","x","x","x","x","x","x","x","x","x","x","x","x","x","x",{"$f":"IF(OR($V34=\"Utility\",$AA34=0),\"x\",IF($G34=\"cold\",\"x\",IF(AND(FW$6>$F34,FV$6<$E34),IF(FV$6>$F34,IF(FW$6>$E34,$U34/($E34-$F34)*($E34-FV$6),$U34/($E34-$F34)*(FW$6-FV$6)),$U34/($E34-$F34)*(FW$6-$F34)),\"x\")))","v":"x"},"x","x","x","x","x","x","x","x","x","x","x","x","x","x","x","x","x","x","x","x","x","x","x","x","x","x","x","x","x","x","x",{"$f":"IF(OR($V34=\"Utility\",$AA34=0),\"x\",IF($G34=\"cold\",\"x\",IF(AND(HC$6>$F34,HB$6<$E34),IF(HB$6>$F34,IF(HC$6>$E34,$U34/($E34-$F34)*($E34-HB$6),$U34/($E34-$F34)*(HC$6-HB$6)),$U34/($E34-$F34)*(HC$6-$F34)),\"x\")))","v":"x"},"x","x","x","x","x","x","x","x","x","x","x","x","x","x","x","x","x","x","x","x","x","x","x","x","x","x","x","x","x","x","x","x","x","x","x","x"]
["",{"$f":"IF(G37=\"hot\",COUNTIF($G$5:G37,\"hot\"),\"\")","v":""},{"$f":"IF(G37=\"cold\",COUNTIF($G$5:G37,\"cold\"),\"\")","v":""},null,null,null,"",null,null,"","","",null,null,null,null,null,null,null,null,"",null,{"$f":"IF(G37=\"hot\",J37,\"\")","v":""},{"$f":"IF(G37=\"cold\",J37,\"\")","v":""},{"$f":"IF(G37=\"\",\"\",IF(G37=\"hot\",_xlfn.RANK.EQ(W37,$W$5:$W$104),_xlfn.RANK.EQ(X37,$X$5:$X$104)))","v":""},{"$f":"IF(D37=\"\",\"\",D37)","v":""},"",null,null,null,null,null,null,null,"Row of Pinch T",{"$f":"MATCH(MIN($IR$7:$MN$7),$IR$7:$MN$7,0)","v":1}," -",null,0,null,{"$f":"IF(OR($V35=\"Utility\",$AA35=0),\"x\",IF($G35=\"hot\",\"x\",IF(AND(AO$6>$E35,AN$6<$F35),IF(AN$6>$E35,IF(AO$6>$F35,$U35/($F35-$E35)*($F35-AN$6),$U35/($F35-$E35)*(AO$6-AN$6)),$U35/($F35-$E35)*(AO$6-$E35)),\"x\")))","v":"x"},"x","x","x","x","x","x","x","x","x","x","x","x","x","x","x","x","x","x","x","x","x","x","x","x","x","x","x","x","x","x","x",{"$f":"IF(OR($V35=\"Utility\",$AA35=0),\"x\",IF($G35=\"hot\",\"x\",IF(AND(BU$6>$E35,BT$6<$F35),IF(BT$6>$E35,IF(BU$6>$F35,$U35/($F35-$E35)*($F35-BT$6),$U35/($F35-$E35)*(BU$6-BT$6)),$U35/($F35-$E35)*(BU$6-$E35)),\"x\")))","v":"x"},"x","x","x","x","x","x","x","x","x","x","x","x","x","x","x","x","x","x","x","x","x","x","x","x","x","x","x","x","x","x","x",{"$f":"IF(OR($V35=\"Utility\",$AA35=0),\"x\",IF($G35=\"hot\",\"x\",IF(AND(DA$6>$E35,CZ$6<$F35),IF(CZ$6>$E35,IF(DA$6>$F35,$U35/($F35-$E35)*($F35-CZ$6),$U35/($F35-$E35)*(DA$6-CZ$6)),$U35/($F35-$E35)*(DA$6-$E35)),\"x\")))","v":"x"},"x","x","x","x","x","x","x","x","x","x","x","x","x","x","x","x","x","x","x","x","x","x","x","x","x","x","x","x","x","x","x","x","x","x","x","x",null,null,null,0,null,{"$f":"IF(OR($V35=\"Utility\",$AA35=0),\"x\",IF($G35=\"cold\",\"x\",IF(AND(EQ$6>$F35,EP$6<$E35),IF(EP$6>$F35,IF(EQ$6>$E35,$U35/($E35-$F35)*($E35-EP$6),$U35/($E35-$F35)*(EQ$6-EP$6)),$U35/($E35-$F35)*(EQ$6-$F35)),\"x\")))","v":"x"},"x","x","x","x","x","x","x","x","x","x","x","x","x","x","x","x","x","x","x","x","x","x","x","x","x","x","x","x","x","x","x",{"$f":"IF(OR($V35=\"Utility\",$AA35=0),\"x\",IF($G35=\"cold\",\"x\",IF(AND(FW$6>$F35,FV$6<$E35),IF(FV$6>$F35,IF(FW$6>$E35,$U35/($E35-$F35)*($E35-FV$6),$U35/($E35-$F35)*(FW$6-FV$6)),$U35/($E35-$F35)*(FW$6-$F35)),\"x\")))","v":"x"},"x","x","x","x","x","x","x","x","x","x","x","x","x","x","x","x","x","x","x","x","x","x","x","x","x","x","x","x","x","x","x",{"$f":"IF(OR($V35=\"Utility\",$AA35=0),\"x\",IF($G35=\"cold\",\"x\",IF(AND(HC$6>$F35,HB$6<$E35),IF(HB$6>$F35,IF(HC$6>$E35,$U35/($E35-$F35)*($E35-HB$6),$U35/($E35-$F35)*(HC$6-HB$6)),$U35/($E35-$F35)*(HC$6-$F35)),\"x\")))","v":"x"},"x","x","x","x","x","x","x","x","x","x","x","x","x","x","x","x","x","x","x","x","x","x","x","x","x","x","x","x","x","x","x","x","x","x","x","x"]
["",{"$f":"IF(G38=\"hot\",COUNTIF($G$5:G38,\"hot\"),\"\")","v":""},{"$f":"IF(G38=\"cold\",COUNTIF($G$5:G38,\"cold\"),\"\")","v":""},null,null,null,"",null,null,"","","",null,null,null,null,null,null,null,null,"",null,"","","","","",null,null,null,null,null,null,null,null,null,null,null,0,null,{"$f":"IF(OR($V36=\"Utility\",$AA36=0),\"x\",IF($G36=\"hot\",\"x\",IF(AND(AO$6>$E36,AN$6<$F36),IF(AN$6>$E36,IF(AO$6>$F36,$U36/($F36-$E36)*($F36-AN$6),$U36/($F36-$E36)*(AO$6-AN$6)),$U36/($F36-$E36)*(AO$6-$E36)),\"x\")))","v":"x"},"x","x","x","x","x","x","x","x","x","x","x","x","x","x","x","x","x","x","x","x","x","x","x","x","x","x","x","x","x","x","x",{"$f":"IF(OR($V36=\"Utility\",$AA36=0),\"x\",IF($G36=\"hot\",\"x\",IF(AND(BU$6>$E36,BT$6<$F36),IF(BT$6>$E36,IF(BU$6>$F36,$U36/($F36-$E36)*($F36-BT$6),$U36/($F36-$E36)*(BU$6-BT$6)),$U36/($F36-$E36)*(BU$6-$E36)),\"x\")))","v":"x"},"x","x","x","x","x","x","x","x","x","x","x","x","x","x","x","x","x","x","x","x","x","x","x","x","x","x","x","x","x","x","x",{"$f":"IF(OR($V36=\"Utility\",$AA36=0),\"x\",IF($G36=\"hot\",\"x\",IF(AND(DA$6>$E36,CZ$6<$F36),IF(CZ$6>$E36,IF(DA$6>$F36,$U36/($F36-$E36)*($F36-CZ$6),$U36/($F36-$E36)*(DA$6-CZ$6)),$U36/($F36-$E36)*(DA$6-$E36)),\"x\")))","v":"x"},"x","x","x","x","x","x","x","x","x","x","x","x","x","x","x","x","x","x","x","x","x","x","x","x","x","x","x","x","x","x","x","x","x","x","x","x",null,null,null,0,null,{"$f":"IF(OR($V36=\"Utility\",$AA36=0),\"x\",IF($G36=\"cold\",\"x\",IF(AND(EQ$6>$F36,EP$6<$E36),IF(EP$6>$F36,IF(EQ$6>$E36,$U36/($E36-$F36)*($E36-EP$6),$U36/($E36-$F36)*(EQ$6-EP$6)),$U36/($E36-$F36)*(EQ$6-$F36)),\"x\")))","v":"x"},"x","x","x","x","x","x","x","x","x","x","x","x","x","x","x","x","x","x","x","x","x","x","x","x","x","x","x","x","x","x","x",{"$f":"IF(OR($V36=\"Utility\",$AA36=0),\"x\",IF($G36=\"cold\",\"x\",IF(AND(FW$6>$F36,FV$6<$E36),IF(FV$6>$F36,IF(FW$6>$E36,$U36/($E36-$F36)*($E36-FV$6),$U36/($E36-$F36)*(FW$6-FV$6)),$U36/($E36-$F36)*(FW$6-$F36)),\"x\")))","v":"x"},"x","x","x","x","x","x","x","x","x","x","x","x","x","x","x","x","x","x","x","x","x","x","x","x","x","x","x","x","x","x","x",{"$f":"IF(OR($V36=\"Utility\",$AA36=0),\"x\",IF($G36=\"cold\",\"x\",IF(AND(HC$6>$F36,HB$6<$E36),IF(HB$6>$F36,IF(HC$6>$E36,$U36/($E36-$F36)*($E36-HB$6),$U36/($E36-$F36)*(HC$6-HB$6)),$U36/($E36-$F36)*(HC$6-$F36)),\"x\")))","v":"x"},"x","x","x","x","x","x","x","x","x","x","x","x","x","x","x","x","x","x","x","x","x","x","x","x","x","x","x","x","x","x","x","x","x","x","x","x"]
["",{"$f":"IF(G39=\"hot\",COUNTIF($G$5:G39,\"hot\"),\"\")","v":""},{"$f":"IF(G39=\"cold\",COUNTIF($G$5:G39,\"cold\"),\"\")","v":""},null,null,null,"",null,null,"","","",null,null,null,null,null,null,null,null,"",null,"","","","","",null,null,null,null,null,null,null,"Q max",{"$f":"MAX($L$5:$L$104)","v":0},"kW",null,{"$f":"D37","v":0},null,{"$f":"IF(OR($V37=\"Utility\",$AA37=0),\"x\",IF($G37=\"hot\",\"x\",IF(AND(AO$6>$E37,AN$6<$F37),IF(AN$6>$E37,IF(AO$6>$F37,$U37/($F37-$E37)*($F37-AN$6),$U37/($F37-$E37)*(AO$6-AN$6)),$U37/($F37-$E37)*(AO$6-$E37)),\"x\")))","v":"x"},"x","x","x","x","x","x","x","x","x","x","x","x","x","x","x","x","x","x","x","x","x","x","x","x","x","x","x","x","x","x","x",{"$f":"IF(OR($V37=\"Utility\",$AA37=0),\"x\",IF($G37=\"hot\",\"x\",IF(AND(BU$6>$E37,BT$6<$F37),IF(BT$6>$E37,IF(BU$6>$F37,$U37/($F37-$E37)*($F37-BT$6),$U37/($F37-$E37)*(BU$6-BT$6)),$U37/($F37-$E37)*(BU$6-$E37)),\"x\")))","v":"x"},"x","x","x","x","x","x","x","x","x","x","x","x","x","x","x","x","x","x","x","x","x","x","x","x","x","x","x","x","x","x","x",{"$f":"IF(OR($V37=\"Utility\",$AA37=0),\"x\",IF($G37=\"hot\",\"x\",IF(AND(DA$6>$E37,CZ$6<$F37),IF(CZ$6>$E37,IF(DA$6>$F37,$U37/($F37-$E37)*($F37-CZ$6),$U37/($F37-$E37)*(DA$6-CZ$6)),$U37/($F37-$E37)*(DA$6-$E37)),\"x\")))","v":"x"},"x","x","x","x","x","x","x","x","x","x","x","x","x","x","x","x","x","x","x","x","x","x","x","x","x","x","x","x","x","x","x","x","x","x","x","x",null,null,null,{"$f":"D37","v":0},null,{"$f":"IF(OR($V37=\"Utility\",$AA37=0),\"x\",IF($G37=\"cold\",\"x\",IF(AND(EQ$6>$F37,EP$6<$E37),IF(EP$6>$F37,IF(EQ$6>$E37,$U37/($E37-$F37)*($E37-EP$6),$U37/($E37-$F37)*(EQ$6-EP$6)),$U37/($E37-$F37)*(EQ$6-$F37)),\"x\")))","v":"x"},"x","x","x","x","x","x","x","x","x","x","x","x","x","x","x","x","x","x","x","x","x","x","x","x","x","x","x","x","x","x","x",{"$f":"IF(OR($V37=\"Utility\",$AA37=0),\"x\",IF($G37=\"cold\",\"x\",IF(AND(FW$6>$F37,FV$6<$E37),IF(FV$6>$F37,IF(FW$6>$E37,$U37/($E37-$F37)*($E37-FV$6),$U37/($E37-$F37)*(FW$6-FV$6)),$U37/($E37-$F37)*(FW$6-$F37)),\"x\")))","v":"x"},"x","x","x","x","x","x","x","x","x","x","x","x","x","x","x","x","x","x","x","x","x","x","x","x","x","x","x","x","x","x","x",{"$f":"IF(OR($V37=\"Utility\",$AA37=0),\"x\",IF($G37=\"cold\",\"x\",IF(AND(HC$6>$F37,HB$6<$E37),IF(HB$6>$F37,IF(HC$6>$E37,$U37/($E37-$F37)*($E37-HB$6),$U37/($E37-$F37)*(HC$6-HB$6)),$U37/($E37-$F37)*(HC$6-$F37)),\"x\")))","v":"x"},"x","x","x","x","x","x","x","x","x","x","x","x","x","x","x","x","x","x","x","x","x","x","x","x","x","x","x","x","x","x","x","x","x","x","x","x"]
["",{"$f":"IF(G40=\"hot\",COUNTIF($G$5:G40,\"hot\"),\"\")","v":""},{"$f":"IF(G40=\"cold\",COUNTIF($G$5:G40,\"cold\"),\"\")","v":""},null,null,null,"",null,null,"","","",null,null,null,null,null,null,null,null,"",null,"","","","","",null,null,null,null,null,null,null,"Q min",{"$f":"MIN($L$5:$L$104)","v":0},"kW",null,0,null,{"$f":"IF(OR($V38=\"Utility\",$AA38=0),\"x\",IF($G38=\"hot\",\"x\",IF(AND(AO$6>$E38,AN$6<$F38),IF(AN$6>$E38,IF(AO$6>$F38,$U38/($F38-$E38)*($F38-AN$6),$U38/($F38-$E38)*(AO$6-AN$6)),$U38/($F38-$E38)*(AO$6-$E38)),\"x\")))","v":"x"},"x","x","x","x","x","x","x","x","x","x","x","x","x","x","x","x","x","x","x","x","x","x","x","x","x","x","x","x","x","x","x",{"$f":"IF(OR($V38=\"Utility\",$AA38=0),\"x\",IF($G38=\"hot\",\"x\",IF(AND(BU$6>$E38,BT$6<$F38),IF(BT$6>$E38,IF(BU$6>$F38,$U38/($F38-$E38)*($F38-BT$6),$U38/($F38-$E38)*(BU$6-BT$6)),$U38/($F38-$E38)*(BU$6-$E38)),\"x\")))","v":"x"},"x","x","x","x","x","x","x","x","x","x","x","x","x","x","x","x","x","x","x","x","x","x","x","x","x","x","x","x","x","x","x",{"$f":"IF(OR($V38=\"Utility\",$AA38=0),\"x\",IF($G38=\"hot\",\"x\",IF(AND(DA$6>$E38,CZ$6<$F38),IF(CZ$6>$E38,IF(DA$6>$F38,$U38/($F38-$E38)*($F38-CZ$6),$U38/($F38-$E38)*(DA$6-CZ$6)),$U38/($F38-$E38)*(DA$6-$E38)),\"x\")))","v":"x"},"x","x","x","x","x","x","x","x","x","x","x","x","x","x","x","x","x","x","x","x","x","x","x","x","x","x","x","x","x","x","x","x","x","x","x","x",null,null,null,0,null,{"$f":"IF(OR($V38=\"Utility\",$AA38=0),\"x\",IF($G38=\"cold\",\"x\",IF(AND(EQ$6>$F38,EP$6<$E38),IF(EP$6>$F38,IF(EQ$6>$E38,$U38/($E38-$F38)*($E38-EP$6),$U38/($E38-$F38)*(EQ$6-EP$6)),$U38/($E38-$F38)*(EQ$6-$F38)),\"x\")))","v":"x"},"x","x","x","x","x","x","x","x","x","x","x","x","x","x","x","x","x","x","x","x","x","x","x","x","x","x","x","x","x","x","x",{"$f":"IF(OR($V38=\"Utility\",$AA38=0),\"x\",IF($G38=\"cold\",\"x\",IF(AND(FW$6>$F38,FV$6<$E38),IF(FV$6>$F38,IF(FW$6>$E38,$U38/($E38-$F38)*($E38-FV$6),$U38/($E38-$F38)*(FW$6-FV$6)),$U38/($E38-$F38)*(FW$6-$F38)),\"x\")))","v":"x"},"x","x","x","x","x","x","x","x","x","x","x","x","x","x","x","x","x","x","x","x","x","x","x","x","x","x","x","x","x","x","x",{"$f":"IF(OR($V38=\"Utility\",$AA38=0),\"x\",IF($G38=\"cold\",\"x\",IF(AND(HC$6>$F38,HB$6<$E38),IF(HB$6>$F38,IF(HC$6>$E38,$U38/($E38-$F38)*($E38-HB$6),$U38/($E38-$F38)*(HC$6-HB$6)),$U38/($E38-$F38)*(HC$6-$F38)),\"x\")))","v":"x"},"x","x","x","x","x","x","x","x","x","x","x","x","x","x","x","x","x","x","x","x","x","x","x","x","x","x","x","x","x","x","x","x","x","x","x","x"]
["",{"$f":"IF(G41=\"hot\",COUNTIF($G$5:G41,\"hot\"),\"\")","v":""},{"$f":"IF(G41=\"cold\",COUNTIF($G$5:G41,\"cold\"),\"\")","v":""},null,null,null,"",null,null,"","","",null,null,null,null,null,null,null,null,"",null,"","","","","",null,null,null,null,null,null,null,"E max",{"$f":"MAX($U$5:$U$104)","v":0},"kWh/a",null,0,null,{"$f":"IF(OR($V39=\"Utility\",$AA39=0),\"x\",IF($G39=\"hot\",\"x\",IF(AND(AO$6>$E39,AN$6<$F39),IF(AN$6>$E39,IF(AO$6>$F39,$U39/($F39-$E39)*($F39-AN$6),$U39/($F39-$E39)*(AO$6-AN$6)),$U39/($F39-$E39)*(AO$6-$E39)),\"x\")))","v":"x"},"x","x","x","x","x","x","x","x","x","x","x","x","x","x","x","x","x","x","x","x","x","x","x","x","x","x","x","x","x","x","x",{"$f":"IF(OR($V39=\"Utility\",$AA39=0),\"x\",IF($G39=\"hot\",\"x\",IF(AND(BU$6>$E39,BT$6<$F39),IF(BT$6>$E39,IF(BU$6>$F39,$U39/($F39-$E39)*($F39-BT$6),$U39/($F39-$E39)*(BU$6-BT$6)),$U39/($F39-$E39)*(BU$6-$E39)),\"x\")))","v":"x"},"x","x","x","x","x","x","x","x","x","x","x","x","x","x","x","x","x","x","x","x","x","x","x","x","x","x","x","x","x","x","x",{"$f":"IF(OR($V39=\"Utility\",$AA39=0),\"x\",IF($G39=\"hot\",\"x\",IF(AND(DA$6>$E39,CZ$6<$F39),IF(CZ$6>$E39,IF(DA$6>$F39,$U39/($F39-$E39)*($F39-CZ$6),$U39/($F39-$E39)*(DA$6-CZ$6)),$U39/($F39-$E39)*(DA$6-$E39)),\"x\")))","v":"x"},"x","x","x","x","x","x","x","x","x","x","x","x","x","x","x","x","x","x","x","x","x","x","x","x","x","x","x","x","x","x","x","x","x","x","x","x",null,null,null,0,null,{"$f":"IF(OR($V39=\"Utility\",$AA39=0),\"x\",IF($G39=\"cold\",\"x\",IF(AND(EQ$6>$F39,EP$6<$E39),IF(EP$6>$F39,IF(EQ$6>$E39,$U39/($E39-$F39)*($E39-EP$6),$U39/($E39-$F39)*(EQ$6-EP$6)),$U39/($E39-$F39)*(EQ$6-$F39)),\"x\")))","v":"x"},"x","x","x","x","x","x","x","x","x","x","x","x","x","x","x","x","x","x","x","x","x","x","x","x","x","x","x","x","x","x","x",{"$f":"IF(OR($V39=\"Utility\",$AA39=0),\"x\",IF($G39=\"cold\",\"x\",IF(AND(FW$6>$F39,FV$6<$E39),IF(FV$6>$F39,IF(FW$6>$E39,$U39/($E39-$F39)*($E39-FV$6),$U39/($E39-$F39)*(FW$6-FV$6)),$U39/($E39-$F39)*(FW$6-$F39)),\"x\")))","v":"x"},"x","x","x","x","x","x","x","x","x","x","x","x","x","x","x","x","x","x","x","x","x","x","x","x","x","x","x","x","x","x","x",{"$f":"IF(OR($V39=\"Utility\",$AA39=0),\"x\",IF($G39=\"cold\",\"x\",IF(AND(HC$6>$F39,HB$6<$E39),IF(HB$6>$F39,IF(HC$6>$E39,$U39/($E39-$F39)*($E39-HB$6),$U39/($E39-$F39)*(HC$6-HB$6)),$U39/($E39-$F39)*(HC$6-$F39)),\"x\")))","v":"x"},"x","x","x","x","x","x","x","x","x","x","x","x","x","x","x","x","x","x","x","x","x","x","x","x","x","x","x","x","x","x","x","x","x","x","x","x"]
["",{"$f":"IF(G42=\"hot\",COUNTIF($G$5:G42,\"hot\"),\"\")","v":""},{"$f":"IF(G42=\"cold\",COUNTIF($G$5:G42,\"cold\"),\"\")","v":""},null,null,null,"",null,null,"","","",null,null,null,null,null,null,null,null,"",null,"","","","","",null,null,null,null,null,null,null,"E min",{"$f":"MIN($U$5:$U$104)","v":0},"kWh/a",null,0,null,{"$f":"IF(OR($V40=\"Utility\",$AA40=0),\"x\",IF($G40=\"hot\",\"x\",IF(AND(AO$6>$E40,AN$6<$F40),IF(AN$6>$E40,IF(AO$6>$F40,$U40/($F40-$E40)*($F40-AN$6),$U40/($F40-$E40)*(AO$6-AN$6)),$U40/($F40-$E40)*(AO$6-$E40)),\"x\")))","v":"x"},"x","x","x","x","x","x","x","x","x","x","x","x","x","x","x","x","x","x","x","x","x","x","x","x","x","x","x","x","x","x","x",{"$f":"IF(OR($V40=\"Utility\",$AA40=0),\"x\",IF($G40=\"hot\",\"x\",IF(AND(BU$6>$E40,BT$6<$F40),IF(BT$6>$E40,IF(BU$6>$F40,$U40/($F40-$E40)*($F40-BT$6),$U40/($F40-$E40)*(BU$6-BT$6)),$U40/($F40-$E40)*(BU$6-$E40)),\"x\")))","v":"x"},"x","x","x","x","x","x","x","x","x","x","x","x","x","x","x","x","x","x","x","x","x","x","x","x","x","x","x","x","x","x","x",{"$f":"IF(OR($V40=\"Utility\",$AA40=0),\"x\",IF($G40=\"hot\",\"x\",IF(AND(DA$6>$E40,CZ$6<$F40),IF(CZ$6>$E40,IF(DA$6>$F40,$U40/($F40-$E40)*($F40-CZ$6),$U40/($F40-$E40)*(DA$6-CZ$6)),$U40/($F40-$E40)*(DA$6-$E40)),\"x\")))","v":"x"},"x","x","x","x","x","x","x","x","x","x","x","x","x","x","x","x","x","x","x","x","x","x","x","x","x","x","x","x","x","x","x","x","x","x","x","x",null,null,null,0,null,{"$f":"IF(OR($V40=\"Utility\",$AA40=0),\"x\",IF($G40=\"cold\",\"x\",IF(AND(EQ$6>$F40,EP$6<$E40),IF(EP$6>$F40,IF(EQ$6>$E40,$U40/($E40-$F40)*($E40-EP$6),$U40/($E40-$F40)*(EQ$6-EP$6)),$U40/($E40-$F40)*(EQ$6-$F40)),\"x\")))","v":"x"},"x","x","x","x","x","x","x","x","x","x","x","x","x","x","x","x","x","x","x","x","x","x","x","x","x","x","x","x","x","x","x",{"$f":"IF(OR($V40=\"Utility\",$AA40=0),\"x\",IF($G40=\"cold\",\"x\",IF(AND(FW$6>$F40,FV$6<$E40),IF(FV$6>$F40,IF(FW$6>$E40,$U40/($E40-$F40)*($E40-FV$6),$U40/($E40-$F40)*(FW$6-FV$6)),$U40/($E40-$F40)*(FW$6-$F40)),\"x\")))","v":"x"},"x","x","x","x","x","x","x","x","x","x","x","x","x","x","x","x","x","x","x","x","x","x","x","x","x","x","x","x","x","x","x",{"$f":"IF(OR($V40=\"Utility\",$AA40=0),\"x\",IF($G40=\"cold\",\"x\",IF(AND(HC$6>$F40,HB$6<$E40),IF(HB$6>$F40,IF(HC$6>$E40,$U40/($E40-$F40)*($E40-HB$6),$U40/($E40-$F40)*(HC$6-HB$6)),$U40/($E40-$F40)*(HC$6-$F40)),\"x\")))","v":"x"},"x","x","x","x","x","x","x","x","x","x","x","x","x","x","x","x","x","x","x","x","x","x","x","x","x","x","x","x","x","x","x","x","x","x","x","x"]
["",{"$f":"IF(G43=\"hot\",COUNTIF($G$5:G43,\"hot\"),\"\")","v":""},{"$f":"IF(G43=\"cold\",COUNTIF($G$5:G43,\"cold\"),\"\")","v":""},null,null,null,"",null,null,"","","",null,null,null,null,null,null,null,null,"",null,"","","","","",null,null,null,null,null,null,null,null,null,null,null,0,null,{"$f":"IF(OR($V41=\"Utility\",$AA41=0),\"x\",IF($G41=\"hot\",\"x\",IF(AND(AO$6>$E41,AN$6<$F41),IF(AN$6>$E41,IF(AO$6>$F41,$U41/($F41-$E41)*($F41-AN$6),$U41/($F41-$E41)*(AO$6-AN$6)),$U41/($F41-$E41)*(AO$6-$E41)),\"x\")))","v":"x"},"x","x","x","x","x","x","x","x","x","x","x","x","x","x","x","x","x","x","x","x","x","x","x","x","x","x","x","x","x","x","x",{"$f":"IF(OR($V41=\"Utility\",$AA41=0),\"x\",IF($G41=\"hot\",\"x\",IF(AND(BU$6>$E41,BT$6<$F41),IF(BT$6>$E41,IF(BU$6>$F41,$U41/($F41-$E41)*($F41-BT$6),$U41/($F41-$E41)*(BU$6-BT$6)),$U41/($F41-$E41)*(BU$6-$E41)),\"x\")))","v":"x"},"x","x","x","x","x","x","x","x","x","x","x","x","x","x","x","x","x","x","x","x","x","x","x","x","x","x","x","x","x","x","x",{"$f":"IF(OR($V41=\"Utility\",$AA41=0),\"x\",IF($G41=\"hot\",\"x\",IF(AND(DA$6>$E41,CZ$6<$F41),IF(CZ$6>$E41,IF(DA$6>$F41,$U41/($F41-$E41)*($F41-CZ$6),$U41/($F41-$E41)*(DA$6-CZ$6)),$U41/($F41-$E41)*(DA$6-$E41)),\"x\")))","v":"x"},"x","x","x","x","x","x","x","x","x","x","x","x","x","x","x","x","x","x","x","x","x","x","x","x","x","x","x","x","x","x","x","x","x","x","x","x",null,null,null,0,null,{"$f":"IF(OR($V41=\"Utility\",$AA41=0),\"x\",IF($G41=\"cold\",\"x\",IF(AND(EQ$6>$F41,EP$6<$E41),IF(EP$6>$F41,IF(EQ$6>$E41,$U41/($E41-$F41)*($E41-EP$6),$U41/($E41-$F41)*(EQ$6-EP$6)),$U41/($E41-$F41)*(EQ$6-$F41)),\"x\")))","v":"x"},"x","x","x","x","x","x","x","x","x","x","x","x","x","x","x","x","x","x","x","x","x","x","x","x","x","x","x","x","x","x","x",{"$f":"IF(OR($V41=\"Utility\",$AA41=0),\"x\",IF($G41=\"cold\",\"x\",IF(AND(FW$6>$F41,FV$6<$E41),IF(FV$6>$F41,IF(FW$6>$E41,$U41/($E41-$F41)*($E41-FV$6),$U41/($E41-$F41)*(FW$6-FV$6)),$U41/($E41-$F41)*(FW$6-$F41)),\"x\")))","v":"x"},"x","x","x","x","x","x","x","x","x","x","x","x","x","x","x","x","x","x","x","x","x","x","x","x","x","x","x","x","x","x","x",{"$f":"IF(OR($V41=\"Utility\",$AA41=0),\"x\",IF($G41=\"cold\",\"x\",IF(AND(HC$6>$F41,HB$6<$E41),IF(HB$6>$F41,IF(HC$6>$E41,$U41/($E41-$F41)*($E41-HB$6),$U41/($E41-$F41)*(HC$6-HB$6)),$U41/($E41-$F41)*(HC$6-$F41)),\"x\")))","v":"x"},"x","x","x","x","x","x","x","x","x","x","x","x","x","x","x","x","x","x","x","x","x","x","x","x","x","x","x","x","x","x","x","x","x","x","x","x"]
["",{"$f":"IF(G44=\"hot\",COUNTIF($G$5:G44,\"hot\"),\"\")","v":""},{"$f":"IF(G44=\"cold\",COUNTIF($G$5:G44,\"cold\"),\"\")","v":""},null,null,null,"",null,null,"","","",null,null,null,null,null,null,null,null,"",null,"","","","","",null,null,null,null,null,null,null,null,null,null,null,0,null,{"$f":"IF(OR($V42=\"Utility\",$AA42=0),\"x\",IF($G42=\"hot\",\"x\",IF(AND(AO$6>$E42,AN$6<$F42),IF(AN$6>$E42,IF(AO$6>$F42,$U42/($F42-$E42)*($F42-AN$6),$U42/($F42-$E42)*(AO$6-AN$6)),$U42/($F42-$E42)*(AO$6-$E42)),\"x\")))","v":"x"},"x","x","x","x","x","x","x","x","x","x","x","x","x","x","x","x","x","x","x","x","x","x","x","x","x","x","x","x","x","x","x",{"$f":"IF(OR($V42=\"Utility\",$AA42=0),\"x\",IF($G42=\"hot\",\"x\",IF(AND(BU$6>$E42,BT$6<$F42),IF(BT$6>$E42,IF(BU$6>$F42,$U42/($F42-$E42)*($F42-BT$6),$U42/($F42-$E42)*(BU$6-BT$6)),$U42/($F42-$E42)*(BU$6-$E42)),\"x\")))","v":"x"},"x","x","x","x","x","x","x","x","x","x","x","x","x","x","x","x","x","x","x","x","x","x","x","x","x","x","x","x","x","x","x",{"$f":"IF(OR($V42=\"Utility\",$AA42=0),\"x\",IF($G42=\"hot\",\"x\",IF(AND(DA$6>$E42,CZ$6<$F42),IF(CZ$6>$E42,IF(DA$6>$F42,$U42/($F42-$E42)*($F42-CZ$6),$U42/($F42-$E42)*(DA$6-CZ$6)),$U42/($F42-$E42)*(DA$6-$E42)),\"x\")))","v":"x"},"x","x","x","x","x","x","x","x","x","x","x","x","x","x","x","x","x","x","x","x","x","x","x","x","x","x","x","x","x","x","x","x","x","x","x","x",null,null,null,0,null,{"$f":"IF(OR($V42=\"Utility\",$AA42=0),\"x\",IF($G42=\"cold\",\"x\",IF(AND(EQ$6>$F42,EP$6<$E42),IF(EP$6>$F42,IF(EQ$6>$E42,$U42/($E42-$F42)*($E42-EP$6),$U42/($E42-$F42)*(EQ$6-EP$6)),$U42/($E42-$F42)*(EQ$6-$F42)),\"x\")))","v":"x"},"x","x","x","x","x","x","x","x","x","x","x","x","x","x","x","x","x","x","x","x","x","x","x","x","x","x","x","x","x","x","x",{"$f":"IF(OR($V42=\"Utility\",$AA42=0),\"x\",IF($G42=\"cold\",\"x\",IF(AND(FW$6>$F42,FV$6<$E42),IF(FV$6>$F42,IF(FW$6>$E42,$U42/($E42-$F42)*($E42-FV$6),$U42/($E42-$F42)*(FW$6-FV$6)),$U42/($E42-$F42)*(FW$6-$F42)),\"x\")))","v":"x"},"x","x","x","x","x","x","x","x","x","x","x","x","x","x","x","x","x","x","x","x","x","x","x","x","x","x","x","x","x","x","x",{"$f":"IF(OR($V42=\"Utility\",$AA42=0),\"x\",IF($G42=\"cold\",\"x\",IF(AND(HC$6>$F42,HB$6<$E42),IF(HB$6>$F42,IF(HC$6>$E42,$U42/($E42-$F42)*($E42-HB$6),$U42/($E42-$F42)*(HC$6-HB$6)),$U42/($E42-$F42)*(HC$6-$F42)),\"x\")))","v":"x"},"x","x","x","x","x","x","x","x","x","x","x","x","x","x","x","x","x","x","x","x","x","x","x","x","x","x","x","x","x","x","x","x","x","x","x","x"]
["",{"$f":"IF(G45=\"hot\",COUNTIF($G$5:G45,\"hot\"),\"\")","v":""},{"$f":"IF(G45=\"cold\",COUNTIF($G$5:G45,\"cold\"),\"\")","v":""},null,null,null,"",null,null,"","","",null,null,null,null,null,null,null,null,"",null,"","","","","",null,null,null,null,null,null,null,null,null,null,null,0,null,{"$f":"IF(OR($V43=\"Utility\",$AA43=0),\"x\",IF($G43=\"hot\",\"x\",IF(AND(AO$6>$E43,AN$6<$F43),IF(AN$6>$E43,IF(AO$6>$F43,$U43/($F43-$E43)*($F43-AN$6),$U43/($F43-$E43)*(AO$6-AN$6)),$U43/($F43-$E43)*(AO$6-$E43)),\"x\")))","v":"x"},"x","x","x","x","x","x","x","x","x","x","x","x","x","x","x","x","x","x","x","x","x","x","x","x","x","x","x","x","x","x","x",{"$f":"IF(OR($V43=\"Utility\",$AA43=0),\"x\",IF($G43=\"hot\",\"x\",IF(AND(BU$6>$E43,BT$6<$F43),IF(BT$6>$E43,IF(BU$6>$F43,$U43/($F43-$E43)*($F43-BT$6),$U43/($F43-$E43)*(BU$6-BT$6)),$U43/($F43-$E43)*(BU$6-$E43)),\"x\")))","v":"x"},"x","x","x","x","x","x","x","x","x","x","x","x","x","x","x","x","x","x","x","x","x","x","x","x","x","x","x","x","x","x","x",{"$f":"IF(OR($V43=\"Utility\",$AA43=0),\"x\",IF($G43=\"hot\",\"x\",IF(AND(DA$6>$E43,CZ$6<$F43),IF(CZ$6>$E43,IF(DA$6>$F43,$U43/($F43-$E43)*($F43-CZ$6),$U43/($F43-$E43)*(DA$6-CZ$6)),$U43/($F43-$E43)*(DA$6-$E43)),\"x\")))","v":"x"},"x","x","x","x","x","x","x","x","x","x","x","x","x","x","x","x","x","x","x","x","x","x","x","x","x","x","x","x","x","x","x","x","x","x","x","x",null,null,null,0,null,{"$f":"IF(OR($V43=\"Utility\",$AA43=0),\"x\",IF($G43=\"cold\",\"x\",IF(AND(EQ$6>$F43,EP$6<$E43),IF(EP$6>$F43,IF(EQ$6>$E43,$U43/($E43-$F43)*($E43-EP$6),$U43/($E43-$F43)*(EQ$6-EP$6)),$U43/($E43-$F43)*(EQ$6-$F43)),\"x\")))","v":"x"},"x","x","x","x","x","x","x","x","x","x","x","x","x","x","x","x","x","x","x","x","x","x","x","x","x","x","x","x","x","x","x",{"$f":"IF(OR($V43=\"Utility\",$AA43=0),\"x\",IF($G43=\"cold\",\"x\",IF(AND(FW$6>$F43,FV$6<$E43),IF(FV$6>$F43,IF(FW$6>$E43,$U43/($E43-$F43)*($E43-FV$6),$U43/($E43-$F43)*(FW$6-FV$6)),$U43/($E43-$F43)*(FW$6-$F43)),\"x\")))","v":"x"},"x","x","x","x","x","x","x","x","x","x","x","x","x","x","x","x","x","x","x","x","x","x","x","x","x","x","x","x","x","x","x",{"$f":"IF(OR($V43=\"Utility\",$AA43=0),\"x\",IF($G43=\"cold\",\"x\",IF(AND(HC$6>$F43,HB$6<$E43),IF(HB$6>$F43,IF(HC$6>$E43,$U43/($E43-$F43)*($E43-HB$6),$U43/($E43-$F43)*(HC$6-HB$6)),$U43/($E43-$F43)*(HC$6-$F43)),\"x\")))","v":"x"},"x","x","x","x","x","x","x","x","x","x","x","x","x","x","x","x","x","x","x","x","x","x","x","x","x","x","x","x","x","x","x","x","x","x","x","x"]
["",{"$f":"IF(G46=\"hot\",COUNTIF($G$5:G46,\"hot\"),\"\")","v":""},{"$f":"IF(G46=\"cold\",COUNTIF($G$5:G46,\"cold\"),\"\")","v":""},null,null,null,"",null,null,"","","",null,null,null,null,null,null,null,null,"",null,"","","","","",null,null,null,null,null,null,null,null,null,null,null,0,null,{"$f":"IF(OR($V44=\"Utility\",$AA44=0),\"x\",IF($G44=\"hot\",\"x\",IF(AND(AO$6>$E44,AN$6<$F44),IF(AN$6>$E44,IF(AO$6>$F44,$U44/($F44-$E44)*($F44-AN$6),$U44/($F44-$E44)*(AO$6-AN$6)),$U44/($F44-$E44)*(AO$6-$E44)),\"x\")))","v":"x"},"x","x","x","x","x","x","x","x","x","x","x","x","x","x","x","x","x","x","x","x","x","x","x","x","x","x","x","x","x","x","x",{"$f":"IF(OR($V44=\"Utility\",$AA44=0),\"x\",IF($G44=\"hot\",\"x\",IF(AND(BU$6>$E44,BT$6<$F44),IF(BT$6>$E44,IF(BU$6>$F44,$U44/($F44-$E44)*($F44-BT$6),$U44/($F44-$E44)*(BU$6-BT$6)),$U44/($F44-$E44)*(BU$6-$E44)),\"x\")))","v":"x"},"x","x","x","x","x","x","x","x","x","x","x","x","x","x","x","x","x","x","x","x","x","x","x","x","x","x","x","x","x","x","x",{"$f":"IF(OR($V44=\"Utility\",$AA44=0),\"x\",IF($G44=\"hot\",\"x\",IF(AND(DA$6>$E44,CZ$6<$F44),IF(CZ$6>$E44,IF(DA$6>$F44,$U44/($F44-$E44)*($F44-CZ$6),$U44/($F44-$E44)*(DA$6-CZ$6)),$U44/($F44-$E44)*(DA$6-$E44)),\"x\")))","v":"x"},"x","x","x","x","x","x","x","x","x","x","x","x","x","x","x","x","x","x","x","x","x","x","x","x","x","x","x","x","x","x","x","x","x","x","x","x",null,null,null,0,null,{"$f":"IF(OR($V44=\"Utility\",$AA44=0),\"x\",IF($G44=\"cold\",\"x\",IF(AND(EQ$6>$F44,EP$6<$E44),IF(EP$6>$F44,IF(EQ$6>$E44,$U44/($E44-$F44)*($E44-EP$6),$U44/($E44-$F44)*(EQ$6-EP$6)),$U44/($E44-$F44)*(EQ$6-$F44)),\"x\")))","v":"x"},"x","x","x","x","x","x","x","x","x","x","x","x","x","x","x","x","x","x","x","x","x","x","x","x","x","x","x","x","x","x","x",{"$f":"IF(OR($V44=\"Utility\",$AA44=0),\"x\",IF($G44=\"cold\",\"x\",IF(AND(FW$6>$F44,FV$6<$E44),IF(FV$6>$F44,IF(FW$6>$E44,$U44/($E44-$F44)*($E44-FV$6),$U44/($E44-$F44)*(FW$6-FV$6)),$U44/($E44-$F44)*(FW$6-$F44)),\"x\")))","v":"x"},"x","x","x","x","x","x","x","x","x","x","x","x","x","x","x","x","x","x","x","x","x","x","x","x","x","x","x","x","x","x","x",{"$f":"IF(OR($V44=\"Utility\",$AA44=0),\"x\",IF($G44=\"cold\",\"x\",IF(AND(HC$6>$F44,HB$6<$E44),IF(HB$6>$F44,IF(HC$6>$E44,$U44/($E44-$F44)*($E44-HB$6),$U44/($E44-$F44)*(HC$6-HB$6)),$U44/($E44-$F44)*(HC$6-$F44)),\"x\")))","v":"x"},"x","x","x","x","x","x","x","x","x","x","x","x","x","x","x","x","x","x","x","x","x","x","x","x","x","x","x","x","x","x","x","x","x","x","x","x"]
["",{"$f":"IF(G47=\"hot\",COUNTIF($G$5:G47,\"hot\"),\"\")","v":""},{"$f":"IF(G47=\"cold\",COUNTIF($G$5:G47,\"cold\"),\"\")","v":""},null,null,null,"",null,null,"","","",null,null,null,null,null,null,null,null,"",null,"","","","","",null,null,null,null,null,null,null,null,null,null,null,0,null,{"$f":"IF(OR($V45=\"Utility\",$AA45=0),\"x\",IF($G45=\"hot\",\"x\",IF(AND(AO$6>$E45,AN$6<$F45),IF(AN$6>$E45,IF(AO$6>$F45,$U45/($F45-$E45)*($F45-AN$6),$U45/($F45-$E45)*(AO$6-AN$6)),$U45/($F45-$E45)*(AO$6-$E45)),\"x\")))","v":"x"},"x","x","x","x","x","x","x","x","x","x","x","x","x","x","x","x","x","x","x","x","x","x","x","x","x","x","x","x","x","x","x",{"$f":"IF(OR($V45=\"Utility\",$AA45=0),\"x\",IF($G45=\"hot\",\"x\",IF(AND(BU$6>$E45,BT$6<$F45),IF(BT$6>$E45,IF(BU$6>$F45,$U45/($F45-$E45)*($F45-BT$6),$U45/($F45-$E45)*(BU$6-BT$6)),$U45/($F45-$E45)*(BU$6-$E45)),\"x\")))","v":"x"},"x","x","x","x","x","x","x","x","x","x","x","x","x","x","x","x","x","x","x","x","x","x","x","x","x","x","x","x","x","x","x",{"$f":"IF(OR($V45=\"Utility\",$AA45=0),\"x\",IF($G45=\"hot\",\"x\",IF(AND(DA$6>$E45,CZ$6<$F45),IF(CZ$6>$E45,IF(DA$6>$F45,$U45/($F45-$E45)*($F45-CZ$6),$U45/($F45-$E45)*(DA$6-CZ$6)),$U45/($F45-$E45)*(DA$6-$E45)),\"x\")))","v":"x"},"x","x","x","x","x","x","x","x","x","x","x","x","x","x","x","x","x","x","x","x","x","x","x","x","x","x","x","x","x","x","x","x","x","x","x","x",null,null,null,0,null,{"$f":"IF(OR($V45=\"Utility\",$AA45=0),\"x\",IF($G45=\"cold\",\"x\",IF(AND(EQ$6>$F45,EP$6<$E45),IF(EP$6>$F45,IF(EQ$6>$E45,$U45/($E45-$F45)*($E45-EP$6),$U45/($E45-$F45)*(EQ$6-EP$6)),$U45/($E45-$F45)*(EQ$6-$F45)),\"x\")))","v":"x"},"x","x","x","x","x","x","x","x","x","x","x","x","x","x","x","x","x","x","x","x","x","x","x","x","x","x","x","x","x","x","x",{"$f":"IF(OR($V45=\"Utility\",$AA45=0),\"x\",IF($G45=\"cold\",\"x\",IF(AND(FW$6>$F45,FV$6<$E45),IF(FV$6>$F45,IF(FW$6>$E45,$U45/($E45-$F45)*($E45-FV$6),$U45/($E45-$F45)*(FW$6-FV$6)),$U45/($E45-$F45)*(FW$6-$F45)),\"x\")))","v":"x"},"x","x","x","x","x","x","x","x","x","x","x","x","x","x","x","x","x","x","x","x","x","x","x","x","x","x","x","x","x","x","x",{"$f":"IF(OR($V45=\"Utility\",$AA45=0),\"x\",IF($G45=\"cold\",\"x\",IF(AND(HC$6>$F45,HB$6<$E45),IF(HB$6>$F45,IF(HC$6>$E45,$U45/($E45-$F45)*($E45-HB$6),$U45/($E45-$F45)*(HC$6-HB$6)),$U45/($E45-$F45)*(HC$6-$F45)),\"x\")))","v":"x"},"x","x","x","x","x","x","x","x","x","x","x","x","x","x","x","x","x","x","x","x","x","x","x","x","x","x","x","x","x","x","x","x","x","x","x","x"]
["",{"$f":"IF(G48=\"hot\",COUNTIF($G$5:G48,\"hot\"),\"\")","v":""},{"$f":"IF(G48=\"cold\",COUNTIF($G$5:G48,\"cold\"),\"\")","v":""},null,null,null,"",null,null,"","","",null,null,null,null,null,null,null,null,"",null,"","","","","",null,null,null,null,null,null,null,null,null,null,null,0,null,{"$f":"IF(OR($V46=\"Utility\",$AA46=0),\"x\",IF($G46=\"hot\",\"x\",IF(AND(AO$6>$E46,AN$6<$F46),IF(AN$6>$E46,IF(AO$6>$F46,$U46/($F46-$E46)*($F46-AN$6),$U46/($F46-$E46)*(AO$6-AN$6)),$U46/($F46-$E46)*(AO$6-$E46)),\"x\")))","v":"x"},"x","x","x","x","x","x","x","x","x","x","x","x","x","x","x","x","x","x","x","x","x","x","x","x","x","x","x","x","x","x","x",{"$f":"IF(OR($V46=\"Utility\",$AA46=0),\"x\",IF($G46=\"hot\",\"x\",IF(AND(BU$6>$E46,BT$6<$F46),IF(BT$6>$E46,IF(BU$6>$F46,$U46/($F46-$E46)*($F46-BT$6),$U46/($F46-$E46)*(BU$6-BT$6)),$U46/($F46-$E46)*(BU$6-$E46)),\"x\")))","v":"x"},"x","x","x","x","x","x","x","x","x","x","x","x","x","x","x","x","x","x","x","x","x","x","x","x","x","x","x","x","x","x","x",{"$f":"IF(OR($V46=\"Utility\",$AA46=0),\"x\",IF($G46=\"hot\",\"x\",IF(AND(DA$6>$E46,CZ$6<$F46),IF(CZ$6>$E46,IF(DA$6>$F46,$U46/($F46-$E46)*($F46-CZ$6),$U46/($F46-$E46)*(DA$6-CZ$6)),$U46/($F46-$E46)*(DA$6-$E46)),\"x\")))","v":"x"},"x","x","x","x","x","x","x","x","x","x","x","x","x","x","x","x","x","x","x","x","x","x","x","x","x","x","x","x","x","x","x","x","x","x","x","x",null,null,null,0,null,{"$f":"IF(OR($V46=\"Utility\",$AA46=0),\"x\",IF($G46=\"cold\",\"x\",IF(AND(EQ$6>$F46,EP$6<$E46),IF(EP$6>$F46,IF(EQ$6>$E46,$U46/($E46-$F46)*($E46-EP$6),$U46/($E46-$F46)*(EQ$6-EP$6)),$U46/($E46-$F46)*(EQ$6-$F46)),\"x\")))","v":"x"},"x","x","x","x","x","x","x","x","x","x","x","x","x","x","x","x","x","x","x","x","x","x","x","x","x","x","x","x","x","x","x",{"$f":"IF(OR($V46=\"Utility\",$AA46=0),\"x\",IF($G46=\"cold\",\"x\",IF(AND(FW$6>$F46,FV$6<$E46),IF(FV$6>$F46,IF(FW$6>$E46,$U46/($E46-$F46)*($E46-FV$6),$U46/($E46-$F46)*(FW$6-FV$6)),$U46/($E46-$F46)*(FW$6-$F46)),\"x\")))","v":"x"},"x","x","x","x","x","x","x","x","x","x","x","x","x","x","x","x","x","x","x","x","x","x","x","x","x","x","x","x","x","x","x",{"$f":"IF(OR($V46=\"Utility\",$AA46=0),\"x\",IF($G46=\"cold\",\"x\",IF(AND(HC$6>$F46,HB$6<$E46),IF(HB$6>$F46,IF(HC$6>$E46,$U46/($E46-$F46)*($E46-HB$6),$U46/($E46-$F46)*(HC$6-HB$6)),$U46/($E46-$F46)*(HC$6-$F46)),\"x\")))","v":"x"},"x","x","x","x","x","x","x","x","x","x","x","x","x","x","x","x","x","x","x","x","x","x","x","x","x","x","x","x","x","x","x","x","x","x","x","x"]
["",{"$f":"IF(G49=\"hot\",COUNTIF($G$5:G49,\"hot\"),\"\")","v":""},{"$f":"IF(G49=\"cold\",COUNTIF($G$5:G49,\"cold\"),\"\")","v":""},null,null,null,"",null,null,"","","",null,null,null,null,null,null,null,null,"",null,"","","","","",null,null,null,null,null,null,null,null,null,null,null,0,null,{"$f":"IF(OR($V47=\"Utility\",$AA47=0),\"x\",IF($G47=\"hot\",\"x\",IF(AND(AO$6>$E47,AN$6<$F47),IF(AN$6>$E47,IF(AO$6>$F47,$U47/($F47-$E47)*($F47-AN$6),$U47/($F47-$E47)*(AO$6-AN$6)),$U47/($F47-$E47)*(AO$6-$E47)),\"x\")))","v":"x"},"x","x","x","x","x","x","x","x","x","x","x","x","x","x","x","x","x","x","x","x","x","x","x","x","x","x","x","x","x","x","x",{"$f":"IF(OR($V47=\"Utility\",$AA47=0),\"x\",IF($G47=\"hot\",\"x\",IF(AND(BU$6>$E47,BT$6<$F47),IF(BT$6>$E47,IF(BU$6>$F47,$U47/($F47-$E47)*($F47-BT$6),$U47/($F47-$E47)*(BU$6-BT$6)),$U47/($F47-$E47)*(BU$6-$E47)),\"x\")))","v":"x"},"x","x","x","x","x","x","x","x","x","x","x","x","x","x","x","x","x","x","x","x","x","x","x","x","x","x","x","x","x","x","x",{"$f":"IF(OR($V47=\"Utility\",$AA47=0),\"x\",IF($G47=\"hot\",\"x\",IF(AND(DA$6>$E47,CZ$6<$F47),IF(CZ$6>$E47,IF(DA$6>$F47,$U47/($F47-$E47)*($F47-CZ$6),$U47/($F47-$E47)*(DA$6-CZ$6)),$U47/($F47-$E47)*(DA$6-$E47)),\"x\")))","v":"x"},"x","x","x","x","x","x","x","x","x","x","x","x","x","x","x","x","x","x","x","x","x","x","x","x","x","x","x","x","x","x","x","x","x","x","x","x",null,null,null,0,null,{"$f":"IF(OR($V47=\"Utility\",$AA47=0),\"x\",IF($G47=\"cold\",\"x\",IF(AND(EQ$6>$F47,EP$6<$E47),IF(EP$6>$F47,IF(EQ$6>$E47,$U47/($E47-$F47)*($E47-EP$6),$U47/($E47-$F47)*(EQ$6-EP$6)),$U47/($E47-$F47)*(EQ$6-$F47)),\"x\")))","v":"x"},"x","x","x","x","x","x","x","x","x","x","x","x","x","x","x","x","x","x","x","x","x","x","x","x","x","x","x","x","x","x","x",{"$f":"IF(OR($V47=\"Utility\",$AA47=0),\"x\",IF($G47=\"cold\",\"x\",IF(AND(FW$6>$F47,FV$6<$E47),IF(FV$6>$F47,IF(FW$6>$E47,$U47/($E47-$F47)*($E47-FV$6),$U47/($E47-$F47)*(FW$6-FV$6)),$U47/($E47-$F47)*(FW$6-$F47)),\"x\")))","v":"x"},"x","x","x","x","x","x","x","x","x","x","x","x","x","x","x","x","x","x","x","x","x","x","x","x","x","x","x","x","x","x","x",{"$f":"IF(OR($V47=\"Utility\",$AA47=0),\"x\",IF($G47=\"cold\",\"x\",IF(AND(HC$6>$F47,HB$6<$E47),IF(HB$6>$F47,IF(HC$6>$E47,$U47/($E47-$F47)*($E47-HB$6),$U47/($E47-$F47)*(HC$6-HB$6)),$U47/($E47-$F47)*(HC$6-$F47)),\"x\")))","v":"x"},"x","x","x","x","x","x","x","x","x","x","x","x","x","x","x","x","x","x","x","x","x","x","x","x","x","x","x","x","x","x","x","x","x","x","x","x"]
["",{"$f":"IF(G50=\"hot\",COUNTIF($G$5:G50,\"hot\"),\"\")","v":""},{"$f":"IF(G50=\"cold\",COUNTIF($G$5:G50,\"cold\"),\"\")","v":""},null,null,null,"",null,null,"","","",null,null,null,null,null,null,null,null,"",null,"","","","","",null,null,null,null,null,null,null,null,null,null,null,0,null,{"$f":"IF(OR($V48=\"Utility\",$AA48=0),\"x\",IF($G48=\"hot\",\"x\",IF(AND(AO$6>$E48,AN$6<$F48),IF(AN$6>$E48,IF(AO$6>$F48,$U48/($F48-$E48)*($F48-AN$6),$U48/($F48-$E48)*(AO$6-AN$6)),$U48/($F48-$E48)*(AO$6-$E48)),\"x\")))","v":"x"},"x","x","x","x","x","x","x","x","x","x","x","x","x","x","x","x","x","x","x","x","x","x","x","x","x","x","x","x","x","x","x",{"$f":"IF(OR($V48=\"Utility\",$AA48=0),\"x\",IF($G48=\"hot\",\"x\",IF(AND(BU$6>$E48,BT$6<$F48),IF(BT$6>$E48,IF(BU$6>$F48,$U48/($F48-$E48)*($F48-BT$6),$U48/($F48-$E48)*(BU$6-BT$6)),$U48/($F48-$E48)*(BU$6-$E48)),\"x\")))","v":"x"},"x","x","x","x","x","x","x","x","x","x","x","x","x","x","x","x","x","x","x","x","x","x","x","x","x","x","x","x","x","x","x",{"$f":"IF(OR($V48=\"Utility\",$AA48=0),\"x\",IF($G48=\"hot\",\"x\",IF(AND(DA$6>$E48,CZ$6<$F48),IF(CZ$6>$E48,IF(DA$6>$F48,$U48/($F48-$E48)*($F48-CZ$6),$U48/($F48-$E48)*(DA$6-CZ$6)),$U48/($F48-$E48)*(DA$6-$E48)),\"x\")))","v":"x"},"x","x","x","x","x","x","x","x","x","x","x","x","x","x","x","x","x","x","x","x","x","x","x","x","x","x","x","x","x","x","x","x","x","x","x","x",null,null,null,0,null,{"$f":"IF(OR($V48=\"Utility\",$AA48=0),\"x\",IF($G48=\"cold\",\"x\",IF(AND(EQ$6>$F48,EP$6<$E48),IF(EP$6>$F48,IF(EQ$6>$E48,$U48/($E48-$F48)*($E48-EP$6),$U48/($E48-$F48)*(EQ$6-EP$6)),$U48/($E48-$F48)*(EQ$6-$F48)),\"x\")))","v":"x"},"x","x","x","x","x","x","x","x","x","x","x","x","x","x","x","x","x","x","x","x","x","x","x","x","x","x","x","x","x","x","x",{"$f":"IF(OR($V48=\"Utility\",$AA48=0),\"x\",IF($G48=\"cold\",\"x\",IF(AND(FW$6>$F48,FV$6<$E48),IF(FV$6>$F48,IF(FW$6>$E48,$U48/($E48-$F48)*($E48-FV$6),$U48/($E48-$F48)*(FW$6-FV$6)),$U48/($E48-$F48)*(FW$6-$F48)),\"x\")))","v":"x"},"x","x","x","x","x","x","x","x","x","x","x","x","x","x","x","x","x","x","x","x","x","x","x","x","x","x","x","x","x","x","x",{"$f":"IF(OR($V48=\"Utility\",$AA48=0),\"x\",IF($G48=\"cold\",\"x\",IF(AND(HC$6>$F48,HB$6<$E48),IF(HB$6>$F48,IF(HC$6>$E48,$U48/($E48-$F48)*($E48-HB$6),$U48/($E48-$F48)*(HC$6-HB$6)),$U48/($E48-$F48)*(HC$6-$F48)),\"x\")))","v":"x"},"x","x","x","x","x","x","x","x","x","x","x","x","x","x","x","x","x","x","x","x","x","x","x","x","x","x","x","x","x","x","x","x","x","x","x","x"]
["",{"$f":"IF(G51=\"hot\",COUNTIF($G$5:G51,\"hot\"),\"\")","v":""},{"$f":"IF(G51=\"cold\",COUNTIF($G$5:G51,\"cold\"),\"\")","v":""},null,null,null,"",null,null,"","","",null,null,null,null,null,null,null,null,"",null,"","","","","",null,null,null,null,null,null,null,null,null,null,null,0,null,{"$f":"IF(OR($V49=\"Utility\",$AA49=0),\"x\",IF($G49=\"hot\",\"x\",IF(AND(AO$6>$E49,AN$6<$F49),IF(AN$6>$E49,IF(AO$6>$F49,$U49/($F49-$E49)*($F49-AN$6),$U49/($F49-$E49)*(AO$6-AN$6)),$U49/($F49-$E49)*(AO$6-$E49)),\"x\")))","v":"x"},"x","x","x","x","x","x","x","x","x","x","x","x","x","x","x","x","x","x","x","x","x","x","x","x","x","x","x","x","x","x","x",{"$f":"IF(OR($V49=\"Utility\",$AA49=0),\"x\",IF($G49=\"hot\",\"x\",IF(AND(BU$6>$E49,BT$6<$F49),IF(BT$6>$E49,IF(BU$6>$F49,$U49/($F49-$E49)*($F49-BT$6),$U49/($F49-$E49)*(BU$6-BT$6)),$U49/($F49-$E49)*(BU$6-$E49)),\"x\")))","v":"x"},"x","x","x","x","x","x","x","x","x","x","x","x","x","x","x","x","x","x","x","x","x","x","x","x","x","x","x","x","x","x","x",{"$f":"IF(OR($V49=\"Utility\",$AA49=0),\"x\",IF($G49=\"hot\",\"x\",IF(AND(DA$6>$E49,CZ$6<$F49),IF(CZ$6>$E49,IF(DA$6>$F49,$U49/($F49-$E49)*($F49-CZ$6),$U49/($F49-$E49)*(DA$6-CZ$6)),$U49/($F49-$E49)*(DA$6-$E49)),\"x\")))","v":"x"},"x","x","x","x","x","x","x","x","x","x","x","x","x","x","x","x","x","x","x","x","x","x","x","x","x","x","x","x","x","x","x","x","x","x","x","x",null,null,null,0,null,{"$f":"IF(OR($V49=\"Utility\",$AA49=0),\"x\",IF($G49=\"cold\",\"x\",IF(AND(EQ$6>$F49,EP$6<$E49),IF(EP$6>$F49,IF(EQ$6>$E49,$U49/($E49-$F49)*($E49-EP$6),$U49/($E49-$F49)*(EQ$6-EP$6)),$U49/($E49-$F49)*(EQ$6-$F49)),\"x\")))","v":"x"},"x","x","x","x","x","x","x","x","x","x","x","x","x","x","x","x","x","x","x","x","x","x","x","x","x","x","x","x","x","x","x",{"$f":"IF(OR($V49=\"Utility\",$AA49=0),\"x\",IF($G49=\"cold\",\"x\",IF(AND(FW$6>$F49,FV$6<$E49),IF(FV$6>$F49,IF(FW$6>$E49,$U49/($E49-$F49)*($E49-FV$6),$U49/($E49-$F49)*(FW$6-FV$6)),$U49/($E49-$F49)*(FW$6-$F49)),\"x\")))","v":"x"},"x","x","x","x","x","x","x","x","x","x","x","x","x","x","x","x","x","x","x","x","x","x","x","x","x","x","x","x","x","x","x",{"$f":"IF(OR($V49=\"Utility\",$AA49=0),\"x\",IF($G49=\"cold\",\"x\",IF(AND(HC$6>$F49,HB$6<$E49),IF(HB$6>$F49,IF(HC$6>$E49,$U49/($E49-$F49)*($E49-HB$6),$U49/($E49-$F49)*(HC$6-HB$6)),$U49/($E49-$F49)*(HC$6-$F49)),\"x\")))","v":"x"},"x","x","x","x","x","x","x","x","x","x","x","x","x","x","x","x","x","x","x","x","x","x","x","x","x","x","x","x","x","x","x","x","x","x","x","x"]
["",{"$f":"IF(G52=\"hot\",COUNTIF($G$5:G52,\"hot\"),\"\")","v":""},{"$f":"IF(G52=\"cold\",COUNTIF($G$5:G52,\"cold\"),\"\")","v":""},null,null,null,"",null,null,"","","",null,null,null,null,null,null,null,null,"",null,"","","","","",null,null,null,null,null,null,null,null,null,null,null,0,null,{"$f":"IF(OR($V50=\"Utility\",$AA50=0),\"x\",IF($G50=\"hot\",\"x\",IF(AND(AO$6>$E50,AN$6<$F50),IF(AN$6>$E50,IF(AO$6>$F50,$U50/($F50-$E50)*($F50-AN$6),$U50/($F50-$E50)*(AO$6-AN$6)),$U50/($F50-$E50)*(AO$6-$E50)),\"x\")))","v":"x"},"x","x","x","x","x","x","x","x","x","x","x","x","x","x","x","x","x","x","x","x","x","x","x","x","x","x","x","x","x","x","x",{"$f":"IF(OR($V50=\"Utility\",$AA50=0),\"x\",IF($G50=\"hot\",\"x\",IF(AND(BU$6>$E50,BT$6<$F50),IF(BT$6>$E50,IF(BU$6>$F50,$U50/($F50-$E50)*($F50-BT$6),$U50/($F50-$E50)*(BU$6-BT$6)),$U50/($F50-$E50)*(BU$6-$E50)),\"x\")))","v":"x"},"x","x","x","x","x","x","x","x","x","x","x","x","x","x","x","x","x","x","x","x","x","x","x","x","x","x","x","x","x","x","x",{"$f":"IF(OR($V50=\"Utility\",$AA50=0),\"x\",IF($G50=\"hot\",\"x\",IF(AND(DA$6>$E50,CZ$6<$F50),IF(CZ$6>$E50,IF(DA$6>$F50,$U50/($F50-$E50)*($F50-CZ$6),$U50/($F50-$E50)*(DA$6-CZ$6)),$U50/($F50-$E50)*(DA$6-$E50)),\"x\")))","v":"x"},"x","x","x","x","x","x","x","x","x","x","x","x","x","x","x","x","x","x","x","x","x","x","x","x","x","x","x","x","x","x","x","x","x","x","x","x",null,null,null,0,null,{"$f":"IF(OR($V50=\"Utility\",$AA50=0),\"x\",IF($G50=\"cold\",\"x\",IF(AND(EQ$6>$F50,EP$6<$E50),IF(EP$6>$F50,IF(EQ$6>$E50,$U50/($E50-$F50)*($E50-EP$6),$U50/($E50-$F50)*(EQ$6-EP$6)),$U50/($E50-$F50)*(EQ$6-$F50)),\"x\")))","v":"x"},"x","x","x","x","x","x","x","x","x","x","x","x","x","x","x","x","x","x","x","x","x","x","x","x","x","x","x","x","x","x","x",{"$f":"IF(OR($V50=\"Utility\",$AA50=0),\"x\",IF($G50=\"cold\",\"x\",IF(AND(FW$6>$F50,FV$6<$E50),IF(FV$6>$F50,IF(FW$6>$E50,$U50/($E50-$F50)*($E50-FV$6),$U50/($E50-$F50)*(FW$6-FV$6)),$U50/($E50-$F50)*(FW$6-$F50)),\"x\")))","v":"x"},"x","x","x","x","x","x","x","x","x","x","x","x","x","x","x","x","x","x","x","x","x","x","x","x","x","x","x","x","x","x","x",{"$f":"IF(OR($V50=\"Utility\",$AA50=0),\"x\",IF($G50=\"cold\",\"x\",IF(AND(HC$6>$F50,HB$6<$E50),IF(HB$6>$F50,IF(HC$6>$E50,$U50/($E50-$F50)*($E50-HB$6),$U50/($E50-$F50)*(HC$6-HB$6)),$U50/($E50-$F50)*(HC$6-$F50)),\"x\")))","v":"x"},"x","x","x","x","x","x","x","x","x","x","x","x","x","x","x","x","x","x","x","x","x","x","x","x","x","x","x","x","x","x","x","x","x","x","x","x"]
["",{"$f":"IF(G53=\"hot\",COUNTIF($G$5:G53,\"hot\"),\"\")","v":""},{"$f":"IF(G53=\"cold\",COUNTIF($G$5:G53,\"cold\"),\"\")","v":""},null,null,null,"",null,null,"","","",null,null,null,null,null,null,null,null,"",null,"","","","","",null,null,null,null,null,null,null,null,null,null,null,0,null,{"$f":"IF(OR($V51=\"Utility\",$AA51=0),\"x\",IF($G51=\"hot\",\"x\",IF(AND(AO$6>$E51,AN$6<$F51),IF(AN$6>$E51,IF(AO$6>$F51,$U51/($F51-$E51)*($F51-AN$6),$U51/($F51-$E51)*(AO$6-AN$6)),$U51/($F51-$E51)*(AO$6-$E51)),\"x\")))","v":"x"},"x","x","x","x","x","x","x","x","x","x","x","x","x","x","x","x","x","x","x","x","x","x","x","x","x","x","x","x","x","x","x",{"$f":"IF(OR($V51=\"Utility\",$AA51=0),\"x\",IF($G51=\"hot\",\"x\",IF(AND(BU$6>$E51,BT$6<$F51),IF(BT$6>$E51,IF(BU$6>$F51,$U51/($F51-$E51)*($F51-BT$6),$U51/($F51-$E51)*(BU$6-BT$6)),$U51/($F51-$E51)*(BU$6-$E51)),\"x\")))","v":"x"},"x","x","x","x","x","x","x","x","x","x","x","x","x","x","x","x","x","x","x","x","x","x","x","x","x","x","x","x","x","x","x",{"$f":"IF(OR($V51=\"Utility\",$AA51=0),\"x\",IF($G51=\"hot\",\"x\",IF(AND(DA$6>$E51,CZ$6<$F51),IF(CZ$6>$E51,IF(DA$6>$F51,$U51/($F51-$E51)*($F51-CZ$6),$U51/($F51-$E51)*(DA$6-CZ$6)),$U51/($F51-$E51)*(DA$6-$E51)),\"x\")))","v":"x"},"x","x","x","x","x","x","x","x","x","x","x","x","x","x","x","x","x","x","x","x","x","x","x","x","x","x","x","x","x","x","x","x","x","x","x","x",null,null,null,0,null,{"$f":"IF(OR($V51=\"Utility\",$AA51=0),\"x\",IF($G51=\"cold\",\"x\",IF(AND(EQ$6>$F51,EP$6<$E51),IF(EP$6>$F51,IF(EQ$6>$E51,$U51/($E51-$F51)*($E51-EP$6),$U51/($E51-$F51)*(EQ$6-EP$6)),$U51/($E51-$F51)*(EQ$6-$F51)),\"x\")))","v":"x"},"x","x","x","x","x","x","x","x","x","x","x","x","x","x","x","x","x","x","x","x","x","x","x","x","x","x","x","x","x","x","x",{"$f":"IF(OR($V51=\"Utility\",$AA51=0),\"x\",IF($G51=\"cold\",\"x\",IF(AND(FW$6>$F51,FV$6<$E51),IF(FV$6>$F51,IF(FW$6>$E51,$U51/($E51-$F51)*($E51-FV$6),$U51/($E51-$F51)*(FW$6-FV$6)),$U51/($E51-$F51)*(FW$6-$F51)),\"x\")))","v":"x"},"x","x","x","x","x","x","x","x","x","x","x","x","x","x","x","x","x","x","x","x","x","x","x","x","x","x","x","x","x","x","x",{"$f":"IF(OR($V51=\"Utility\",$AA51=0),\"x\",IF($G51=\"cold\",\"x\",IF(AND(HC$6>$F51,HB$6<$E51),IF(HB$6>$F51,IF(HC$6>$E51,$U51/($E51-$F51)*($E51-HB$6),$U51/($E51-$F51)*(HC$6-HB$6)),$U51/($E51-$F51)*(HC$6-$F51)),\"x\")))","v":"x"},"x","x","x","x","x","x","x","x","x","x","x","x","x","x","x","x","x","x","x","x","x","x","x","x","x","x","x","x","x","x","x","x","x","x","x","x"]
["",{"$f":"IF(G54=\"hot\",COUNTIF($G$5:G54,\"hot\"),\"\")","v":""},{"$f":"IF(G54=\"cold\",COUNTIF($G$5:G54,\"cold\"),\"\")","v":""},null,null,null,"",null,null,"","","",null,null,null,null,null,null,null,null,"",null,"","","","","",null,null,null,null,null,null,null,null,null,null,null,0,null,{"$f":"IF(OR($V52=\"Utility\",$AA52=0),\"x\",IF($G52=\"hot\",\"x\",IF(AND(AO$6>$E52,AN$6<$F52),IF(AN$6>$E52,IF(AO$6>$F52,$U52/($F52-$E52)*($F52-AN$6),$U52/($F52-$E52)*(AO$6-AN$6)),$U52/($F52-$E52)*(AO$6-$E52)),\"x\")))","v":"x"},"x","x","x","x","x","x","x","x","x","x","x","x","x","x","x","x","x","x","x","x","x","x","x","x","x","x","x","x","x","x","x",{"$f":"IF(OR($V52=\"Utility\",$AA52=0),\"x\",IF($G52=\"hot\",\"x\",IF(AND(BU$6>$E52,BT$6<$F52),IF(BT$6>$E52,IF(BU$6>$F52,$U52/($F52-$E52)*($F52-BT$6),$U52/($F52-$E52)*(BU$6-BT$6)),$U52/($F52-$E52)*(BU$6-$E52)),\"x\")))","v":"x"},"x","x","x","x","x","x","x","x","x","x","x","x","x","x","x","x","x","x","x","x","x","x","x","x","x","x","x","x","x","x","x",{"$f":"IF(OR($V52=\"Utility\",$AA52=0),\"x\",IF($G52=\"hot\",\"x\",IF(AND(DA$6>$E52,CZ$6<$F52),IF(CZ$6>$E52,IF(DA$6>$F52,$U52/($F52-$E52)*($F52-CZ$6),$U52/($F52-$E52)*(DA$6-CZ$6)),$U52/($F52-$E52)*(DA$6-$E52)),\"x\")))","v":"x"},"x","x","x","x","x","x","x","x","x","x","x","x","x","x","x","x","x","x","x","x","x","x","x","x","x","x","x","x","x","x","x","x","x","x","x","x",null,null,null,0,null,{"$f":"IF(OR($V52=\"Utility\",$AA52=0),\"x\",IF($G52=\"cold\",\"x\",IF(AND(EQ$6>$F52,EP$6<$E52),IF(EP$6>$F52,IF(EQ$6>$E52,$U52/($E52-$F52)*($E52-EP$6),$U52/($E52-$F52)*(EQ$6-EP$6)),$U52/($E52-$F52)*(EQ$6-$F52)),\"x\")))","v":"x"},"x","x","x","x","x","x","x","x","x","x","x","x","x","x","x","x","x","x","x","x","x","x","x","x","x","x","x","x","x","x","x",{"$f":"IF(OR($V52=\"Utility\",$AA52=0),\"x\",IF($G52=\"cold\",\"x\",IF(AND(FW$6>$F52,FV$6<$E52),IF(FV$6>$F52,IF(FW$6>$E52,$U52/($E52-$F52)*($E52-FV$6),$U52/($E52-$F52)*(FW$6-FV$6)),$U52/($E52-$F52)*(FW$6-$F52)),\"x\")))","v":"x"},"x","x","x","x","x","x","x","x","x","x","x","x","x","x","x","x","x","x","x","x","x","x","x","x","x","x","x","x","x","x","x",{"$f":"IF(OR($V52=\"Utility\",$AA52=0),\"x\",IF($G52=\"cold\",\"x\",IF(AND(HC$6>$F52,HB$6<$E52),IF(HB$6>$F52,IF(HC$6>$E52,$U52/($E52-$F52)*($E52-HB$6),$U52/($E52-$F52)*(HC$6-HB$6)),$U52/($E52-$F52)*(HC$6-$F52)),\"x\")))","v":"x"},"x","x","x","x","x","x","x","x","x","x","x","x","x","x","x","x","x","x","x","x","x","x","x","x","x","x","x","x","x","x","x","x","x","x","x","x"]
["",{"$f":"IF(G55=\"hot\",COUNTIF($G$5:G55,\"hot\"),\"\")","v":""},{"$f":"IF(G55=\"cold\",COUNTIF($G$5:G55,\"cold\"),\"\")","v":""},null,null,null,"",null,null,"","","",null,null,null,null,null,null,null,null,"",null,"","","","","",null,null,null,null,null,null,null,null,null,null,null,0,null,{"$f":"IF(OR($V53=\"Utility\",$AA53=0),\"x\",IF($G53=\"hot\",\"x\",IF(AND(AO$6>$E53,AN$6<$F53),IF(AN$6>$E53,IF(AO$6>$F53,$U53/($F53-$E53)*($F53-AN$6),$U53/($F53-$E53)*(AO$6-AN$6)),$U53/($F53-$E53)*(AO$6-$E53)),\"x\")))","v":"x"},"x","x","x","x","x","x","x","x","x","x","x","x","x","x","x","x","x","x","x","x","x","x","x","x","x","x","x","x","x","x","x",{"$f":"IF(OR($V53=\"Utility\",$AA53=0),\"x\",IF($G53=\"hot\",\"x\",IF(AND(BU$6>$E53,BT$6<$F53),IF(BT$6>$E53,IF(BU$6>$F53,$U53/($F53-$E53)*($F53-BT$6),$U53/($F53-$E53)*(BU$6-BT$6)),$U53/($F53-$E53)*(BU$6-$E53)),\"x\")))","v":"x"},"x","x","x","x","x","x","x","x","x","x","x","x","x","x","x","x","x","x","x","x","x","x","x","x","x","x","x","x","x","x","x",{"$f":"IF(OR($V53=\"Utility\",$AA53=0),\"x\",IF($G53=\"hot\",\"x\",IF(AND(DA$6>$E53,CZ$6<$F53),IF(CZ$6>$E53,IF(DA$6>$F53,$U53/($F53-$E53)*($F53-CZ$6),$U53/($F53-$E53)*(DA$6-CZ$6)),$U53/($F53-$E53)*(DA$6-$E53)),\"x\")))","v":"x"},"x","x","x","x","x","x","x","x","x","x","x","x","x","x","x","x","x","x","x","x","x","x","x","x","x","x","x","x","x","x","x","x","x","x","x","x",null,null,null,0,null,{"$f":"IF(OR($V53=\"Utility\",$AA53=0),\"x\",IF($G53=\"cold\",\"x\",IF(AND(EQ$6>$F53,EP$6<$E53),IF(EP$6>$F53,IF(EQ$6>$E53,$U53/($E53-$F53)*($E53-EP$6),$U53/($E53-$F53)*(EQ$6-EP$6)),$U53/($E53-$F53)*(EQ$6-$F53)),\"x\")))","v":"x"},"x","x","x","x","x","x","x","x","x","x","x","x","x","x","x","x","x","x","x","x","x","x","x","x","x","x","x","x","x","x","x",{"$f":"IF(OR($V53=\"Utility\",$AA53=0),\"x\",IF($G53=\"cold\",\"x\",IF(AND(FW$6>$F53,FV$6<$E53),IF(FV$6>$F53,IF(FW$6>$E53,$U53/($E53-$F53)*($E53-FV$6),$U53/($E53-$F53)*(FW$6-FV$6)),$U53/($E53-$F53)*(FW$6-$F53)),\"x\")))","v":"x"},"x","x","x","x","x","x","x","x","x","x","x","x","x","x","x","x","x","x","x","x","x","x","x","x","x","x","x","x","x","x","x",{"$f":"IF(OR($V53=\"Utility\",$AA53=0),\"x\",IF($G53=\"cold\",\"x\",IF(AND(HC$6>$F53,HB$6<$E53),IF(HB$6>$F53,IF(HC$6>$E53,$U53/($E53-$F53)*($E53-HB$6),$U53/($E53-$F53)*(HC$6-HB$6)),$U53/($E53-$F53)*(HC$6-$F53)),\"x\")))","v":"x"},"x","x","x","x","x","x","x","x","x","x","x","x","x","x","x","x","x","x","x","x","x","x","x","x","x","x","x","x","x","x","x","x","x","x","x","x"]
["",{"$f":"IF(G56=\"hot\",COUNTIF($G$5:G56,\"hot\"),\"\")","v":""},{"$f":"IF(G56=\"cold\",COUNTIF($G$5:G56,\"cold\"),\"\")","v":""},null,null,null,"",null,null,"","","",null,null,null,null,null,null,null,null,"",null,"","","","","",null,null,null,null,null,null,null,null,null,null,null,0,null,{"$f":"IF(OR($V54=\"Utility\",$AA54=0),\"x\",IF($G54=\"hot\",\"x\",IF(AND(AO$6>$E54,AN$6<$F54),IF(AN$6>$E54,IF(AO$6>$F54,$U54/($F54-$E54)*($F54-AN$6),$U54/($F54-$E54)*(AO$6-AN$6)),$U54/($F54-$E54)*(AO$6-$E54)),\"x\")))","v":"x"},"x","x","x","x","x","x","x","x","x","x","x","x","x","x","x","x","x","x","x","x","x","x","x","x","x","x","x","x","x","x","x",{"$f":"IF(OR($V54=\"Utility\",$AA54=0),\"x\",IF($G54=\"hot\",\"x\",IF(AND(BU$6>$E54,BT$6<$F54),IF(BT$6>$E54,IF(BU$6>$F54,$U54/($F54-$E54)*($F54-BT$6),$U54/($F54-$E54)*(BU$6-BT$6)),$U54/($F54-$E54)*(BU$6-$E54)),\"x\")))","v":"x"},"x","x","x","x","x","x","x","x","x","x","x","x","x","x","x","x","x","x","x","x","x","x","x","x","x","x","x","x","x","x","x",{"$f":"IF(OR($V54=\"Utility\",$AA54=0),\"x\",IF($G54=\"hot\",\"x\",IF(AND(DA$6>$E54,CZ$6<$F54),IF(CZ$6>$E54,IF(DA$6>$F54,$U54/($F54-$E54)*($F54-CZ$6),$U54/($F54-$E54)*(DA$6-CZ$6)),$U54/($F54-$E54)*(DA$6-$E54)),\"x\")))","v":"x"},"x","x","x","x","x","x","x","x","x","x","x","x","x","x","x","x","x","x","x","x","x","x","x","x","x","x","x","x","x","x","x","x","x","x","x","x",null,null,null,0,null,{"$f":"IF(OR($V54=\"Utility\",$AA54=0),\"x\",IF($G54=\"cold\",\"x\",IF(AND(EQ$6>$F54,EP$6<$E54),IF(EP$6>$F54,IF(EQ$6>$E54,$U54/($E54-$F54)*($E54-EP$6),$U54/($E54-$F54)*(EQ$6-EP$6)),$U54/($E54-$F54)*(EQ$6-$F54)),\"x\")))","v":"x"},"x","x","x","x","x","x","x","x","x","x","x","x","x","x","x","x","x","x","x","x","x","x","x","x","x","x","x","x","x","x","x",{"$f":"IF(OR($V54=\"Utility\",$AA54=0),\"x\",IF($G54=\"cold\",\"x\",IF(AND(FW$6>$F54,FV$6<$E54),IF(FV$6>$F54,IF(FW$6>$E54,$U54/($E54-$F54)*($E54-FV$6),$U54/($E54-$F54)*(FW$6-FV$6)),$U54/($E54-$F54)*(FW$6-$F54)),\"x\")))","v":"x"},"x","x","x","x","x","x","x","x","x","x","x","x","x","x","x","x","x","x","x","x","x","x","x","x","x","x","x","x","x","x","x",{"$f":"IF(OR($V54=\"Utility\",$AA54=0),\"x\",IF($G54=\"cold\",\"x\",IF(AND(HC$6>$F54,HB$6<$E54),IF(HB$6>$F54,IF(HC$6>$E54,$U54/($E54-$F54)*($E54-HB$6),$U54/($E54-$F54)*(HC$6-HB$6)),$U54/($E54-$F54)*(HC$6-$F54)),\"x\")))","v":"x"},"x","x","x","x","x","x","x","x","x","x","x","x","x","x","x","x","x","x","x","x","x","x","x","x","x","x","x","x","x","x","x","x","x","x","x","x"]
["",{"$f":"IF(G57=\"hot\",COUNTIF($G$5:G57,\"hot\"),\"\")","v":""},{"$f":"IF(G57=\"cold\",COUNTIF($G$5:G57,\"cold\"),\"\")","v":""},null,null,null,"",null,null,"","","",null,null,null,null,null,null,null,null,"",null,"","","","","",null,null,null,null,null,null,null,null,null,null,null,0,null,{"$f":"IF(OR($V55=\"Utility\",$AA55=0),\"x\",IF($G55=\"hot\",\"x\",IF(AND(AO$6>$E55,AN$6<$F55),IF(AN$6>$E55,IF(AO$6>$F55,$U55/($F55-$E55)*($F55-AN$6),$U55/($F55-$E55)*(AO$6-AN$6)),$U55/($F55-$E55)*(AO$6-$E55)),\"x\")))","v":"x"},"x","x","x","x","x","x","x","x","x","x","x","x","x","x","x","x","x","x","x","x","x","x","x","x","x","x","x","x","x","x","x",{"$f":"IF(OR($V55=\"Utility\",$AA55=0),\"x\",IF($G55=\"hot\",\"x\",IF(AND(BU$6>$E55,BT$6<$F55),IF(BT$6>$E55,IF(BU$6>$F55,$U55/($F55-$E55)*($F55-BT$6),$U55/($F55-$E55)*(BU$6-BT$6)),$U55/($F55-$E55)*(BU$6-$E55)),\"x\")))","v":"x"},"x","x","x","x","x","x","x","x","x","x","x","x","x","x","x","x","x","x","x","x","x","x","x","x","x","x","x","x","x","x","x",{"$f":"IF(OR($V55=\"Utility\",$AA55=0),\"x\",IF($G55=\"hot\",\"x\",IF(AND(DA$6>$E55,CZ$6<$F55),IF(CZ$6>$E55,IF(DA$6>$F55,$U55/($F55-$E55)*($F55-CZ$6),$U55/($F55-$E55)*(DA$6-CZ$6)),$U55/($F55-$E55)*(DA$6-$E55)),\"x\")))","v":"x"},"x","x","x","x","x","x","x","x","x","x","x","x","x","x","x","x","x","x","x","x","x","x","x","x","x","x","x","x","x","x","x","x","x","x","x","x",null,null,null,0,null,{"$f":"IF(OR($V55=\"Utility\",$AA55=0),\"x\",IF($G55=\"cold\",\"x\",IF(AND(EQ$6>$F55,EP$6<$E55),IF(EP$6>$F55,IF(EQ$6>$E55,$U55/($E55-$F55)*($E55-EP$6),$U55/($E55-$F55)*(EQ$6-EP$6)),$U55/($E55-$F55)*(EQ$6-$F55)),\"x\")))","v":"x"},"x","x","x","x","x","x","x","x","x","x","x","x","x","x","x","x","x","x","x","x","x","x","x","x","x","x","x","x","x","x","x",{"$f":"IF(OR($V55=\"Utility\",$AA55=0),\"x\",IF($G55=\"cold\",\"x\",IF(AND(FW$6>$F55,FV$6<$E55),IF(FV$6>$F55,IF(FW$6>$E55,$U55/($E55-$F55)*($E55-FV$6),$U55/($E55-$F55)*(FW$6-FV$6)),$U55/($E55-$F55)*(FW$6-$F55)),\"x\")))","v":"x"},"x","x","x","x","x","x","x","x","x","x","x","x","x","x","x","x","x","x","x","x","x","x","x","x","x","x","x","x","x","x","x",{"$f":"IF(OR($V55=\"Utility\",$AA55=0),\"x\",IF($G55=\"cold\",\"x\",IF(AND(HC$6>$F55,HB$6<$E55),IF(HB$6>$F55,IF(HC$6>$E55,$U55/($E55-$F55)*($E55-HB$6),$U55/($E55-$F55)*(HC$6-HB$6)),$U55/($E55-$F55)*(HC$6-$F55)),\"x\")))","v":"x"},"x","x","x","x","x","x","x","x","x","x","x","x","x","x","x","x","x","x","x","x","x","x","x","x","x","x","x","x","x","x","x","x","x","x","x","x"]
["",{"$f":"IF(G58=\"hot\",COUNTIF($G$5:G58,\"hot\"),\"\")","v":""},{"$f":"IF(G58=\"cold\",COUNTIF($G$5:G58,\"cold\"),\"\")","v":""},null,null,null,"",null,null,"","","",null,null,null,null,null,null,null,null,"",null,"","","","","",null,null,null,null,null,null,null,null,null,null,null,0,null,{"$f":"IF(OR($V56=\"Utility\",$AA56=0),\"x\",IF($G56=\"hot\",\"x\",IF(AND(AO$6>$E56,AN$6<$F56),IF(AN$6>$E56,IF(AO$6>$F56,$U56/($F56-$E56)*($F56-AN$6),$U56/($F56-$E56)*(AO$6-AN$6)),$U56/($F56-$E56)*(AO$6-$E56)),\"x\")))","v":"x"},"x","x","x","x","x","x","x","x","x","x","x","x","x","x","x","x","x","x","x","x","x","x","x","x","x","x","x","x","x","x","x",{"$f":"IF(OR($V56=\"Utility\",$AA56=0),\"x\",IF($G56=\"hot\",\"x\",IF(AND(BU$6>$E56,BT$6<$F56),IF(BT$6>$E56,IF(BU$6>$F56,$U56/($F56-$E56)*($F56-BT$6),$U56/($F56-$E56)*(BU$6-BT$6)),$U56/($F56-$E56)*(BU$6-$E56)),\"x\")))","v":"x"},"x","x","x","x","x","x","x","x","x","x","x","x","x","x","x","x","x","x","x","x","x","x","x","x","x","x","x","x","x","x","x",{"$f":"IF(OR($V56=\"Utility\",$AA56=0),\"x\",IF($G56=\"hot\",\"x\",IF(AND(DA$6>$E56,CZ$6<$F56),IF(CZ$6>$E56,IF(DA$6>$F56,$U56/($F56-$E56)*($F56-CZ$6),$U56/($F56-$E56)*(DA$6-CZ$6)),$U56/($F56-$E56)*(DA$6-$E56)),\"x\")))","v":"x"},"x","x","x","x","x","x","x","x","x","x","x","x","x","x","x","x","x","x","x","x","x","x","x","x","x","x","x","x","x","x","x","x","x","x","x","x",null,null,null,0,null,{"$f":"IF(OR($V56=\"Utility\",$AA56=0),\"x\",IF($G56=\"cold\",\"x\",IF(AND(EQ$6>$F56,EP$6<$E56),IF(EP$6>$F56,IF(EQ$6>$E56,$U56/($E56-$F56)*($E56-EP$6),$U56/($E56-$F56)*(EQ$6-EP$6)),$U56/($E56-$F56)*(EQ$6-$F56)),\"x\")))","v":"x"},"x","x","x","x","x","x","x","x","x","x","x","x","x","x","x","x","x","x","x","x","x","x","x","x","x","x","x","x","x","x","x",{"$f":"IF(OR($V56=\"Utility\",$AA56=0),\"x\",IF($G56=\"cold\",\"x\",IF(AND(FW$6>$F56,FV$6<$E56),IF(FV$6>$F56,IF(FW$6>$E56,$U56/($E56-$F56)*($E56-FV$6),$U56/($E56-$F56)*(FW$6-FV$6)),$U56/($E56-$F56)*(FW$6-$F56)),\"x\")))","v":"x"},"x","x","x","x","x","x","x","x","x","x","x","x","x","x","x","x","x","x","x","x","x","x","x","x","x","x","x","x","x","x","x",{"$f":"IF(OR($V56=\"Utility\",$AA56=0),\"x\",IF($G56=\"cold\",\"x\",IF(AND(HC$6>$F56,HB$6<$E56),IF(HB$6>$F56,IF(HC$6>$E56,$U56/($E56-$F56)*($E56-HB$6),$U56/($E56-$F56)*(HC$6-HB$6)),$U56/($E56-$F56)*(HC$6-$F56)),\"x\")))","v":"x"},"x","x","x","x","x","x","x","x","x","x","x","x","x","x","x","x","x","x","x","x","x","x","x","x","x","x","x","x","x","x","x","x","x","x","x","x"]
["",{"$f":"IF(G59=\"hot\",COUNTIF($G$5:G59,\"hot\"),\"\")","v":""},{"$f":"IF(G59=\"cold\",COUNTIF($G$5:G59,\"cold\"),\"\")","v":""},null,null,null,"",null,null,"","","",null,null,null,null,null,null,null,null,"",null,"","","","","",null,null,null,null,null,null,null,null,null,null,null,0,null,{"$f":"IF(OR($V57=\"Utility\",$AA57=0),\"x\",IF($G57=\"hot\",\"x\",IF(AND(AO$6>$E57,AN$6<$F57),IF(AN$6>$E57,IF(AO$6>$F57,$U57/($F57-$E57)*($F57-AN$6),$U57/($F57-$E57)*(AO$6-AN$6)),$U57/($F57-$E57)*(AO$6-$E57)),\"x\")))","v":"x"},"x","x","x","x","x","x","x","x","x","x","x","x","x","x","x","x","x","x","x","x","x","x","x","x","x","x","x","x","x","x","x",{"$f":"IF(OR($V57=\"Utility\",$AA57=0),\"x\",IF($G57=\"hot\",\"x\",IF(AND(BU$6>$E57,BT$6<$F57),IF(BT$6>$E57,IF(BU$6>$F57,$U57/($F57-$E57)*($F57-BT$6),$U57/($F57-$E57)*(BU$6-BT$6)),$U57/($F57-$E57)*(BU$6-$E57)),\"x\")))","v":"x"},"x","x","x","x","x","x","x","x","x","x","x","x","x","x","x","x","x","x","x","x","x","x","x","x","x","x","x","x","x","x","x",{"$f":"IF(OR($V57=\"Utility\",$AA57=0),\"x\",IF($G57=\"hot\",\"x\",IF(AND(DA$6>$E57,CZ$6<$F57),IF(CZ$6>$E57,IF(DA$6>$F57,$U57/($F57-$E57)*($F57-CZ$6),$U57/($F57-$E57)*(DA$6-CZ$6)),$U57/($F57-$E57)*(DA$6-$E57)),\"x\")))","v":"x"},"x","x","x","x","x","x","x","x","x","x","x","x","x","x","x","x","x","x","x","x","x","x","x","x","x","x","x","x","x","x","x","x","x","x","x","x",null,null,null,0,null,{"$f":"IF(OR($V57=\"Utility\",$AA57=0),\"x\",IF($G57=\"cold\",\"x\",IF(AND(EQ$6>$F57,EP$6<$E57),IF(EP$6>$F57,IF(EQ$6>$E57,$U57/($E57-$F57)*($E57-EP$6),$U57/($E57-$F57)*(EQ$6-EP$6)),$U57/($E57-$F57)*(EQ$6-$F57)),\"x\")))","v":"x"},"x","x","x","x","x","x","x","x","x","x","x","x","x","x","x","x","x","x","x","x","x","x","x","x","x","x","x","x","x","x","x",{"$f":"IF(OR($V57=\"Utility\",$AA57=0),\"x\",IF($G57=\"cold\",\"x\",IF(AND(FW$6>$F57,FV$6<$E57),IF(FV$6>$F57,IF(FW$6>$E57,$U57/($E57-$F57)*($E57-FV$6),$U57/($E57-$F57)*(FW$6-FV$6)),$U57/($E57-$F57)*(FW$6-$F57)),\"x\")))","v":"x"},"x","x","x","x","x","x","x","x","x","x","x","x","x","x","x","x","x","x","x","x","x","x","x","x","x","x","x","x","x","x","x",{"$f":"IF(OR($V57=\"Utility\",$AA57=0),\"x\",IF($G57=\"cold\",\"x\",IF(AND(HC$6>$F57,HB$6<$E57),IF(HB$6>$F57,IF(HC$6>$E57,$U57/($E57-$F57)*($E57-HB$6),$U57/($E57-$F57)*(HC$6-HB$6)),$U57/($E57-$F57)*(HC$6-$F57)),\"x\")))","v":"x"},"x","x","x","x","x","x","x","x","x","x","x","x","x","x","x","x","x","x","x","x","x","x","x","x","x","x","x","x","x","x","x","x","x","x","x","x"]
["",{"$f":"IF(G60=\"hot\",COUNTIF($G$5:G60,\"hot\"),\"\")","v":""},{"$f":"IF(G60=\"cold\",COUNTIF($G$5:G60,\"cold\"),\"\")","v":""},null,null,null,"",null,null,"","","",null,null,null,null,null,null,null,null,"",null,"","","","","",null,null,null,null,null,null,null,null,null,null,null,0,null,{"$f":"IF(OR($V58=\"Utility\",$AA58=0),\"x\",IF($G58=\"hot\",\"x\",IF(AND(AO$6>$E58,AN$6<$F58),IF(AN$6>$E58,IF(AO$6>$F58,$U58/($F58-$E58)*($F58-AN$6),$U58/($F58-$E58)*(AO$6-AN$6)),$U58/($F58-$E58)*(AO$6-$E58)),\"x\")))","v":"x"},"x","x","x","x","x","x","x","x","x","x","x","x","x","x","x","x","x","x","x","x","x","x","x","x","x","x","x","x","x","x","x",{"$f":"IF(OR($V58=\"Utility\",$AA58=0),\"x\",IF($G58=\"hot\",\"x\",IF(AND(BU$6>$E58,BT$6<$F58),IF(BT$6>$E58,IF(BU$6>$F58,$U58/($F58-$E58)*($F58-BT$6),$U58/($F58-$E58)*(BU$6-BT$6)),$U58/($F58-$E58)*(BU$6-$E58)),\"x\")))","v":"x"},"x","x","x","x","x","x","x","x","x","x","x","x","x","x","x","x","x","x","x","x","x","x","x","x","x","x","x","x","x","x","x",{"$f":"IF(OR($V58=\"Utility\",$AA58=0),\"x\",IF($G58=\"hot\",\"x\",IF(AND(DA$6>$E58,CZ$6<$F58),IF(CZ$6>$E58,IF(DA$6>$F58,$U58/($F58-$E58)*($F58-CZ$6),$U58/($F58-$E58)*(DA$6-CZ$6)),$U58/($F58-$E58)*(DA$6-$E58)),\"x\")))","v":"x"},"x","x","x","x","x","x","x","x","x","x","x","x","x","x","x","x","x","x","x","x","x","x","x","x","x","x","x","x","x","x","x","x","x","x","x","x",null,null,null,0,null,{"$f":"IF(OR($V58=\"Utility\",$AA58=0),\"x\",IF($G58=\"cold\",\"x\",IF(AND(EQ$6>$F58,EP$6<$E58),IF(EP$6>$F58,IF(EQ$6>$E58,$U58/($E58-$F58)*($E58-EP$6),$U58/($E58-$F58)*(EQ$6-EP$6)),$U58/($E58-$F58)*(EQ$6-$F58)),\"x\")))","v":"x"},"x","x","x","x","x","x","x","x","x","x","x","x","x","x","x","x","x","x","x","x","x","x","x","x","x","x","x","x","x","x","x",{"$f":"IF(OR($V58=\"Utility\",$AA58=0),\"x\",IF($G58=\"cold\",\"x\",IF(AND(FW$6>$F58,FV$6<$E58),IF(FV$6>$F58,IF(FW$6>$E58,$U58/($E58-$F58)*($E58-FV$6),$U58/($E58-$F58)*(FW$6-FV$6)),$U58/($E58-$F58)*(FW$6-$F58)),\"x\")))","v":"x"},"x","x","x","x","x","x","x","x","x","x","x","x","x","x","x","x","x","x","x","x","x","x","x","x","x","x","x","x","x","x","x",{"$f":"IF(OR($V58=\"Utility\",$AA58=0),\"x\",IF($G58=\"cold\",\"x\",IF(AND(HC$6>$F58,HB$6<$E58),IF(HB$6>$F58,IF(HC$6>$E58,$U58/($E58-$F58)*($E58-HB$6),$U58/($E58-$F58)*(HC$6-HB$6)),$U58/($E58-$F58)*(HC$6-$F58)),\"x\")))","v":"x"},"x","x","x","x","x","x","x","x","x","x","x","x","x","x","x","x","x","x","x","x","x","x","x","x","x","x","x","x","x","x","x","x","x","x","x","x"]
["",{"$f":"IF(G61=\"hot\",COUNTIF($G$5:G61,\"hot\"),\"\")","v":""},{"$f":"IF(G61=\"cold\",COUNTIF($G$5:G61,\"cold\"),\"\")","v":""},null,null,null,"",null,null,"","","",null,null,null,null,null,null,null,null,"",null,"","","","","",null,null,null,null,null,null,null,null,null,null,null,0,null,{"$f":"IF(OR($V59=\"Utility\",$AA59=0),\"x\",IF($G59=\"hot\",\"x\",IF(AND(AO$6>$E59,AN$6<$F59),IF(AN$6>$E59,IF(AO$6>$F59,$U59/($F59-$E59)*($F59-AN$6),$U59/($F59-$E59)*(AO$6-AN$6)),$U59/($F59-$E59)*(AO$6-$E59)),\"x\")))","v":"x"},"x","x","x","x","x","x","x","x","x","x","x","x","x","x","x","x","x","x","x","x","x","x","x","x","x","x","x","x","x","x","x",{"$f":"IF(OR($V59=\"Utility\",$AA59=0),\"x\",IF($G59=\"hot\",\"x\",IF(AND(BU$6>$E59,BT$6<$F59),IF(BT$6>$E59,IF(BU$6>$F59,$U59/($F59-$E59)*($F59-BT$6),$U59/($F59-$E59)*(BU$6-BT$6)),$U59/($F59-$E59)*(BU$6-$E59)),\"x\")))","v":"x"},"x","x","x","x","x","x","x","x","x","x","x","x","x","x","x","x","x","x","x","x","x","x","x","x","x","x","x","x","x","x","x",{"$f":"IF(OR($V59=\"Utility\",$AA59=0),\"x\",IF($G59=\"hot\",\"x\",IF(AND(DA$6>$E59,CZ$6<$F59),IF(CZ$6>$E59,IF(DA$6>$F59,$U59/($F59-$E59)*($F59-CZ$6),$U59/($F59-$E59)*(DA$6-CZ$6)),$U59/($F59-$E59)*(DA$6-$E59)),\"x\")))","v":"x"},"x","x","x","x","x","x","x","x","x","x","x","x","x","x","x","x","x","x","x","x","x","x","x","x","x","x","x","x","x","x","x","x","x","x","x","x",null,null,null,0,null,{"$f":"IF(OR($V59=\"Utility\",$AA59=0),\"x\",IF($G59=\"cold\",\"x\",IF(AND(EQ$6>$F59,EP$6<$E59),IF(EP$6>$F59,IF(EQ$6>$E59,$U59/($E59-$F59)*($E59-EP$6),$U59/($E59-$F59)*(EQ$6-EP$6)),$U59/($E59-$F59)*(EQ$6-$F59)),\"x\")))","v":"x"},"x","x","x","x","x","x","x","x","x","x","x","x","x","x","x","x","x","x","x","x","x","x","x","x","x","x","x","x","x","x","x",{"$f":"IF(OR($V59=\"Utility\",$AA59=0),\"x\",IF($G59=\"cold\",\"x\",IF(AND(FW$6>$F59,FV$6<$E59),IF(FV$6>$F59,IF(FW$6>$E59,$U59/($E59-$F59)*($E59-FV$6),$U59/($E59-$F59)*(FW$6-FV$6)),$U59/($E59-$F59)*(FW$6-$F59)),\"x\")))","v":"x"},"x","x","x","x","x","x","x","x","x","x","x","x","x","x","x","x","x","x","x","x","x","x","x","x","x","x","x","x","x","x","x",{"$f":"IF(OR($V59=\"Utility\",$AA59=0),\"x\",IF($G59=\"cold\",\"x\",IF(AND(HC$6>$F59,HB$6<$E59),IF(HB$6>$F59,IF(HC$6>$E59,$U59/($E59-$F59)*($E59-HB$6),$U59/($E59-$F59)*(HC$6-HB$6)),$U59/($E59-$F59)*(HC$6-$F59)),\"x\")))","v":"x"},"x","x","x","x","x","x","x","x","x","x","x","x","x","x","x","x","x","x","x","x","x","x","x","x","x","x","x","x","x","x","x","x","x","x","x","x"]
["",{"$f":"IF(G62=\"hot\",COUNTIF($G$5:G62,\"hot\"),\"\")","v":""},{"$f":"IF(G62=\"cold\",COUNTIF($G$5:G62,\"cold\"),\"\")","v":""},null,null,null,"",null,null,"","","",null,null,null,null,null,null,null,null,"",null,"","","","","",null,null,null,null,null,null,null,null,null,null,null,0,null,{"$f":"IF(OR($V60=\"Utility\",$AA60=0),\"x\",IF($G60=\"hot\",\"x\",IF(AND(AO$6>$E60,AN$6<$F60),IF(AN$6>$E60,IF(AO$6>$F60,$U60/($F60-$E60)*($F60-AN$6),$U60/($F60-$E60)*(AO$6-AN$6)),$U60/($F60-$E60)*(AO$6-$E60)),\"x\")))","v":"x"},"x","x","x","x","x","x","x","x","x","x","x","x","x","x","x","x","x","x","x","x","x","x","x","x","x","x","x","x","x","x","x",{"$f":"IF(OR($V60=\"Utility\",$AA60=0),\"x\",IF($G60=\"hot\",\"x\",IF(AND(BU$6>$E60,BT$6<$F60),IF(BT$6>$E60,IF(BU$6>$F60,$U60/($F60-$E60)*($F60-BT$6),$U60/($F60-$E60)*(BU$6-BT$6)),$U60/($F60-$E60)*(BU$6-$E60)),\"x\")))","v":"x"},"x","x","x","x","x","x","x","x","x","x","x","x","x","x","x","x","x","x","x","x","x","x","x","x","x","x","x","x","x","x","x",{"$f":"IF(OR($V60=\"Utility\",$AA60=0),\"x\",IF($G60=\"hot\",\"x\",IF(AND(DA$6>$E60,CZ$6<$F60),IF(CZ$6>$E60,IF(DA$6>$F60,$U60/($F60-$E60)*($F60-CZ$6),$U60/($F60-$E60)*(DA$6-CZ$6)),$U60/($F60-$E60)*(DA$6-$E60)),\"x\")))","v":"x"},"x","x","x","x","x","x","x","x","x","x","x","x","x","x","x","x","x","x","x","x","x","x","x","x","x","x","x","x","x","x","x","x","x","x","x","x",null,null,null,0,null,{"$f":"IF(OR($V60=\"Utility\",$AA60=0),\"x\",IF($G60=\"cold\",\"x\",IF(AND(EQ$6>$F60,EP$6<$E60),IF(EP$6>$F60,IF(EQ$6>$E60,$U60/($E60-$F60)*($E60-EP$6),$U60/($E60-$F60)*(EQ$6-EP$6)),$U60/($E60-$F60)*(EQ$6-$F60)),\"x\")))","v":"x"},"x","x","x","x","x","x","x","x","x","x","x","x","x","x","x","x","x","x","x","x","x","x","x","x","x","x","x","x","x","x","x",{"$f":"IF(OR($V60=\"Utility\",$AA60=0),\"x\",IF($G60=\"cold\",\"x\",IF(AND(FW$6>$F60,FV$6<$E60),IF(FV$6>$F60,IF(FW$6>$E60,$U60/($E60-$F60)*($E60-FV$6),$U60/($E60-$F60)*(FW$6-FV$6)),$U60/($E60-$F60)*(FW$6-$F60)),\"x\")))","v":"x"},"x","x","x","x","x","x","x","x","x","x","x","x","x","x","x","x","x","x","x","x","x","x","x","x","x","x","x","x","x","x","x",{"$f":"IF(OR($V60=\"Utility\",$AA60=0),\"x\",IF($G60=\"cold\",\"x\",IF(AND(HC$6>$F60,HB$6<$E60),IF(HB$6>$F60,IF(HC$6>$E60,$U60/($E60-$F60)*($E60-HB$6),$U60/($E60-$F60)*(HC$6-HB$6)),$U60/($E60-$F60)*(HC$6-$F60)),\"x\")))","v":"x"},"x","x","x","x","x","x","x","x","x","x","x","x","x","x","x","x","x","x","x","x","x","x","x","x","x","x","x","x","x","x","x","x","x","x","x","x"]
["",{"$f":"IF(G63=\"hot\",COUNTIF($G$5:G63,\"hot\"),\"\")","v":""},{"$f":"IF(G63=\"cold\",COUNTIF($G$5:G63,\"cold\"),\"\")","v":""},null,null,null,"",null,null,"","","",null,null,null,null,null,null,null,null,"",null,"","","","","",null,null,null,null,null,null,null,null,null,null,null,0,null,{"$f":"IF(OR($V61=\"Utility\",$AA61=0),\"x\",IF($G61=\"hot\",\"x\",IF(AND(AO$6>$E61,AN$6<$F61),IF(AN$6>$E61,IF(AO$6>$F61,$U61/($F61-$E61)*($F61-AN$6),$U61/($F61-$E61)*(AO$6-AN$6)),$U61/($F61-$E61)*(AO$6-$E61)),\"x\")))","v":"x"},"x","x","x","x","x","x","x","x","x","x","x","x","x","x","x","x","x","x","x","x","x","x","x","x","x","x","x","x","x","x","x",{"$f":"IF(OR($V61=\"Utility\",$AA61=0),\"x\",IF($G61=\"hot\",\"x\",IF(AND(BU$6>$E61,BT$6<$F61),IF(BT$6>$E61,IF(BU$6>$F61,$U61/($F61-$E61)*($F61-BT$6),$U61/($F61-$E61)*(BU$6-BT$6)),$U61/($F61-$E61)*(BU$6-$E61)),\"x\")))","v":"x"},"x","x","x","x","x","x","x","x","x","x","x","x","x","x","x","x","x","x","x","x","x","x","x","x","x","x","x","x","x","x","x",{"$f":"IF(OR($V61=\"Utility\",$AA61=0),\"x\",IF($G61=\"hot\",\"x\",IF(AND(DA$6>$E61,CZ$6<$F61),IF(CZ$6>$E61,IF(DA$6>$F61,$U61/($F61-$E61)*($F61-CZ$6),$U61/($F61-$E61)*(DA$6-CZ$6)),$U61/($F61-$E61)*(DA$6-$E61)),\"x\")))","v":"x"},"x","x","x","x","x","x","x","x","x","x","x","x","x","x","x","x","x","x","x","x","x","x","x","x","x","x","x","x","x","x","x","x","x","x","x","x",null,null,null,0,null,{"$f":"IF(OR($V61=\"Utility\",$AA61=0),\"x\",IF($G61=\"cold\",\"x\",IF(AND(EQ$6>$F61,EP$6<$E61),IF(EP$6>$F61,IF(EQ$6>$E61,$U61/($E61-$F61)*($E61-EP$6),$U61/($E61-$F61)*(EQ$6-EP$6)),$U61/($E61-$F61)*(EQ$6-$F61)),\"x\")))","v":"x"},"x","x","x","x","x","x","x","x","x","x","x","x","x","x","x","x","x","x","x","x","x","x","x","x","x","x","x","x","x","x","x",{"$f":"IF(OR($V61=\"Utility\",$AA61=0),\"x\",IF($G61=\"cold\",\"x\",IF(AND(FW$6>$F61,FV$6<$E61),IF(FV$6>$F61,IF(FW$6>$E61,$U61/($E61-$F61)*($E61-FV$6),$U61/($E61-$F61)*(FW$6-FV$6)),$U61/($E61-$F61)*(FW$6-$F61)),\"x\")))","v":"x"},"x","x","x","x","x","x","x","x","x","x","x","x","x","x","x","x","x","x","x","x","x","x","x","x","x","x","x","x","x","x","x",{"$f":"IF(OR($V61=\"Utility\",$AA61=0),\"x\",IF($G61=\"cold\",\"x\",IF(AND(HC$6>$F61,HB$6<$E61),IF(HB$6>$F61,IF(HC$6>$E61,$U61/($E61-$F61)*($E61-HB$6),$U61/($E61-$F61)*(HC$6-HB$6)),$U61/($E61-$F61)*(HC$6-$F61)),\"x\")))","v":"x"},"x","x","x","x","x","x","x","x","x","x","x","x","x","x","x","x","x","x","x","x","x","x","x","x","x","x","x","x","x","x","x","x","x","x","x","x"]
["",{"$f":"IF(G64=\"hot\",COUNTIF($G$5:G64,\"hot\"),\"\")","v":""},{"$f":"IF(G64=\"cold\",COUNTIF($G$5:G64,\"cold\"),\"\")","v":""},null,null,null,"",null,null,"","","",null,null,null,null,null,null,null,null,"",null,"","","","","",null,null,null,null,null,null,null,null,null,null,null,0,null,{"$f":"IF(OR($V62=\"Utility\",$AA62=0),\"x\",IF($G62=\"hot\",\"x\",IF(AND(AO$6>$E62,AN$6<$F62),IF(AN$6>$E62,IF(AO$6>$F62,$U62/($F62-$E62)*($F62-AN$6),$U62/($F62-$E62)*(AO$6-AN$6)),$U62/($F62-$E62)*(AO$6-$E62)),\"x\")))","v":"x"},"x","x","x","x","x","x","x","x","x","x","x","x","x","x","x","x","x","x","x","x","x","x","x","x","x","x","x","x","x","x","x",{"$f":"IF(OR($V62=\"Utility\",$AA62=0),\"x\",IF($G62=\"hot\",\"x\",IF(AND(BU$6>$E62,BT$6<$F62),IF(BT$6>$E62,IF(BU$6>$F62,$U62/($F62-$E62)*($F62-BT$6),$U62/($F62-$E62)*(BU$6-BT$6)),$U62/($F62-$E62)*(BU$6-$E62)),\"x\")))","v":"x"},"x","x","x","x","x","x","x","x","x","x","x","x","x","x","x","x","x","x","x","x","x","x","x","x","x","x","x","x","x","x","x",{"$f":"IF(OR($V62=\"Utility\",$AA62=0),\"x\",IF($G62=\"hot\",\"x\",IF(AND(DA$6>$E62,CZ$6<$F62),IF(CZ$6>$E62,IF(DA$6>$F62,$U62/($F62-$E62)*($F62-CZ$6),$U62/($F62-$E62)*(DA$6-CZ$6)),$U62/($F62-$E62)*(DA$6-$E62)),\"x\")))","v":"x"},"x","x","x","x","x","x","x","x","x","x","x","x","x","x","x","x","x","x","x","x","x","x","x","x","x","x","x","x","x","x","x","x","x","x","x","x",null,null,null,0,null,{"$f":"IF(OR($V62=\"Utility\",$AA62=0),\"x\",IF($G62=\"cold\",\"x\",IF(AND(EQ$6>$F62,EP$6<$E62),IF(EP$6>$F62,IF(EQ$6>$E62,$U62/($E62-$F62)*($E62-EP$6),$U62/($E62-$F62)*(EQ$6-EP$6)),$U62/($E62-$F62)*(EQ$6-$F62)),\"x\")))","v":"x"},"x","x","x","x","x","x","x","x","x","x","x","x","x","x","x","x","x","x","x","x","x","x","x","x","x","x","x","x","x","x","x",{"$f":"IF(OR($V62=\"Utility\",$AA62=0),\"x\",IF($G62=\"cold\",\"x\",IF(AND(FW$6>$F62,FV$6<$E62),IF(FV$6>$F62,IF(FW$6>$E62,$U62/($E62-$F62)*($E62-FV$6),$U62/($E62-$F62)*(FW$6-FV$6)),$U62/($E62-$F62)*(FW$6-$F62)),\"x\")))","v":"x"},"x","x","x","x","x","x","x","x","x","x","x","x","x","x","x","x","x","x","x","x","x","x","x","x","x","x","x","x","x","x","x",{"$f":"IF(OR($V62=\"Utility\",$AA62=0),\"x\",IF($G62=\"cold\",\"x\",IF(AND(HC$6>$F62,HB$6<$E62),IF(HB$6>$F62,IF(HC$6>$E62,$U62/($E62-$F62)*($E62-HB$6),$U62/($E62-$F62)*(HC$6-HB$6)),$U62/($E62-$F62)*(HC$6-$F62)),\"x\")))","v":"x"},"x","x","x","x","x","x","x","x","x","x","x","x","x","x","x","x","x","x","x","x","x","x","x","x","x","x","x","x","x","x","x","x","x","x","x","x"]
["",{"$f":"IF(G65=\"hot\",COUNTIF($G$5:G65,\"hot\"),\"\")","v":""},{"$f":"IF(G65=\"cold\",COUNTIF($G$5:G65,\"cold\"),\"\")","v":""},null,null,null,"",null,null,"","","",null,null,null,null,null,null,null,null,"",null,"","","","","",null,null,null,null,null,null,null,null,null,null,null,0,null,{"$f":"IF(OR($V63=\"Utility\",$AA63=0),\"x\",IF($G63=\"hot\",\"x\",IF(AND(AO$6>$E63,AN$6<$F63),IF(AN$6>$E63,IF(AO$6>$F63,$U63/($F63-$E63)*($F63-AN$6),$U63/($F63-$E63)*(AO$6-AN$6)),$U63/($F63-$E63)*(AO$6-$E63)),\"x\")))","v":"x"},"x","x","x","x","x","x","x","x","x","x","x","x","x","x","x","x","x","x","x","x","x","x","x","x","x","x","x","x","x","x","x",{"$f":"IF(OR($V63=\"Utility\",$AA63=0),\"x\",IF($G63=\"hot\",\"x\",IF(AND(BU$6>$E63,BT$6<$F63),IF(BT$6>$E63,IF(BU$6>$F63,$U63/($F63-$E63)*($F63-BT$6),$U63/($F63-$E63)*(BU$6-BT$6)),$U63/($F63-$E63)*(BU$6-$E63)),\"x\")))","v":"x"},"x","x","x","x","x","x","x","x","x","x","x","x","x","x","x","x","x","x","x","x","x","x","x","x","x","x","x","x","x","x","x",{"$f":"IF(OR($V63=\"Utility\",$AA63=0),\"x\",IF($G63=\"hot\",\"x\",IF(AND(DA$6>$E63,CZ$6<$F63),IF(CZ$6>$E63,IF(DA$6>$F63,$U63/($F63-$E63)*($F63-CZ$6),$U63/($F63-$E63)*(DA$6-CZ$6)),$U63/($F63-$E63)*(DA$6-$E63)),\"x\")))","v":"x"},"x","x","x","x","x","x","x","x","x","x","x","x","x","x","x","x","x","x","x","x","x","x","x","x","x","x","x","x","x","x","x","x","x","x","x","x",null,null,null,0,null,{"$f":"IF(OR($V63=\"Utility\",$AA63=0),\"x\",IF($G63=\"cold\",\"x\",IF(AND(EQ$6>$F63,EP$6<$E63),IF(EP$6>$F63,IF(EQ$6>$E63,$U63/($E63-$F63)*($E63-EP$6),$U63/($E63-$F63)*(EQ$6-EP$6)),$U63/($E63-$F63)*(EQ$6-$F63)),\"x\")))","v":"x"},"x","x","x","x","x","x","x","x","x","x","x","x","x","x","x","x","x","x","x","x","x","x","x","x","x","x","x","x","x","x","x",{"$f":"IF(OR($V63=\"Utility\",$AA63=0),\"x\",IF($G63=\"cold\",\"x\",IF(AND(FW$6>$F63,FV$6<$E63),IF(FV$6>$F63,IF(FW$6>$E63,$U63/($E63-$F63)*($E63-FV$6),$U63/($E63-$F63)*(FW$6-FV$6)),$U63/($E63-$F63)*(FW$6-$F63)),\"x\")))","v":"x"},"x","x","x","x","x","x","x","x","x","x","x","x","x","x","x","x","x","x","x","x","x","x","x","x","x","x","x","x","x","x","x",{"$f":"IF(OR($V63=\"Utility\",$AA63=0),\"x\",IF($G63=\"cold\",\"x\",IF(AND(HC$6>$F63,HB$6<$E63),IF(HB$6>$F63,IF(HC$6>$E63,$U63/($E63-$F63)*($E63-HB$6),$U63/($E63-$F63)*(HC$6-HB$6)),$U63/($E63-$F63)*(HC$6-$F63)),\"x\")))","v":"x"},"x","x","x","x","x","x","x","x","x","x","x","x","x","x","x","x","x","x","x","x","x","x","x","x","x","x","x","x","x","x","x","x","x","x","x","x"]
["",{"$f":"IF(G66=\"hot\",COUNTIF($G$5:G66,\"hot\"),\"\")","v":""},{"$f":"IF(G66=\"cold\",COUNTIF($G$5:G66,\"cold\"),\"\")","v":""},null,null,null,"",null,null,"","","",null,null,null,null,null,null,null,null,"",null,"","","","","",null,null,null,null,null,null,null,null,null,null,null,0,null,{"$f":"IF(OR($V64=\"Utility\",$AA64=0),\"x\",IF($G64=\"hot\",\"x\",IF(AND(AO$6>$E64,AN$6<$F64),IF(AN$6>$E64,IF(AO$6>$F64,$U64/($F64-$E64)*($F64-AN$6),$U64/($F64-$E64)*(AO$6-AN$6)),$U64/($F64-$E64)*(AO$6-$E64)),\"x\")))","v":"x"},"x","x","x","x","x","x","x","x","x","x","x","x","x","x","x","x","x","x","x","x","x","x","x","x","x","x","x","x","x","x","x",{"$f":"IF(OR($V64=\"Utility\",$AA64=0),\"x\",IF($G64=\"hot\",\"x\",IF(AND(BU$6>$E64,BT$6<$F64),IF(BT$6>$E64,IF(BU$6>$F64,$U64/($F64-$E64)*($F64-BT$6),$U64/($F64-$E64)*(BU$6-BT$6)),$U64/($F64-$E64)*(BU$6-$E64)),\"x\")))","v":"x"},"x","x","x","x","x","x","x","x","x","x","x","x","x","x","x","x","x","x","x","x","x","x","x","x","x","x","x","x","x","x","x",{"$f":"IF(OR($V64=\"Utility\",$AA64=0),\"x\",IF($G64=\"hot\",\"x\",IF(AND(DA$6>$E64,CZ$6<$F64),IF(CZ$6>$E64,IF(DA$6>$F64,$U64/($F64-$E64)*($F64-CZ$6),$U64/($F64-$E64)*(DA$6-CZ$6)),$U64/($F64-$E64)*(DA$6-$E64)),\"x\")))","v":"x"},"x","x","x","x","x","x","x","x","x","x","x","x","x","x","x","x","x","x","x","x","x","x","x","x","x","x","x","x","x","x","x","x","x","x","x","x",null,null,null,0,null,{"$f":"IF(OR($V64=\"Utility\",$AA64=0),\"x\",IF($G64=\"cold\",\"x\",IF(AND(EQ$6>$F64,EP$6<$E64),IF(EP$6>$F64,IF(EQ$6>$E64,$U64/($E64-$F64)*($E64-EP$6),$U64/($E64-$F64)*(EQ$6-EP$6)),$U64/($E64-$F64)*(EQ$6-$F64)),\"x\")))","v":"x"},"x","x","x","x","x","x","x","x","x","x","x","x","x","x","x","x","x","x","x","x","x","x","x","x","x","x","x","x","x","x","x",{"$f":"IF(OR($V64=\"Utility\",$AA64=0),\"x\",IF($G64=\"cold\",\"x\",IF(AND(FW$6>$F64,FV$6<$E64),IF(FV$6>$F64,IF(FW$6>$E64,$U64/($E64-$F64)*($E64-FV$6),$U64/($E64-$F64)*(FW$6-FV$6)),$U64/($E64-$F64)*(FW$6-$F64)),\"x\")))","v":"x"},"x","x","x","x","x","x","x","x","x","x","x","x","x","x","x","x","x","x","x","x","x","x","x","x","x","x","x","x","x","x","x",{"$f":"IF(OR($V64=\"Utility\",$AA64=0),\"x\",IF($G64=\"cold\",\"x\",IF(AND(HC$6>$F64,HB$6<$E64),IF(HB$6>$F64,IF(HC$6>$E64,$U64/($E64-$F64)*($E64-HB$6),$U64/($E64-$F64)*(HC$6-HB$6)),$U64/($E64-$F64)*(HC$6-$F64)),\"x\")))","v":"x"},"x","x","x","x","x","x","x","x","x","x","x","x","x","x","x","x","x","x","x","x","x","x","x","x","x","x","x","x","x","x","x","x","x","x","x","x"]
["",{"$f":"IF(G67=\"hot\",COUNTIF($G$5:G67,\"hot\"),\"\")","v":""},{"$f":"IF(G67=\"cold\",COUNTIF($G$5:G67,\"cold\"),\"\")","v":""},null,null,null,"",null,null,"","","",null,null,null,null,null,null,null,null,"",null,"","","","","",null,null,null,null,null,null,null,null,null,null,null,0,null,{"$f":"IF(OR($V65=\"Utility\",$AA65=0),\"x\",IF($G65=\"hot\",\"x\",IF(AND(AO$6>$E65,AN$6<$F65),IF(AN$6>$E65,IF(AO$6>$F65,$U65/($F65-$E65)*($F65-AN$6),$U65/($F65-$E65)*(AO$6-AN$6)),$U65/($F65-$E65)*(AO$6-$E65)),\"x\")))","v":"x"},"x","x","x","x","x","x","x","x","x","x","x","x","x","x","x","x","x","x","x","x","x","x","x","x","x","x","x","x","x","x","x",{"$f":"IF(OR($V65=\"Utility\",$AA65=0),\"x\",IF($G65=\"hot\",\"x\",IF(AND(BU$6>$E65,BT$6<$F65),IF(BT$6>$E65,IF(BU$6>$F65,$U65/($F65-$E65)*($F65-BT$6),$U65/($F65-$E65)*(BU$6-BT$6)),$U65/($F65-$E65)*(BU$6-$E65)),\"x\")))","v":"x"},"x","x","x","x","x","x","x","x","x","x","x","x","x","x","x","x","x","x","x","x","x","x","x","x","x","x","x","x","x","x","x",{"$f":"IF(OR($V65=\"Utility\",$AA65=0),\"x\",IF($G65=\"hot\",\"x\",IF(AND(DA$6>$E65,CZ$6<$F65),IF(CZ$6>$E65,IF(DA$6>$F65,$U65/($F65-$E65)*($F65-CZ$6),$U65/($F65-$E65)*(DA$6-CZ$6)),$U65/($F65-$E65)*(DA$6-$E65)),\"x\")))","v":"x"},"x","x","x","x","x","x","x","x","x","x","x","x","x","x","x","x","x","x","x","x","x","x","x","x","x","x","x","x","x","x","x","x","x","x","x","x",null,null,null,0,null,{"$f":"IF(OR($V65=\"Utility\",$AA65=0),\"x\",IF($G65=\"cold\",\"x\",IF(AND(EQ$6>$F65,EP$6<$E65),IF(EP$6>$F65,IF(EQ$6>$E65,$U65/($E65-$F65)*($E65-EP$6),$U65/($E65-$F65)*(EQ$6-EP$6)),$U65/($E65-$F65)*(EQ$6-$F65)),\"x\")))","v":"x"},"x","x","x","x","x","x","x","x","x","x","x","x","x","x","x","x","x","x","x","x","x","x","x","x","x","x","x","x","x","x","x",{"$f":"IF(OR($V65=\"Utility\",$AA65=0),\"x\",IF($G65=\"cold\",\"x\",IF(AND(FW$6>$F65,FV$6<$E65),IF(FV$6>$F65,IF(FW$6>$E65,$U65/($E65-$F65)*($E65-FV$6),$U65/($E65-$F65)*(FW$6-FV$6)),$U65/($E65-$F65)*(FW$6-$F65)),\"x\")))","v":"x"},"x","x","x","x","x","x","x","x","x","x","x","x","x","x","x","x","x","x","x","x","x","x","x","x","x","x","x","x","x","x","x",{"$f":"IF(OR($V65=\"Utility\",$AA65=0),\"x\",IF($G65=\"cold\",\"x\",IF(AND(HC$6>$F65,HB$6<$E65),IF(HB$6>$F65,IF(HC$6>$E65,$U65/($E65-$F65)*($E65-HB$6),$U65/($E65-$F65)*(HC$6-HB$6)),$U65/($E65-$F65)*(HC$6-$F65)),\"x\")))","v":"x"},"x","x","x","x","x","x","x","x","x","x","x","x","x","x","x","x","x","x","x","x","x","x","x","x","x","x","x","x","x","x","x","x","x","x","x","x"]
["",{"$f":"IF(G68=\"hot\",COUNTIF($G$5:G68,\"hot\"),\"\")","v":""},{"$f":"IF(G68=\"cold\",COUNTIF($G$5:G68,\"cold\"),\"\")","v":""},null,null,null,"",null,null,"","","",null,null,null,null,null,null,null,null,"",null,"","","","","",null,null,null,null,null,null,null,null,null,null,null,0,null,{"$f":"IF(OR($V66=\"Utility\",$AA66=0),\"x\",IF($G66=\"hot\",\"x\",IF(AND(AO$6>$E66,AN$6<$F66),IF(AN$6>$E66,IF(AO$6>$F66,$U66/($F66-$E66)*($F66-AN$6),$U66/($F66-$E66)*(AO$6-AN$6)),$U66/($F66-$E66)*(AO$6-$E66)),\"x\")))","v":"x"},"x","x","x","x","x","x","x","x","x","x","x","x","x","x","x","x","x","x","x","x","x","x","x","x","x","x","x","x","x","x","x",{"$f":"IF(OR($V66=\"Utility\",$AA66=0),\"x\",IF($G66=\"hot\",\"x\",IF(AND(BU$6>$E66,BT$6<$F66),IF(BT$6>$E66,IF(BU$6>$F66,$U66/($F66-$E66)*($F66-BT$6),$U66/($F66-$E66)*(BU$6-BT$6)),$U66/($F66-$E66)*(BU$6-$E66)),\"x\")))","v":"x"},"x","x","x","x","x","x","x","x","x","x","x","x","x","x","x","x","x","x","x","x","x","x","x","x","x","x","x","x","x","x","x",{"$f":"IF(OR($V66=\"Utility\",$AA66=0),\"x\",IF($G66=\"hot\",\"x\",IF(AND(DA$6>$E66,CZ$6<$F66),IF(CZ$6>$E66,IF(DA$6>$F66,$U66/($F66-$E66)*($F66-CZ$6),$U66/($F66-$E66)*(DA$6-CZ$6)),$U66/($F66-$E66)*(DA$6-$E66)),\"x\")))","v":"x"},"x","x","x","x","x","x","x","x","x","x","x","x","x","x","x","x","x","x","x","x","x","x","x","x","x","x","x","x","x","x","x","x","x","x","x","x",null,null,null,0,null,{"$f":"IF(OR($V66=\"Utility\",$AA66=0),\"x\",IF($G66=\"cold\",\"x\",IF(AND(EQ$6>$F66,EP$6<$E66),IF(EP$6>$F66,IF(EQ$6>$E66,$U66/($E66-$F66)*($E66-EP$6),$U66/($E66-$F66)*(EQ$6-EP$6)),$U66/($E66-$F66)*(EQ$6-$F66)),\"x\")))","v":"x"},"x","x","x","x","x","x","x","x","x","x","x","x","x","x","x","x","x","x","x","x","x","x","x","x","x","x","x","x","x","x","x",{"$f":"IF(OR($V66=\"Utility\",$AA66=0),\"x\",IF($G66=\"cold\",\"x\",IF(AND(FW$6>$F66,FV$6<$E66),IF(FV$6>$F66,IF(FW$6>$E66,$U66/($E66-$F66)*($E66-FV$6),$U66/($E66-$F66)*(FW$6-FV$6)),$U66/($E66-$F66)*(FW$6-$F66)),\"x\")))","v":"x"},"x","x","x","x","x","x","x","x","x","x","x","x","x","x","x","x","x","x","x","x","x","x","x","x","x","x","x","x","x","x","x",{"$f":"IF(OR($V66=\"Utility\",$AA66=0),\"x\",IF($G66=\"cold\",\"x\",IF(AND(HC$6>$F66,HB$6<$E66),IF(HB$6>$F66,IF(HC$6>$E66,$U66/($E66-$F66)*($E66-HB$6),$U66/($E66-$F66)*(HC$6-HB$6)),$U66/($E66-$F66)*(HC$6-$F66)),\"x\")))","v":"x"},"x","x","x","x","x","x","x","x","x","x","x","x","x","x","x","x","x","x","x","x","x","x","x","x","x","x","x","x","x","x","x","x","x","x","x","x"]
["",{"$f":"IF(G69=\"hot\",COUNTIF($G$5:G69,\"hot\"),\"\")","v":""},{"$f":"IF(G69=\"cold\",COUNTIF($G$5:G69,\"cold\"),\"\")","v":""},null,null,null,"",null,null,"","","",null,null,null,null,null,null,null,null,"",null,{"$f":"IF(G69=\"hot\",J69,\"\")","v":""},{"$f":"IF(G69=\"cold\",J69,\"\")","v":""},{"$f":"IF(G69=\"\",\"\",IF(G69=\"hot\",_xlfn.RANK.EQ(W69,$W$5:$W$104),_xlfn.RANK.EQ(X69,$X$5:$X$104)))","v":""},{"$f":"IF(D69=\"\",\"\",D69)","v":""},"",null,null,null,null,null,null,null,null,null,null,null,0,null,{"$f":"IF(OR($V67=\"Utility\",$AA67=0),\"x\",IF($G67=\"hot\",\"x\",IF(AND(AO$6>$E67,AN$6<$F67),IF(AN$6>$E67,IF(AO$6>$F67,$U67/($F67-$E67)*($F67-AN$6),$U67/($F67-$E67)*(AO$6-AN$6)),$U67/($F67-$E67)*(AO$6-$E67)),\"x\")))","v":"x"},"x","x","x","x","x","x","x","x","x","x","x","x","x","x","x","x","x","x","x","x","x","x","x","x","x","x","x","x","x","x","x",{"$f":"IF(OR($V67=\"Utility\",$AA67=0),\"x\",IF($G67=\"hot\",\"x\",IF(AND(BU$6>$E67,BT$6<$F67),IF(BT$6>$E67,IF(BU$6>$F67,$U67/($F67-$E67)*($F67-BT$6),$U67/($F67-$E67)*(BU$6-BT$6)),$U67/($F67-$E67)*(BU$6-$E67)),\"x\")))","v":"x"},"x","x","x","x","x","x","x","x","x","x","x","x","x","x","x","x","x","x","x","x","x","x","x","x","x","x","x","x","x","x","x",{"$f":"IF(OR($V67=\"Utility\",$AA67=0),\"x\",IF($G67=\"hot\",\"x\",IF(AND(DA$6>$E67,CZ$6<$F67),IF(CZ$6>$E67,IF(DA$6>$F67,$U67/($F67-$E67)*($F67-CZ$6),$U67/($F67-$E67)*(DA$6-CZ$6)),$U67/($F67-$E67)*(DA$6-$E67)),\"x\")))","v":"x"},"x","x","x","x","x","x","x","x","x","x","x","x","x","x","x","x","x","x","x","x","x","x","x","x","x","x","x","x","x","x","x","x","x","x","x","x",null,null,null,0,null,{"$f":"IF(OR($V67=\"Utility\",$AA67=0),\"x\",IF($G67=\"cold\",\"x\",IF(AND(EQ$6>$F67,EP$6<$E67),IF(EP$6>$F67,IF(EQ$6>$E67,$U67/($E67-$F67)*($E67-EP$6),$U67/($E67-$F67)*(EQ$6-EP$6)),$U67/($E67-$F67)*(EQ$6-$F67)),\"x\")))","v":"x"},"x","x","x","x","x","x","x","x","x","x","x","x","x","x","x","x","x","x","x","x","x","x","x","x","x","x","x","x","x","x","x",{"$f":"IF(OR($V67=\"Utility\",$AA67=0),\"x\",IF($G67=\"cold\",\"x\",IF(AND(FW$6>$F67,FV$6<$E67),IF(FV$6>$F67,IF(FW$6>$E67,$U67/($E67-$F67)*($E67-FV$6),$U67/($E67-$F67)*(FW$6-FV$6)),$U67/($E67-$F67)*(FW$6-$F67)),\"x\")))","v":"x"},"x","x","x","x","x","x","x","x","x","x","x","x","x","x","x","x","x","x","x","x","x","x","x","x","x","x","x","x","x","x","x",{"$f":"IF(OR($V67=\"Utility\",$AA67=0),\"x\",IF($G67=\"cold\",\"x\",IF(AND(HC$6>$F67,HB$6<$E67),IF(HB$6>$F67,IF(HC$6>$E67,$U67/($E67-$F67)*($E67-HB$6),$U67/($E67-$F67)*(HC$6-HB$6)),$U67/($E67-$F67)*(HC$6-$F67)),\"x\")))","v":"x"},"x","x","x","x","x","x","x","x","x","x","x","x","x","x","x","x","x","x","x","x","x","x","x","x","x","x","x","x","x","x","x","x","x","x","x","x"]
["",{"$f":"IF(G70=\"hot\",COUNTIF($G$5:G70,\"hot\"),\"\")","v":""},{"$f":"IF(G70=\"cold\",COUNTIF($G$5:G70,\"cold\"),\"\")","v":""},null,null,null,{"$f":"IF(A70=\"\",\"\",IF(E70<F70,\"cold\",\"hot\"))","v":""},null,null,{"$f":"IF(A70=\"\",\"\",IF(T70=\"\",H70*I70,ABS(U70/S70*1000/(E70-F70))))","v":""},{"$f":"IF(A70=\"\",\"\",ABS(I70*(F70-E70)))","v":""},{"$f":"IF(A70=\"\",\"\",IF(T70=\"\",K70*H70,U70/S70*1000))","v":""},null,null,null,null,null,null,null,null,{"$f":"IF(A70=\"\",\"\",IF(T70=\"\",S70*L70/1000,T70))","v":""},null,"","","","",{"$f":"IF(D70=\"\",\"\",IF(AND(ISNUMBER(E70),ISNUMBER(F70),ISNUMBER(I70),ISNUMBER(S70),ISTEXT(D70),ISTEXT(V70),OR(ISNUMBER(H70),ISNUMBER(T70)),E70<>F70,E70>0,F70>0,I70>0,S70>0,OR(H70>0,T70>0))=TRUE,1,0))","v":""},null,null,null,null,null,null,null,null,null,null,null,0,null,{"$f":"IF(OR($V68=\"Utility\",$AA68=0),\"x\",IF($G68=\"hot\",\"x\",IF(AND(AO$6>$E68,AN$6<$F68),IF(AN$6>$E68,IF(AO$6>$F68,$U68/($F68-$E68)*($F68-AN$6),$U68/($F68-$E68)*(AO$6-AN$6)),$U68/($F68-$E68)*(AO$6-$E68)),\"x\")))","v":"x"},"x","x","x","x","x","x","x","x","x","x","x","x","x","x","x","x","x","x","x","x","x","x","x","x","x","x","x","x","x","x","x",{"$f":"IF(OR($V68=\"Utility\",$AA68=0),\"x\",IF($G68=\"hot\",\"x\",IF(AND(BU$6>$E68,BT$6<$F68),IF(BT$6>$E68,IF(BU$6>$F68,$U68/($F68-$E68)*($F68-BT$6),$U68/($F68-$E68)*(BU$6-BT$6)),$U68/($F68-$E68)*(BU$6-$E68)),\"x\")))","v":"x"},"x","x","x","x","x","x","x","x","x","x","x","x","x","x","x","x","x","x","x","x","x","x","x","x","x","x","x","x","x","x","x",{"$f":"IF(OR($V68=\"Utility\",$AA68=0),\"x\",IF($G68=\"hot\",\"x\",IF(AND(DA$6>$E68,CZ$6<$F68),IF(CZ$6>$E68,IF(DA$6>$F68,$U68/($F68-$E68)*($F68-CZ$6),$U68/($F68-$E68)*(DA$6-CZ$6)),$U68/($F68-$E68)*(DA$6-$E68)),\"x\")))","v":"x"},"x","x","x","x","x","x","x","x","x","x","x","x","x","x","x","x","x","x","x","x","x","x","x","x","x","x","x","x","x","x","x","x","x","x","x","x",null,null,null,0,null,{"$f":"IF(OR($V68=\"Utility\",$AA68=0),\"x\",IF($G68=\"cold\",\"x\",IF(AND(EQ$6>$F68,EP$6<$E68),IF(EP$6>$F68,IF(EQ$6>$E68,$U68/($E68-$F68)*($E68-EP$6),$U68/($E68-$F68)*(EQ$6-EP$6)),$U68/($E68-$F68)*(EQ$6-$F68)),\"x\")))","v":"x"},"x","x","x","x","x","x","x","x","x","x","x","x","x","x","x","x","x","x","x","x","x","x","x","x","x","x","x","x","x","x","x",{"$f":"IF(OR($V68=\"Utility\",$AA68=0),\"x\",IF($G68=\"cold\",\"x\",IF(AND(FW$6>$F68,FV$6<$E68),IF(FV$6>$F68,IF(FW$6>$E68,$U68/($E68-$F68)*($E68-FV$6),$U68/($E68-$F68)*(FW$6-FV$6)),$U68/($E68-$F68)*(FW$6-$F68)),\"x\")))","v":"x"},"x","x","x","x","x","x","x","x","x","x","x","x","x","x","x","x","x","x","x","x","x","x","x","x","x","x","x","x","x","x","x",{"$f":"IF(OR($V68=\"Utility\",$AA68=0),\"x\",IF($G68=\"cold\",\"x\",IF(AND(HC$6>$F68,HB$6<$E68),IF(HB$6>$F68,IF(HC$6>$E68,$U68/($E68-$F68)*($E68-HB$6),$U68/($E68-$F68)*(HC$6-HB$6)),$U68/($E68-$F68)*(HC$6-$F68)),\"x\")))","v":"x"},"x","x","x","x","x","x","x","x","x","x","x","x","x","x","x","x","x","x","x","x","x","x","x","x","x","x","x","x","x","x","x","x","x","x","x","x"]
["",{"$f":"IF(G71=\"hot\",COUNTIF($G$5:G71,\"hot\"),\"\")","v":""},{"$f":"IF(G71=\"cold\",COUNTIF($G$5:G71,\"cold\"),\"\")","v":""},null,null,null,"",null,null,"","","",null,null,null,null,null,null,null,null,"",null,"","","","","",null,null,null,null,null,null,null,null,null,null,null,{"$f":"D69","v":0},null,{"$f":"IF(OR($V69=\"Utility\",$AA69=0),\"x\",IF($G69=\"hot\",\"x\",IF(AND(AO$6>$E69,AN$6<$F69),IF(AN$6>$E69,IF(AO$6>$F69,$U69/($F69-$E69)*($F69-AN$6),$U69/($F69-$E69)*(AO$6-AN$6)),$U69/($F69-$E69)*(AO$6-$E69)),\"x\")))","v":"x"},"x","x","x","x","x","x","x","x","x","x","x","x","x","x","x","x","x","x","x","x","x","x","x","x","x","x","x","x","x","x","x",{"$f":"IF(OR($V69=\"Utility\",$AA69=0),\"x\",IF($G69=\"hot\",\"x\",IF(AND(BU$6>$E69,BT$6<$F69),IF(BT$6>$E69,IF(BU$6>$F69,$U69/($F69-$E69)*($F69-BT$6),$U69/($F69-$E69)*(BU$6-BT$6)),$U69/($F69-$E69)*(BU$6-$E69)),\"x\")))","v":"x"},"x","x","x","x","x","x","x","x","x","x","x","x","x","x","x","x","x","x","x","x","x","x","x","x","x","x","x","x","x","x","x",{"$f":"IF(OR($V69=\"Utility\",$AA69=0),\"x\",IF($G69=\"hot\",\"x\",IF(AND(DA$6>$E69,CZ$6<$F69),IF(CZ$6>$E69,IF(DA$6>$F69,$U69/($F69-$E69)*($F69-CZ$6),$U69/($F69-$E69)*(DA$6-CZ$6)),$U69/($F69-$E69)*(DA$6-$E69)),\"x\")))","v":"x"},"x","x","x","x","x","x","x","x","x","x","x","x","x","x","x","x","x","x","x","x","x","x","x","x","x","x","x","x","x","x","x","x","x","x","x","x",null,null,null,{"$f":"D69","v":0},null,{"$f":"IF(OR($V69=\"Utility\",$AA69=0),\"x\",IF($G69=\"cold\",\"x\",IF(AND(EQ$6>$F69,EP$6<$E69),IF(EP$6>$F69,IF(EQ$6>$E69,$U69/($E69-$F69)*($E69-EP$6),$U69/($E69-$F69)*(EQ$6-EP$6)),$U69/($E69-$F69)*(EQ$6-$F69)),\"x\")))","v":"x"},"x","x","x","x","x","x","x","x","x","x","x","x","x","x","x","x","x","x","x","x","x","x","x","x","x","x","x","x","x","x","x",{"$f":"IF(OR($V69=\"Utility\",$AA69=0),\"x\",IF($G69=\"cold\",\"x\",IF(AND(FW$6>$F69,FV$6<$E69),IF(FV$6>$F69,IF(FW$6>$E69,$U69/($E69-$F69)*($E69-FV$6),$U69/($E69-$F69)*(FW$6-FV$6)),$U69/($E69-$F69)*(FW$6-$F69)),\"x\")))","v":"x"},"x","x","x","x","x","x","x","x","x","x","x","x","x","x","x","x","x","x","x","x","x","x","x","x","x","x","x","x","x","x","x",{"$f":"IF(OR($V69=\"Utility\",$AA69=0),\"x\",IF($G69=\"cold\",\"x\",IF(AND(HC$6>$F69,HB$6<$E69),IF(HB$6>$F69,IF(HC$6>$E69,$U69/($E69-$F69)*($E69-HB$6),$U69/($E69-$F69)*(HC$6-HB$6)),$U69/($E69-$F69)*(HC$6-$F69)),\"x\")))","v":"x"},"x","x","x","x","x","x","x","x","x","x","x","x","x","x","x","x","x","x","x","x","x","x","x","x","x","x","x","x","x","x","x","x","x","x","x","x"]
["",{"$f":"IF(G72=\"hot\",COUNTIF($G$5:G72,\"hot\"),\"\")","v":""},{"$f":"IF(G72=\"cold\",COUNTIF($G$5:G72,\"cold\"),\"\")","v":""},null,null,null,"",null,null,"","","",null,null,null,null,null,null,null,null,"",null,"","","","","",null,null,null,null,null,null,null,null,null,null,null,0,null,{"$f":"IF(OR($V70=\"Utility\",$AA70=0),\"x\",IF($G70=\"hot\",\"x\",IF(AND(AO$6>$E70,AN$6<$F70),IF(AN$6>$E70,IF(AO$6>$F70,$U70/($F70-$E70)*($F70-AN$6),$U70/($F70-$E70)*(AO$6-AN$6)),$U70/($F70-$E70)*(AO$6-$E70)),\"x\")))","v":"x"},"x","x","x","x","x","x","x","x","x","x","x","x","x","x","x","x","x","x","x","x","x","x","x","x","x","x","x","x","x","x","x",{"$f":"IF(OR($V70=\"Utility\",$AA70=0),\"x\",IF($G70=\"hot\",\"x\",IF(AND(BU$6>$E70,BT$6<$F70),IF(BT$6>$E70,IF(BU$6>$F70,$U70/($F70-$E70)*($F70-BT$6),$U70/($F70-$E70)*(BU$6-BT$6)),$U70/($F70-$E70)*(BU$6-$E70)),\"x\")))","v":"x"},"x","x","x","x","x","x","x","x","x","x","x","x","x","x","x","x","x","x","x","x","x","x","x","x","x","x","x","x","x","x","x",{"$f":"IF(OR($V70=\"Utility\",$AA70=0),\"x\",IF($G70=\"hot\",\"x\",IF(AND(DA$6>$E70,CZ$6<$F70),IF(CZ$6>$E70,IF(DA$6>$F70,$U70/($F70-$E70)*($F70-CZ$6),$U70/($F70-$E70)*(DA$6-CZ$6)),$U70/($F70-$E70)*(DA$6-$E70)),\"x\")))","v":"x"},"x","x","x","x","x","x","x","x","x","x","x","x","x","x","x","x","x","x","x","x","x","x","x","x","x","x","x","x","x","x","x","x","x","x","x","x",null,null,null,0,null,{"$f":"IF(OR($V70=\"Utility\",$AA70=0),\"x\",IF($G70=\"cold\",\"x\",IF(AND(EQ$6>$F70,EP$6<$E70),IF(EP$6>$F70,IF(EQ$6>$E70,$U70/($E70-$F70)*($E70-EP$6),$U70/($E70-$F70)*(EQ$6-EP$6)),$U70/($E70-$F70)*(EQ$6-$F70)),\"x\")))","v":"x"},"x","x","x","x","x","x","x","x","x","x","x","x","x","x","x","x","x","x","x","x","x","x","x","x","x","x","x","x","x","x","x",{"$f":"IF(OR($V70=\"Utility\",$AA70=0),\"x\",IF($G70=\"cold\",\"x\",IF(AND(FW$6>$F70,FV$6<$E70),IF(FV$6>$F70,IF(FW$6>$E70,$U70/($E70-$F70)*($E70-FV$6),$U70/($E70-$F70)*(FW$6-FV$6)),$U70/($E70-$F70)*(FW$6-$F70)),\"x\")))","v":"x"},"x","x","x","x","x","x","x","x","x","x","x","x","x","x","x","x","x","x","x","x","x","x","x","x","x","x","x","x","x","x","x",{"$f":"IF(OR($V70=\"Utility\",$AA70=0),\"x\",IF($G70=\"cold\",\"x\",IF(AND(HC$6>$F70,HB$6<$E70),IF(HB$6>$F70,IF(HC$6>$E70,$U70/($E70-$F70)*($E70-HB$6),$U70/($E70-$F70)*(HC$6-HB$6)),$U70/($E70-$F70)*(HC$6-$F70)),\"x\")))","v":"x"},"x","x","x","x","x","x","x","x","x","x","x","x","x","x","x","x","x","x","x","x","x","x","x","x","x","x","x","x","x","x","x","x","x","x","x","x"]
["",{"$f":"IF(G73=\"hot\",COUNTIF($G$5:G73,\"hot\"),\"\")","v":""},{"$f":"IF(G73=\"cold\",COUNTIF($G$5:G73,\"cold\"),\"\")","v":""},null,null,null,"",null,null,"","","",null,null,null,null,null,null,null,null,"",null,"","","","","",null,null,null,null,null,null,null,null,null,null,null,0,null,{"$f":"IF(OR($V71=\"Utility\",$AA71=0),\"x\",IF($G71=\"hot\",\"x\",IF(AND(AO$6>$E71,AN$6<$F71),IF(AN$6>$E71,IF(AO$6>$F71,$U71/($F71-$E71)*($F71-AN$6),$U71/($F71-$E71)*(AO$6-AN$6)),$U71/($F71-$E71)*(AO$6-$E71)),\"x\")))","v":"x"},"x","x","x","x","x","x","x","x","x","x","x","x","x","x","x","x","x","x","x","x","x","x","x","x","x","x","x","x","x","x","x",{"$f":"IF(OR($V71=\"Utility\",$AA71=0),\"x\",IF($G71=\"hot\",\"x\",IF(AND(BU$6>$E71,BT$6<$F71),IF(BT$6>$E71,IF(BU$6>$F71,$U71/($F71-$E71)*($F71-BT$6),$U71/($F71-$E71)*(BU$6-BT$6)),$U71/($F71-$E71)*(BU$6-$E71)),\"x\")))","v":"x"},"x","x","x","x","x","x","x","x","x","x","x","x","x","x","x","x","x","x","x","x","x","x","x","x","x","x","x","x","x","x","x",{"$f":"IF(OR($V71=\"Utility\",$AA71=0),\"x\",IF($G71=\"hot\",\"x\",IF(AND(DA$6>$E71,CZ$6<$F71),IF(CZ$6>$E71,IF(DA$6>$F71,$U71/($F71-$E71)*($F71-CZ$6),$U71/($F71-$E71)*(DA$6-CZ$6)),$U71/($F71-$E71)*(DA$6-$E71)),\"x\")))","v":"x"},"x","x","x","x","x","x","x","x","x","x","x","x","x","x","x","x","x","x","x","x","x","x","x","x","x","x","x","x","x","x","x","x","x","x","x","x",null,null,null,0,null,{"$f":"IF(OR($V71=\"Utility\",$AA71=0),\"x\",IF($G71=\"cold\",\"x\",IF(AND(EQ$6>$F71,EP$6<$E71),IF(EP$6>$F71,IF(EQ$6>$E71,$U71/($E71-$F71)*($E71-EP$6),$U71/($E71-$F71)*(EQ$6-EP$6)),$U71/($E71-$F71)*(EQ$6-$F71)),\"x\")))","v":"x"},"x","x","x","x","x","x","x","x","x","x","x","x","x","x","x","x","x","x","x","x","x","x","x","x","x","x","x","x","x","x","x",{"$f":"IF(OR($V71=\"Utility\",$AA71=0),\"x\",IF($G71=\"cold\",\"x\",IF(AND(FW$6>$F71,FV$6<$E71),IF(FV$6>$F71,IF(FW$6>$E71,$U71/($E71-$F71)*($E71-FV$6),$U71/($E71-$F71)*(FW$6-FV$6)),$U71/($E71-$F71)*(FW$6-$F71)),\"x\")))","v":"x"},"x","x","x","x","x","x","x","x","x","x","x","x","x","x","x","x","x","x","x","x","x","x","x","x","x","x","x","x","x","x","x",{"$f":"IF(OR($V71=\"Utility\",$AA71=0),\"x\",IF($G71=\"cold\",\"x\",IF(AND(HC$6>$F71,HB$6<$E71),IF(HB$6>$F71,IF(HC$6>$E71,$U71/($E71-$F71)*($E71-HB$6),$U71/($E71-$F71)*(HC$6-HB$6)),$U71/($E71-$F71)*(HC$6-$F71)),\"x\")))","v":"x"},"x","x","x","x","x","x","x","x","x","x","x","x","x","x","x","x","x","x","x","x","x","x","x","x","x","x","x","x","x","x","x","x","x","x","x","x"]
["",{"$f":"IF(G74=\"hot\",COUNTIF($G$5:G74,\"hot\"),\"\")","v":""},{"$f":"IF(G74=\"cold\",COUNTIF($G$5:G74,\"cold\"),\"\")","v":""},null,null,null,"",null,null,"","","",null,null,null,null,null,null,null,null,"",null,"","","","","",null,null,null,null,null,null,null,null,null,null,null,0,null,{"$f":"IF(OR($V72=\"Utility\",$AA72=0),\"x\",IF($G72=\"hot\",\"x\",IF(AND(AO$6>$E72,AN$6<$F72),IF(AN$6>$E72,IF(AO$6>$F72,$U72/($F72-$E72)*($F72-AN$6),$U72/($F72-$E72)*(AO$6-AN$6)),$U72/($F72-$E72)*(AO$6-$E72)),\"x\")))","v":"x"},"x","x","x","x","x","x","x","x","x","x","x","x","x","x","x","x","x","x","x","x","x","x","x","x","x","x","x","x","x","x","x",{"$f":"IF(OR($V72=\"Utility\",$AA72=0),\"x\",IF($G72=\"hot\",\"x\",IF(AND(BU$6>$E72,BT$6<$F72),IF(BT$6>$E72,IF(BU$6>$F72,$U72/($F72-$E72)*($F72-BT$6),$U72/($F72-$E72)*(BU$6-BT$6)),$U72/($F72-$E72)*(BU$6-$E72)),\"x\")))","v":"x"},"x","x","x","x","x","x","x","x","x","x","x","x","x","x","x","x","x","x","x","x","x","x","x","x","x","x","x","x","x","x","x",{"$f":"IF(OR($V72=\"Utility\",$AA72=0),\"x\",IF($G72=\"hot\",\"x\",IF(AND(DA$6>$E72,CZ$6<$F72),IF(CZ$6>$E72,IF(DA$6>$F72,$U72/($F72-$E72)*($F72-CZ$6),$U72/($F72-$E72)*(DA$6-CZ$6)),$U72/($F72-$E72)*(DA$6-$E72)),\"x\")))","v":"x"},"x","x","x","x","x","x","x","x","x","x","x","x","x","x","x","x","x","x","x","x","x","x","x","x","x","x","x","x","x","x","x","x","x","x","x","x",null,null,null,0,null,{"$f":"IF(OR($V72=\"Utility\",$AA72=0),\"x\",IF($G72=\"cold\",\"x\",IF(AND(EQ$6>$F72,EP$6<$E72),IF(EP$6>$F72,IF(EQ$6>$E72,$U72/($E72-$F72)*($E72-EP$6),$U72/($E72-$F72)*(EQ$6-EP$6)),$U72/($E72-$F72)*(EQ$6-$F72)),\"x\")))","v":"x"},"x","x","x","x","x","x","x","x","x","x","x","x","x","x","x","x","x","x","x","x","x","x","x","x","x","x","x","x","x","x","x",{"$f":"IF(OR($V72=\"Utility\",$AA72=0),\"x\",IF($G72=\"cold\",\"x\",IF(AND(FW$6>$F72,FV$6<$E72),IF(FV$6>$F72,IF(FW$6>$E72,$U72/($E72-$F72)*($E72-FV$6),$U72/($E72-$F72)*(FW$6-FV$6)),$U72/($E72-$F72)*(FW$6-$F72)),\"x\")))","v":"x"},"x","x","x","x","x","x","x","x","x","x","x","x","x","x","x","x","x","x","x","x","x","x","x","x","x","x","x","x","x","x","x",{"$f":"IF(OR($V72=\"Utility\",$AA72=0),\"x\",IF($G72=\"cold\",\"x\",IF(AND(HC$6>$F72,HB$6<$E72),IF(HB$6>$F72,IF(HC$6>$E72,$U72/($E72-$F72)*($E72-HB$6),$U72/($E72-$F72)*(HC$6-HB$6)),$U72/($E72-$F72)*(HC$6-$F72)),\"x\")))","v":"x"},"x","x","x","x","x","x","x","x","x","x","x","x","x","x","x","x","x","x","x","x","x","x","x","x","x","x","x","x","x","x","x","x","x","x","x","x"]
["",{"$f":"IF(G75=\"hot\",COUNTIF($G$5:G75,\"hot\"),\"\")","v":""},{"$f":"IF(G75=\"cold\",COUNTIF($G$5:G75,\"cold\"),\"\")","v":""},null,null,null,"",null,null,"","","",null,null,null,null,null,null,null,null,"",null,"","","","","",null,null,null,null,null,null,null,null,null,null,null,0,null,{"$f":"IF(OR($V73=\"Utility\",$AA73=0),\"x\",IF($G73=\"hot\",\"x\",IF(AND(AO$6>$E73,AN$6<$F73),IF(AN$6>$E73,IF(AO$6>$F73,$U73/($F73-$E73)*($F73-AN$6),$U73/($F73-$E73)*(AO$6-AN$6)),$U73/($F73-$E73)*(AO$6-$E73)),\"x\")))","v":"x"},"x","x","x","x","x","x","x","x","x","x","x","x","x","x","x","x","x","x","x","x","x","x","x","x","x","x","x","x","x","x","x",{"$f":"IF(OR($V73=\"Utility\",$AA73=0),\"x\",IF($G73=\"hot\",\"x\",IF(AND(BU$6>$E73,BT$6<$F73),IF(BT$6>$E73,IF(BU$6>$F73,$U73/($F73-$E73)*($F73-BT$6),$U73/($F73-$E73)*(BU$6-BT$6)),$U73/($F73-$E73)*(BU$6-$E73)),\"x\")))","v":"x"},"x","x","x","x","x","x","x","x","x","x","x","x","x","x","x","x","x","x","x","x","x","x","x","x","x","x","x","x","x","x","x",{"$f":"IF(OR($V73=\"Utility\",$AA73=0),\"x\",IF($G73=\"hot\",\"x\",IF(AND(DA$6>$E73,CZ$6<$F73),IF(CZ$6>$E73,IF(DA$6>$F73,$U73/($F73-$E73)*($F73-CZ$6),$U73/($F73-$E73)*(DA$6-CZ$6)),$U73/($F73-$E73)*(DA$6-$E73)),\"x\")))","v":"x"},"x","x","x","x","x","x","x","x","x","x","x","x","x","x","x","x","x","x","x","x","x","x","x","x","x","x","x","x","x","x","x","x","x","x","x","x",null,null,null,0,null,{"$f":"IF(OR($V73=\"Utility\",$AA73=0),\"x\",IF($G73=\"cold\",\"x\",IF(AND(EQ$6>$F73,EP$6<$E73),IF(EP$6>$F73,IF(EQ$6>$E73,$U73/($E73-$F73)*($E73-EP$6),$U73/($E73-$F73)*(EQ$6-EP$6)),$U73/($E73-$F73)*(EQ$6-$F73)),\"x\")))","v":"x"},"x","x","x","x","x","x","x","x","x","x","x","x","x","x","x","x","x","x","x","x","x","x","x","x","x","x","x","x","x","x","x",{"$f":"IF(OR($V73=\"Utility\",$AA73=0),\"x\",IF($G73=\"cold\",\"x\",IF(AND(FW$6>$F73,FV$6<$E73),IF(FV$6>$F73,IF(FW$6>$E73,$U73/($E73-$F73)*($E73-FV$6),$U73/($E73-$F73)*(FW$6-FV$6)),$U73/($E73-$F73)*(FW$6-$F73)),\"x\")))","v":"x"},"x","x","x","x","x","x","x","x","x","x","x","x","x","x","x","x","x","x","x","x","x","x","x","x","x","x","x","x","x","x","x",{"$f":"IF(OR($V73=\"Utility\",$AA73=0),\"x\",IF($G73=\"cold\",\"x\",IF(AND(HC$6>$F73,HB$6<$E73),IF(HB$6>$F73,IF(HC$6>$E73,$U73/($E73-$F73)*($E73-HB$6),$U73/($E73-$F73)*(HC$6-HB$6)),$U73/($E73-$F73)*(HC$6-$F73)),\"x\")))","v":"x"},"x","x","x","x","x","x","x","x","x","x","x","x","x","x","x","x","x","x","x","x","x","x","x","x","x","x","x","x","x","x","x","x","x","x","x","x"]
["",{"$f":"IF(G76=\"hot\",COUNTIF($G$5:G76,\"hot\"),\"\")","v":""},{"$f":"IF(G76=\"cold\",COUNTIF($G$5:G76,\"cold\"),\"\")","v":""},null,null,null,"",null,null,"","","",null,null,null,null,null,null,null,null,"",null,"","","","","",null,null,null,null,null,null,null,null,null,null,null,0,null,{"$f":"IF(OR($V74=\"Utility\",$AA74=0),\"x\",IF($G74=\"hot\",\"x\",IF(AND(AO$6>$E74,AN$6<$F74),IF(AN$6>$E74,IF(AO$6>$F74,$U74/($F74-$E74)*($F74-AN$6),$U74/($F74-$E74)*(AO$6-AN$6)),$U74/($F74-$E74)*(AO$6-$E74)),\"x\")))","v":"x"},"x","x","x","x","x","x","x","x","x","x","x","x","x","x","x","x","x","x","x","x","x","x","x","x","x","x","x","x","x","x","x",{"$f":"IF(OR($V74=\"Utility\",$AA74=0),\"x\",IF($G74=\"hot\",\"x\",IF(AND(BU$6>$E74,BT$6<$F74),IF(BT$6>$E74,IF(BU$6>$F74,$U74/($F74-$E74)*($F74-BT$6),$U74/($F74-$E74)*(BU$6-BT$6)),$U74/($F74-$E74)*(BU$6-$E74)),\"x\")))","v":"x"},"x","x","x","x","x","x","x","x","x","x","x","x","x","x","x","x","x","x","x","x","x","x","x","x","x","x","x","x","x","x","x",{"$f":"IF(OR($V74=\"Utility\",$AA74=0),\"x\",IF($G74=\"hot\",\"x\",IF(AND(DA$6>$E74,CZ$6<$F74),IF(CZ$6>$E74,IF(DA$6>$F74,$U74/($F74-$E74)*($F74-CZ$6),$U74/($F74-$E74)*(DA$6-CZ$6)),$U74/($F74-$E74)*(DA$6-$E74)),\"x\")))","v":"x"},"x","x","x","x","x","x","x","x","x","x","x","x","x","x","x","x","x","x","x","x","x","x","x","x","x","x","x","x","x","x","x","x","x","x","x","x",null,null,null,0,null,{"$f":"IF(OR($V74=\"Utility\",$AA74=0),\"x\",IF($G74=\"cold\",\"x\",IF(AND(EQ$6>$F74,EP$6<$E74),IF(EP$6>$F74,IF(EQ$6>$E74,$U74/($E74-$F74)*($E74-EP$6),$U74/($E74-$F74)*(EQ$6-EP$6)),$U74/($E74-$F74)*(EQ$6-$F74)),\"x\")))","v":"x"},"x","x","x","x","x","x","x","x","x","x","x","x","x","x","x","x","x","x","x","x","x","x","x","x","x","x","x","x","x","x","x",{"$f":"IF(OR($V74=\"Utility\",$AA74=0),\"x\",IF($G74=\"cold\",\"x\",IF(AND(FW$6>$F74,FV$6<$E74),IF(FV$6>$F74,IF(FW$6>$E74,$U74/($E74-$F74)*($E74-FV$6),$U74/($E74-$F74)*(FW$6-FV$6)),$U74/($E74-$F74)*(FW$6-$F74)),\"x\")))","v":"x"},"x","x","x","x","x","x","x","x","x","x","x","x","x","x","x","x","x","x","x","x","x","x","x","x","x","x","x","x","x","x","x",{"$f":"IF(OR($V74=\"Utility\",$AA74=0),\"x\",IF($G74=\"cold\",\"x\",IF(AND(HC$6>$F74,HB$6<$E74),IF(HB$6>$F74,IF(HC$6>$E74,$U74/($E74-$F74)*($E74-HB$6),$U74/($E74-$F74)*(HC$6-HB$6)),$U74/($E74-$F74)*(HC$6-$F74)),\"x\")))","v":"x"},"x","x","x","x","x","x","x","x","x","x","x","x","x","x","x","x","x","x","x","x","x","x","x","x","x","x","x","x","x","x","x","x","x","x","x","x"]
["",{"$f":"IF(G77=\"hot\",COUNTIF($G$5:G77,\"hot\"),\"\")","v":""},{"$f":"IF(G77=\"cold\",COUNTIF($G$5:G77,\"cold\"),\"\")","v":""},null,null,null,"",null,null,"","","",null,null,null,null,null,null,null,null,"",null,"","","","","",null,null,null,null,null,null,null,null,null,null,null,0,null,{"$f":"IF(OR($V75=\"Utility\",$AA75=0),\"x\",IF($G75=\"hot\",\"x\",IF(AND(AO$6>$E75,AN$6<$F75),IF(AN$6>$E75,IF(AO$6>$F75,$U75/($F75-$E75)*($F75-AN$6),$U75/($F75-$E75)*(AO$6-AN$6)),$U75/($F75-$E75)*(AO$6-$E75)),\"x\")))","v":"x"},"x","x","x","x","x","x","x","x","x","x","x","x","x","x","x","x","x","x","x","x","x","x","x","x","x","x","x","x","x","x","x",{"$f":"IF(OR($V75=\"Utility\",$AA75=0),\"x\",IF($G75=\"hot\",\"x\",IF(AND(BU$6>$E75,BT$6<$F75),IF(BT$6>$E75,IF(BU$6>$F75,$U75/($F75-$E75)*($F75-BT$6),$U75/($F75-$E75)*(BU$6-BT$6)),$U75/($F75-$E75)*(BU$6-$E75)),\"x\")))","v":"x"},"x","x","x","x","x","x","x","x","x","x","x","x","x","x","x","x","x","x","x","x","x","x","x","x","x","x","x","x","x","x","x",{"$f":"IF(OR($V75=\"Utility\",$AA75=0),\"x\",IF($G75=\"hot\",\"x\",IF(AND(DA$6>$E75,CZ$6<$F75),IF(CZ$6>$E75,IF(DA$6>$F75,$U75/($F75-$E75)*($F75-CZ$6),$U75/($F75-$E75)*(DA$6-CZ$6)),$U75/($F75-$E75)*(DA$6-$E75)),\"x\")))","v":"x"},"x","x","x","x","x","x","x","x","x","x","x","x","x","x","x","x","x","x","x","x","x","x","x","x","x","x","x","x","x","x","x","x","x","x","x","x",null,null,null,0,null,{"$f":"IF(OR($V75=\"Utility\",$AA75=0),\"x\",IF($G75=\"cold\",\"x\",IF(AND(EQ$6>$F75,EP$6<$E75),IF(EP$6>$F75,IF(EQ$6>$E75,$U75/($E75-$F75)*($E75-EP$6),$U75/($E75-$F75)*(EQ$6-EP$6)),$U75/($E75-$F75)*(EQ$6-$F75)),\"x\")))","v":"x"},"x","x","x","x","x","x","x","x","x","x","x","x","x","x","x","x","x","x","x","x","x","x","x","x","x","x","x","x","x","x","x",{"$f":"IF(OR($V75=\"Utility\",$AA75=0),\"x\",IF($G75=\"cold\",\"x\",IF(AND(FW$6>$F75,FV$6<$E75),IF(FV$6>$F75,IF(FW$6>$E75,$U75/($E75-$F75)*($E75-FV$6),$U75/($E75-$F75)*(FW$6-FV$6)),$U75/($E75-$F75)*(FW$6-$F75)),\"x\")))","v":"x"},"x","x","x","x","x","x","x","x","x","x","x","x","x","x","x","x","x","x","x","x","x","x","x","x","x","x","x","x","x","x","x",{"$f":"IF(OR($V75=\"Utility\",$AA75=0),\"x\",IF($G75=\"cold\",\"x\",IF(AND(HC$6>$F75,HB$6<$E75),IF(HB$6>$F75,IF(HC$6>$E75,$U75/($E75-$F75)*($E75-HB$6),$U75/($E75-$F75)*(HC$6-HB$6)),$U75/($E75-$F75)*(HC$6-$F75)),\"x\")))","v":"x"},"x","x","x","x","x","x","x","x","x","x","x","x","x","x","x","x","x","x","x","x","x","x","x","x","x","x","x","x","x","x","x","x","x","x","x","x"]
["",{"$f":"IF(G78=\"hot\",COUNTIF($G$5:G78,\"hot\"),\"\")","v":""},{"$f":"IF(G78=\"cold\",COUNTIF($G$5:G78,\"cold\"),\"\")","v":""},null,null,null,"",null,null,"","","",null,null,null,null,null,null,null,null,"",null,"","","","","",null,null,null,null,null,null,null,null,null,null,null,0,null,{"$f":"IF(OR($V76=\"Utility\",$AA76=0),\"x\",IF($G76=\"hot\",\"x\",IF(AND(AO$6>$E76,AN$6<$F76),IF(AN$6>$E76,IF(AO$6>$F76,$U76/($F76-$E76)*($F76-AN$6),$U76/($F76-$E76)*(AO$6-AN$6)),$U76/($F76-$E76)*(AO$6-$E76)),\"x\")))","v":"x"},"x","x","x","x","x","x","x","x","x","x","x","x","x","x","x","x","x","x","x","x","x","x","x","x","x","x","x","x","x","x","x",{"$f":"IF(OR($V76=\"Utility\",$AA76=0),\"x\",IF($G76=\"hot\",\"x\",IF(AND(BU$6>$E76,BT$6<$F76),IF(BT$6>$E76,IF(BU$6>$F76,$U76/($F76-$E76)*($F76-BT$6),$U76/($F76-$E76)*(BU$6-BT$6)),$U76/($F76-$E76)*(BU$6-$E76)),\"x\")))","v":"x"},"x","x","x","x","x","x","x","x","x","x","x","x","x","x","x","x","x","x","x","x","x","x","x","x","x","x","x","x","x","x","x",{"$f":"IF(OR($V76=\"Utility\",$AA76=0),\"x\",IF($G76=\"hot\",\"x\",IF(AND(DA$6>$E76,CZ$6<$F76),IF(CZ$6>$E76,IF(DA$6>$F76,$U76/($F76-$E76)*($F76-CZ$6),$U76/($F76-$E76)*(DA$6-CZ$6)),$U76/($F76-$E76)*(DA$6-$E76)),\"x\")))","v":"x"},"x","x","x","x","x","x","x","x","x","x","x","x","x","x","x","x","x","x","x","x","x","x","x","x","x","x","x","x","x","x","x","x","x","x","x","x",null,null,null,0,null,{"$f":"IF(OR($V76=\"Utility\",$AA76=0),\"x\",IF($G76=\"cold\",\"x\",IF(AND(EQ$6>$F76,EP$6<$E76),IF(EP$6>$F76,IF(EQ$6>$E76,$U76/($E76-$F76)*($E76-EP$6),$U76/($E76-$F76)*(EQ$6-EP$6)),$U76/($E76-$F76)*(EQ$6-$F76)),\"x\")))","v":"x"},"x","x","x","x","x","x","x","x","x","x","x","x","x","x","x","x","x","x","x","x","x","x","x","x","x","x","x","x","x","x","x",{"$f":"IF(OR($V76=\"Utility\",$AA76=0),\"x\",IF($G76=\"cold\",\"x\",IF(AND(FW$6>$F76,FV$6<$E76),IF(FV$6>$F76,IF(FW$6>$E76,$U76/($E76-$F76)*($E76-FV$6),$U76/($E76-$F76)*(FW$6-FV$6)),$U76/($E76-$F76)*(FW$6-$F76)),\"x\")))","v":"x"},"x","x","x","x","x","x","x","x","x","x","x","x","x","x","x","x","x","x","x","x","x","x","x","x","x","x","x","x","x","x","x",{"$f":"IF(OR($V76=\"Utility\",$AA76=0),\"x\",IF($G76=\"cold\",\"x\",IF(AND(HC$6>$F76,HB$6<$E76),IF(HB$6>$F76,IF(HC$6>$E76,$U76/($E76-$F76)*($E76-HB$6),$U76/($E76-$F76)*(HC$6-HB$6)),$U76/($E76-$F76)*(HC$6-$F76)),\"x\")))","v":"x"},"x","x","x","x","x","x","x","x","x","x","x","x","x","x","x","x","x","x","x","x","x","x","x","x","x","x","x","x","x","x","x","x","x","x","x","x"]
["",{"$f":"IF(G79=\"hot\",COUNTIF($G$5:G79,\"hot\"),\"\")","v":""},{"$f":"IF(G79=\"cold\",COUNTIF($G$5:G79,\"cold\"),\"\")","v":""},null,null,null,"",null,null,"","","",null,null,null,null,null,null,null,null,"",null,"","","","","",null,null,null,null,null,null,null,null,null,null,null,0,null,{"$f":"IF(OR($V77=\"Utility\",$AA77=0),\"x\",IF($G77=\"hot\",\"x\",IF(AND(AO$6>$E77,AN$6<$F77),IF(AN$6>$E77,IF(AO$6>$F77,$U77/($F77-$E77)*($F77-AN$6),$U77/($F77-$E77)*(AO$6-AN$6)),$U77/($F77-$E77)*(AO$6-$E77)),\"x\")))","v":"x"},"x","x","x","x","x","x","x","x","x","x","x","x","x","x","x","x","x","x","x","x","x","x","x","x","x","x","x","x","x","x","x",{"$f":"IF(OR($V77=\"Utility\",$AA77=0),\"x\",IF($G77=\"hot\",\"x\",IF(AND(BU$6>$E77,BT$6<$F77),IF(BT$6>$E77,IF(BU$6>$F77,$U77/($F77-$E77)*($F77-BT$6),$U77/($F77-$E77)*(BU$6-BT$6)),$U77/($F77-$E77)*(BU$6-$E77)),\"x\")))","v":"x"},"x","x","x","x","x","x","x","x","x","x","x","x","x","x","x","x","x","x","x","x","x","x","x","x","x","x","x","x","x","x","x",{"$f":"IF(OR($V77=\"Utility\",$AA77=0),\"x\",IF($G77=\"hot\",\"x\",IF(AND(DA$6>$E77,CZ$6<$F77),IF(CZ$6>$E77,IF(DA$6>$F77,$U77/($F77-$E77)*($F77-CZ$6),$U77/($F77-$E77)*(DA$6-CZ$6)),$U77/($F77-$E77)*(DA$6-$E77)),\"x\")))","v":"x"},"x","x","x","x","x","x","x","x","x","x","x","x","x","x","x","x","x","x","x","x","x","x","x","x","x","x","x","x","x","x","x","x","x","x","x","x",null,null,null,0,null,{"$f":"IF(OR($V77=\"Utility\",$AA77=0),\"x\",IF($G77=\"cold\",\"x\",IF(AND(EQ$6>$F77,EP$6<$E77),IF(EP$6>$F77,IF(EQ$6>$E77,$U77/($E77-$F77)*($E77-EP$6),$U77/($E77-$F77)*(EQ$6-EP$6)),$U77/($E77-$F77)*(EQ$6-$F77)),\"x\")))","v":"x"},"x","x","x","x","x","x","x","x","x","x","x","x","x","x","x","x","x","x","x","x","x","x","x","x","x","x","x","x","x","x","x",{"$f":"IF(OR($V77=\"Utility\",$AA77=0),\"x\",IF($G77=\"cold\",\"x\",IF(AND(FW$6>$F77,FV$6<$E77),IF(FV$6>$F77,IF(FW$6>$E77,$U77/($E77-$F77)*($E77-FV$6),$U77/($E77-$F77)*(FW$6-FV$6)),$U77/($E77-$F77)*(FW$6-$F77)),\"x\")))","v":"x"},"x","x","x","x","x","x","x","x","x","x","x","x","x","x","x","x","x","x","x","x","x","x","x","x","x","x","x","x","x","x","x",{"$f":"IF(OR($V77=\"Utility\",$AA77=0),\"x\",IF($G77=\"cold\",\"x\",IF(AND(HC$6>$F77,HB$6<$E77),IF(HB$6>$F77,IF(HC$6>$E77,$U77/($E77-$F77)*($E77-HB$6),$U77/($E77-$F77)*(HC$6-HB$6)),$U77/($E77-$F77)*(HC$6-$F77)),\"x\")))","v":"x"},"x","x","x","x","x","x","x","x","x","x","x","x","x","x","x","x","x","x","x","x","x","x","x","x","x","x","x","x","x","x","x","x","x","x","x","x"]
["",{"$f":"IF(G80=\"hot\",COUNTIF($G$5:G80,\"hot\"),\"\")","v":""},{"$f":"IF(G80=\"cold\",COUNTIF($G$5:G80,\"cold\"),\"\")","v":""},null,null,null,"",null,null,"","","",null,null,null,null,null,null,null,null,"",null,"","","","","",null,null,null,null,null,null,null,null,null,null,null,0,null,{"$f":"IF(OR($V78=\"Utility\",$AA78=0),\"x\",IF($G78=\"hot\",\"x\",IF(AND(AO$6>$E78,AN$6<$F78),IF(AN$6>$E78,IF(AO$6>$F78,$U78/($F78-$E78)*($F78-AN$6),$U78/($F78-$E78)*(AO$6-AN$6)),$U78/($F78-$E78)*(AO$6-$E78)),\"x\")))","v":"x"},"x","x","x","x","x","x","x","x","x","x","x","x","x","x","x","x","x","x","x","x","x","x","x","x","x","x","x","x","x","x","x",{"$f":"IF(OR($V78=\"Utility\",$AA78=0),\"x\",IF($G78=\"hot\",\"x\",IF(AND(BU$6>$E78,BT$6<$F78),IF(BT$6>$E78,IF(BU$6>$F78,$U78/($F78-$E78)*($F78-BT$6),$U78/($F78-$E78)*(BU$6-BT$6)),$U78/($F78-$E78)*(BU$6-$E78)),\"x\")))","v":"x"},"x","x","x","x","x","x","x","x","x","x","x","x","x","x","x","x","x","x","x","x","x","x","x","x","x","x","x","x","x","x","x",{"$f":"IF(OR($V78=\"Utility\",$AA78=0),\"x\",IF($G78=\"hot\",\"x\",IF(AND(DA$6>$E78,CZ$6<$F78),IF(CZ$6>$E78,IF(DA$6>$F78,$U78/($F78-$E78)*($F78-CZ$6),$U78/($F78-$E78)*(DA$6-CZ$6)),$U78/($F78-$E78)*(DA$6-$E78)),\"x\")))","v":"x"},"x","x","x","x","x","x","x","x","x","x","x","x","x","x","x","x","x","x","x","x","x","x","x","x","x","x","x","x","x","x","x","x","x","x","x","x",null,null,null,0,null,{"$f":"IF(OR($V78=\"Utility\",$AA78=0),\"x\",IF($G78=\"cold\",\"x\",IF(AND(EQ$6>$F78,EP$6<$E78),IF(EP$6>$F78,IF(EQ$6>$E78,$U78/($E78-$F78)*($E78-EP$6),$U78/($E78-$F78)*(EQ$6-EP$6)),$U78/($E78-$F78)*(EQ$6-$F78)),\"x\")))","v":"x"},"x","x","x","x","x","x","x","x","x","x","x","x","x","x","x","x","x","x","x","x","x","x","x","x","x","x","x","x","x","x","x",{"$f":"IF(OR($V78=\"Utility\",$AA78=0),\"x\",IF($G78=\"cold\",\"x\",IF(AND(FW$6>$F78,FV$6<$E78),IF(FV$6>$F78,IF(FW$6>$E78,$U78/($E78-$F78)*($E78-FV$6),$U78/($E78-$F78)*(FW$6-FV$6)),$U78/($E78-$F78)*(FW$6-$F78)),\"x\")))","v":"x"},"x","x","x","x","x","x","x","x","x","x","x","x","x","x","x","x","x","x","x","x","x","x","x","x","x","x","x","x","x","x","x",{"$f":"IF(OR($V78=\"Utility\",$AA78=0),\"x\",IF($G78=\"cold\",\"x\",IF(AND(HC$6>$F78,HB$6<$E78),IF(HB$6>$F78,IF(HC$6>$E78,$U78/($E78-$F78)*($E78-HB$6),$U78/($E78-$F78)*(HC$6-HB$6)),$U78/($E78-$F78)*(HC$6-$F78)),\"x\")))","v":"x"},"x","x","x","x","x","x","x","x","x","x","x","x","x","x","x","x","x","x","x","x","x","x","x","x","x","x","x","x","x","x","x","x","x","x","x","x"]
["",{"$f":"IF(G81=\"hot\",COUNTIF($G$5:G81,\"hot\"),\"\")","v":""},{"$f":"IF(G81=\"cold\",COUNTIF($G$5:G81,\"cold\"),\"\")","v":""},null,null,null,"",null,null,"","","",null,null,null,null,null,null,null,null,"",null,"","","","","",null,null,null,null,null,null,null,null,null,null,null,0,null,{"$f":"IF(OR($V79=\"Utility\",$AA79=0),\"x\",IF($G79=\"hot\",\"x\",IF(AND(AO$6>$E79,AN$6<$F79),IF(AN$6>$E79,IF(AO$6>$F79,$U79/($F79-$E79)*($F79-AN$6),$U79/($F79-$E79)*(AO$6-AN$6)),$U79/($F79-$E79)*(AO$6-$E79)),\"x\")))","v":"x"},"x","x","x","x","x","x","x","x","x","x","x","x","x","x","x","x","x","x","x","x","x","x","x","x","x","x","x","x","x","x","x",{"$f":"IF(OR($V79=\"Utility\",$AA79=0),\"x\",IF($G79=\"hot\",\"x\",IF(AND(BU$6>$E79,BT$6<$F79),IF(BT$6>$E79,IF(BU$6>$F79,$U79/($F79-$E79)*($F79-BT$6),$U79/($F79-$E79)*(BU$6-BT$6)),$U79/($F79-$E79)*(BU$6-$E79)),\"x\")))","v":"x"},"x","x","x","x","x","x","x","x","x","x","x","x","x","x","x","x","x","x","x","x","x","x","x","x","x","x","x","x","x","x","x",{"$f":"IF(OR($V79=\"Utility\",$AA79=0),\"x\",IF($G79=\"hot\",\"x\",IF(AND(DA$6>$E79,CZ$6<$F79),IF(CZ$6>$E79,IF(DA$6>$F79,$U79/($F79-$E79)*($F79-CZ$6),$U79/($F79-$E79)*(DA$6-CZ$6)),$U79/($F79-$E79)*(DA$6-$E79)),\"x\")))","v":"x"},"x","x","x","x","x","x","x","x","x","x","x","x","x","x","x","x","x","x","x","x","x","x","x","x","x","x","x","x","x","x","x","x","x","x","x","x",null,null,null,0,null,{"$f":"IF(OR($V79=\"Utility\",$AA79=0),\"x\",IF($G79=\"cold\",\"x\",IF(AND(EQ$6>$F79,EP$6<$E79),IF(EP$6>$F79,IF(EQ$6>$E79,$U79/($E79-$F79)*($E79-EP$6),$U79/($E79-$F79)*(EQ$6-EP$6)),$U79/($E79-$F79)*(EQ$6-$F79)),\"x\")))","v":"x"},"x","x","x","x","x","x","x","x","x","x","x","x","x","x","x","x","x","x","x","x","x","x","x","x","x","x","x","x","x","x","x",{"$f":"IF(OR($V79=\"Utility\",$AA79=0),\"x\",IF($G79=\"cold\",\"x\",IF(AND(FW$6>$F79,FV$6<$E79),IF(FV$6>$F79,IF(FW$6>$E79,$U79/($E79-$F79)*($E79-FV$6),$U79/($E79-$F79)*(FW$6-FV$6)),$U79/($E79-$F79)*(FW$6-$F79)),\"x\")))","v":"x"},"x","x","x","x","x","x","x","x","x","x","x","x","x","x","x","x","x","x","x","x","x","x","x","x","x","x","x","x","x","x","x",{"$f":"IF(OR($V79=\"Utility\",$AA79=0),\"x\",IF($G79=\"cold\",\"x\",IF(AND(HC$6>$F79,HB$6<$E79),IF(HB$6>$F79,IF(HC$6>$E79,$U79/($E79-$F79)*($E79-HB$6),$U79/($E79-$F79)*(HC$6-HB$6)),$U79/($E79-$F79)*(HC$6-$F79)),\"x\")))","v":"x"},"x","x","x","x","x","x","x","x","x","x","x","x","x","x","x","x","x","x","x","x","x","x","x","x","x","x","x","x","x","x","x","x","x","x","x","x"]
["",{"$f":"IF(G82=\"hot\",COUNTIF($G$5:G82,\"hot\"),\"\")","v":""},{"$f":"IF(G82=\"cold\",COUNTIF($G$5:G82,\"cold\"),\"\")","v":""},null,null,null,"",null,null,"","","",null,null,null,null,null,null,null,null,"",null,"","","","","",null,null,null,null,null,null,null,null,null,null,null,0,null,{"$f":"IF(OR($V80=\"Utility\",$AA80=0),\"x\",IF($G80=\"hot\",\"x\",IF(AND(AO$6>$E80,AN$6<$F80),IF(AN$6>$E80,IF(AO$6>$F80,$U80/($F80-$E80)*($F80-AN$6),$U80/($F80-$E80)*(AO$6-AN$6)),$U80/($F80-$E80)*(AO$6-$E80)),\"x\")))","v":"x"},"x","x","x","x","x","x","x","x","x","x","x","x","x","x","x","x","x","x","x","x","x","x","x","x","x","x","x","x","x","x","x",{"$f":"IF(OR($V80=\"Utility\",$AA80=0),\"x\",IF($G80=\"hot\",\"x\",IF(AND(BU$6>$E80,BT$6<$F80),IF(BT$6>$E80,IF(BU$6>$F80,$U80/($F80-$E80)*($F80-BT$6),$U80/($F80-$E80)*(BU$6-BT$6)),$U80/($F80-$E80)*(BU$6-$E80)),\"x\")))","v":"x"},"x","x","x","x","x","x","x","x","x","x","x","x","x","x","x","x","x","x","x","x","x","x","x","x","x","x","x","x","x","x","x",{"$f":"IF(OR($V80=\"Utility\",$AA80=0),\"x\",IF($G80=\"hot\",\"x\",IF(AND(DA$6>$E80,CZ$6<$F80),IF(CZ$6>$E80,IF(DA$6>$F80,$U80/($F80-$E80)*($F80-CZ$6),$U80/($F80-$E80)*(DA$6-CZ$6)),$U80/($F80-$E80)*(DA$6-$E80)),\"x\")))","v":"x"},"x","x","x","x","x","x","x","x","x","x","x","x","x","x","x","x","x","x","x","x","x","x","x","x","x","x","x","x","x","x","x","x","x","x","x","x",null,null,null,0,null,{"$f":"IF(OR($V80=\"Utility\",$AA80=0),\"x\",IF($G80=\"cold\",\"x\",IF(AND(EQ$6>$F80,EP$6<$E80),IF(EP$6>$F80,IF(EQ$6>$E80,$U80/($E80-$F80)*($E80-EP$6),$U80/($E80-$F80)*(EQ$6-EP$6)),$U80/($E80-$F80)*(EQ$6-$F80)),\"x\")))","v":"x"},"x","x","x","x","x","x","x","x","x","x","x","x","x","x","x","x","x","x","x","x","x","x","x","x","x","x","x","x","x","x","x",{"$f":"IF(OR($V80=\"Utility\",$AA80=0),\"x\",IF($G80=\"cold\",\"x\",IF(AND(FW$6>$F80,FV$6<$E80),IF(FV$6>$F80,IF(FW$6>$E80,$U80/($E80-$F80)*($E80-FV$6),$U80/($E80-$F80)*(FW$6-FV$6)),$U80/($E80-$F80)*(FW$6-$F80)),\"x\")))","v":"x"},"x","x","x","x","x","x","x","x","x","x","x","x","x","x","x","x","x","x","x","x","x","x","x","x","x","x","x","x","x","x","x",{"$f":"IF(OR($V80=\"Utility\",$AA80=0),\"x\",IF($G80=\"cold\",\"x\",IF(AND(HC$6>$F80,HB$6<$E80),IF(HB$6>$F80,IF(HC$6>$E80,$U80/($E80-$F80)*($E80-HB$6),$U80/($E80-$F80)*(HC$6-HB$6)),$U80/($E80-$F80)*(HC$6-$F80)),\"x\")))","v":"x"},"x","x","x","x","x","x","x","x","x","x","x","x","x","x","x","x","x","x","x","x","x","x","x","x","x","x","x","x","x","x","x","x","x","x","x","x"]
[{"$f":"IF(D83=\"\",\"\",A82+1)","v":""},{"$f":"IF(G83=\"hot\",COUNTIF($G$5:G83,\"hot\"),\"\")","v":""},{"$f":"IF(G83=\"cold\",COUNTIF($G$5:G83,\"cold\"),\"\")","v":""},null,null,null,"",null,null,"","","",null,null,null,null,null,null,null,null,"",null,"","","","","",null,null,null,null,null,null,null,null,null,null,null,0,null,{"$f":"IF(OR($V81=\"Utility\",$AA81=0),\"x\",IF($G81=\"hot\",\"x\",IF(AND(AO$6>$E81,AN$6<$F81),IF(AN$6>$E81,IF(AO$6>$F81,$U81/($F81-$E81)*($F81-AN$6),$U81/($F81-$E81)*(AO$6-AN$6)),$U81/($F81-$E81)*(AO$6-$E81)),\"x\")))","v":"x"},"x","x","x","x","x","x","x","x","x","x","x","x","x","x","x","x","x","x","x","x","x","x","x","x","x","x","x","x","x","x","x",{"$f":"IF(OR($V81=\"Utility\",$AA81=0),\"x\",IF($G81=\"hot\",\"x\",IF(AND(BU$6>$E81,BT$6<$F81),IF(BT$6>$E81,IF(BU$6>$F81,$U81/($F81-$E81)*($F81-BT$6),$U81/($F81-$E81)*(BU$6-BT$6)),$U81/($F81-$E81)*(BU$6-$E81)),\"x\")))","v":"x"},"x","x","x","x","x","x","x","x","x","x","x","x","x","x","x","x","x","x","x","x","x","x","x","x","x","x","x","x","x","x","x",{"$f":"IF(OR($V81=\"Utility\",$AA81=0),\"x\",IF($G81=\"hot\",\"x\",IF(AND(DA$6>$E81,CZ$6<$F81),IF(CZ$6>$E81,IF(DA$6>$F81,$U81/($F81-$E81)*($F81-CZ$6),$U81/($F81-$E81)*(DA$6-CZ$6)),$U81/($F81-$E81)*(DA$6-$E81)),\"x\")))","v":"x"},"x","x","x","x","x","x","x","x","x","x","x","x","x","x","x","x","x","x","x","x","x","x","x","x","x","x","x","x","x","x","x","x","x","x","x","x",null,null,null,0,null,{"$f":"IF(OR($V81=\"Utility\",$AA81=0),\"x\",IF($G81=\"cold\",\"x\",IF(AND(EQ$6>$F81,EP$6<$E81),IF(EP$6>$F81,IF(EQ$6>$E81,$U81/($E81-$F81)*($E81-EP$6),$U81/($E81-$F81)*(EQ$6-EP$6)),$U81/($E81-$F81)*(EQ$6-$F81)),\"x\")))","v":"x"},"x","x","x","x","x","x","x","x","x","x","x","x","x","x","x","x","x","x","x","x","x","x","x","x","x","x","x","x","x","x","x",{"$f":"IF(OR($V81=\"Utility\",$AA81=0),\"x\",IF($G81=\"cold\",\"x\",IF(AND(FW$6>$F81,FV$6<$E81),IF(FV$6>$F81,IF(FW$6>$E81,$U81/($E81-$F81)*($E81-FV$6),$U81/($E81-$F81)*(FW$6-FV$6)),$U81/($E81-$F81)*(FW$6-$F81)),\"x\")))","v":"x"},"x","x","x","x","x","x","x","x","x","x","x","x","x","x","x","x","x","x","x","x","x","x","x","x","x","x","x","x","x","x","x",{"$f":"IF(OR($V81=\"Utility\",$AA81=0),\"x\",IF($G81=\"cold\",\"x\",IF(AND(HC$6>$F81,HB$6<$E81),IF(HB$6>$F81,IF(HC$6>$E81,$U81/($E81-$F81)*($E81-HB$6),$U81/($E81-$F81)*(HC$6-HB$6)),$U81/($E81-$F81)*(HC$6-$F81)),\"x\")))","v":"x"},"x","x","x","x","x","x","x","x","x","x","x","x","x","x","x","x","x","x","x","x","x","x","x","x","x","x","x","x","x","x","x","x","x","x","x","x"]
["",{"$f":"IF(G84=\"hot\",COUNTIF($G$5:G84,\"hot\"),\"\")","v":""},{"$f":"IF(G84=\"cold\",COUNTIF($G$5:G84,\"cold\"),\"\")","v":""},null,null,null,"",null,null,"","","",null,null,null,null,null,null,null,null,"",null,"","","","","",null,null,null,null,null,null,null,null,null,null,null,0,null,{"$f":"IF(OR($V82=\"Utility\",$AA82=0),\"x\",IF($G82=\"hot\",\"x\",IF(AND(AO$6>$E82,AN$6<$F82),IF(AN$6>$E82,IF(AO$6>$F82,$U82/($F82-$E82)*($F82-AN$6),$U82/($F82-$E82)*(AO$6-AN$6)),$U82/($F82-$E82)*(AO$6-$E82)),\"x\")))","v":"x"},"x","x","x","x","x","x","x","x","x","x","x","x","x","x","x","x","x","x","x","x","x","x","x","x","x","x","x","x","x","x","x",{"$f":"IF(OR($V82=\"Utility\",$AA82=0),\"x\",IF($G82=\"hot\",\"x\",IF(AND(BU$6>$E82,BT$6<$F82),IF(BT$6>$E82,IF(BU$6>$F82,$U82/($F82-$E82)*($F82-BT$6),$U82/($F82-$E82)*(BU$6-BT$6)),$U82/($F82-$E82)*(BU$6-$E82)),\"x\")))","v":"x"},"x","x","x","x","x","x","x","x","x","x","x","x","x","x","x","x","x","x","x","x","x","x","x","x","x","x","x","x","x","x","x",{"$f":"IF(OR($V82=\"Utility\",$AA82=0),\"x\",IF($G82=\"hot\",\"x\",IF(AND(DA$6>$E82,CZ$6<$F82),IF(CZ$6>$E82,IF(DA$6>$F82,$U82/($F82-$E82)*($F82-CZ$6),$U82/($F82-$E82)*(DA$6-CZ$6)),$U82/($F82-$E82)*(DA$6-$E82)),\"x\")))","v":"x"},"x","x","x","x","x","x","x","x","x","x","x","x","x","x","x","x","x","x","x","x","x","x","x","x","x","x","x","x","x","x","x","x","x","x","x","x",null,null,null,0,null,{"$f":"IF(OR($V82=\"Utility\",$AA82=0),\"x\",IF($G82=\"cold\",\"x\",IF(AND(EQ$6>$F82,EP$6<$E82),IF(EP$6>$F82,IF(EQ$6>$E82,$U82/($E82-$F82)*($E82-EP$6),$U82/($E82-$F82)*(EQ$6-EP$6)),$U82/($E82-$F82)*(EQ$6-$F82)),\"x\")))","v":"x"},"x","x","x","x","x","x","x","x","x","x","x","x","x","x","x","x","x","x","x","x","x","x","x","x","x","x","x","x","x","x","x",{"$f":"IF(OR($V82=\"Utility\",$AA82=0),\"x\",IF($G82=\"cold\",\"x\",IF(AND(FW$6>$F82,FV$6<$E82),IF(FV$6>$F82,IF(FW$6>$E82,$U82/($E82-$F82)*($E82-FV$6),$U82/($E82-$F82)*(FW$6-FV$6)),$U82/($E82-$F82)*(FW$6-$F82)),\"x\")))","v":"x"},"x","x","x","x","x","x","x","x","x","x","x","x","x","x","x","x","x","x","x","x","x","x","x","x","x","x","x","x","x","x","x",{"$f":"IF(OR($V82=\"Utility\",$AA82=0),\"x\",IF($G82=\"cold\",\"x\",IF(AND(HC$6>$F82,HB$6<$E82),IF(HB$6>$F82,IF(HC$6>$E82,$U82/($E82-$F82)*($E82-HB$6),$U82/($E82-$F82)*(HC$6-HB$6)),$U82/($E82-$F82)*(HC$6-$F82)),\"x\")))","v":"x"},"x","x","x","x","x","x","x","x","x","x","x","x","x","x","x","x","x","x","x","x","x","x","x","x","x","x","x","x","x","x","x","x","x","x","x","x"]
["",{"$f":"IF(G85=\"hot\",COUNTIF($G$5:G85,\"hot\"),\"\")","v":""},{"$f":"IF(G85=\"cold\",COUNTIF($G$5:G85,\"cold\"),\"\")","v":""},null,null,null,"",null,null,"","","",null,null,null,null,null,null,null,null,"",null,"","","","","",null,null,null,null,null,null,null,null,null,null,null,0,null,{"$f":"IF(OR($V83=\"Utility\",$AA83=0),\"x\",IF($G83=\"hot\",\"x\",IF(AND(AO$6>$E83,AN$6<$F83),IF(AN$6>$E83,IF(AO$6>$F83,$U83/($F83-$E83)*($F83-AN$6),$U83/($F83-$E83)*(AO$6-AN$6)),$U83/($F83-$E83)*(AO$6-$E83)),\"x\")))","v":"x"},"x","x","x","x","x","x","x","x","x","x","x","x","x","x","x","x","x","x","x","x","x","x","x","x","x","x","x","x","x","x","x",{"$f":"IF(OR($V83=\"Utility\",$AA83=0),\"x\",IF($G83=\"hot\",\"x\",IF(AND(BU$6>$E83,BT$6<$F83),IF(BT$6>$E83,IF(BU$6>$F83,$U83/($F83-$E83)*($F83-BT$6),$U83/($F83-$E83)*(BU$6-BT$6)),$U83/($F83-$E83)*(BU$6-$E83)),\"x\")))","v":"x"},"x","x","x","x","x","x","x","x","x","x","x","x","x","x","x","x","x","x","x","x","x","x","x","x","x","x","x","x","x","x","x",{"$f":"IF(OR($V83=\"Utility\",$AA83=0),\"x\",IF($G83=\"hot\",\"x\",IF(AND(DA$6>$E83,CZ$6<$F83),IF(CZ$6>$E83,IF(DA$6>$F83,$U83/($F83-$E83)*($F83-CZ$6),$U83/($F83-$E83)*(DA$6-CZ$6)),$U83/($F83-$E83)*(DA$6-$E83)),\"x\")))","v":"x"},"x","x","x","x","x","x","x","x","x","x","x","x","x","x","x","x","x","x","x","x","x","x","x","x","x","x","x","x","x","x","x","x","x","x","x","x",null,null,null,0,null,{"$f":"IF(OR($V83=\"Utility\",$AA83=0),\"x\",IF($G83=\"cold\",\"x\",IF(AND(EQ$6>$F83,EP$6<$E83),IF(EP$6>$F83,IF(EQ$6>$E83,$U83/($E83-$F83)*($E83-EP$6),$U83/($E83-$F83)*(EQ$6-EP$6)),$U83/($E83-$F83)*(EQ$6-$F83)),\"x\")))","v":"x"},"x","x","x","x","x","x","x","x","x","x","x","x","x","x","x","x","x","x","x","x","x","x","x","x","x","x","x","x","x","x","x",{"$f":"IF(OR($V83=\"Utility\",$AA83=0),\"x\",IF($G83=\"cold\",\"x\",IF(AND(FW$6>$F83,FV$6<$E83),IF(FV$6>$F83,IF(FW$6>$E83,$U83/($E83-$F83)*($E83-FV$6),$U83/($E83-$F83)*(FW$6-FV$6)),$U83/($E83-$F83)*(FW$6-$F83)),\"x\")))","v":"x"},"x","x","x","x","x","x","x","x","x","x","x","x","x","x","x","x","x","x","x","x","x","x","x","x","x","x","x","x","x","x","x",{"$f":"IF(OR($V83=\"Utility\",$AA83=0),\"x\",IF($G83=\"cold\",\"x\",IF(AND(HC$6>$F83,HB$6<$E83),IF(HB$6>$F83,IF(HC$6>$E83,$U83/($E83-$F83)*($E83-HB$6),$U83/($E83-$F83)*(HC$6-HB$6)),$U83/($E83-$F83)*(HC$6-$F83)),\"x\")))","v":"x"},"x","x","x","x","x","x","x","x","x","x","x","x","x","x","x","x","x","x","x","x","x","x","x","x","x","x","x","x","x","x","x","x","x","x","x","x"]
["",{"$f":"IF(G86=\"hot\",COUNTIF($G$5:G86,\"hot\"),\"\")","v":""},{"$f":"IF(G86=\"cold\",COUNTIF($G$5:G86,\"cold\"),\"\")","v":""},null,null,null,"",null,null,"","","",null,null,null,null,null,null,null,null,"",null,"","","","","",null,null,null,null,null,null,null,null,null,null,null,0,null,{"$f":"IF(OR($V84=\"Utility\",$AA84=0),\"x\",IF($G84=\"hot\",\"x\",IF(AND(AO$6>$E84,AN$6<$F84),IF(AN$6>$E84,IF(AO$6>$F84,$U84/($F84-$E84)*($F84-AN$6),$U84/($F84-$E84)*(AO$6-AN$6)),$U84/($F84-$E84)*(AO$6-$E84)),\"x\")))","v":"x"},"x","x","x","x","x","x","x","x","x","x","x","x","x","x","x","x","x","x","x","x","x","x","x","x","x","x","x","x","x","x","x",{"$f":"IF(OR($V84=\"Utility\",$AA84=0),\"x\",IF($G84=\"hot\",\"x\",IF(AND(BU$6>$E84,BT$6<$F84),IF(BT$6>$E84,IF(BU$6>$F84,$U84/($F84-$E84)*($F84-BT$6),$U84/($F84-$E84)*(BU$6-BT$6)),$U84/($F84-$E84)*(BU$6-$E84)),\"x\")))","v":"x"},"x","x","x","x","x","x","x","x","x","x","x","x","x","x","x","x","x","x","x","x","x","x","x","x","x","x","x","x","x","x","x",{"$f":"IF(OR($V84=\"Utility\",$AA84=0),\"x\",IF($G84=\"hot\",\"x\",IF(AND(DA$6>$E84,CZ$6<$F84),IF(CZ$6>$E84,IF(DA$6>$F84,$U84/($F84-$E84)*($F84-CZ$6),$U84/($F84-$E84)*(DA$6-CZ$6)),$U84/($F84-$E84)*(DA$6-$E84)),\"x\")))","v":"x"},"x","x","x","x","x","x","x","x","x","x","x","x","x","x","x","x","x","x","x","x","x","x","x","x","x","x","x","x","x","x","x","x","x","x","x","x",null,null,null,0,null,{"$f":"IF(OR($V84=\"Utility\",$AA84=0),\"x\",IF($G84=\"cold\",\"x\",IF(AND(EQ$6>$F84,EP$6<$E84),IF(EP$6>$F84,IF(EQ$6>$E84,$U84/($E84-$F84)*($E84-EP$6),$U84/($E84-$F84)*(EQ$6-EP$6)),$U84/($E84-$F84)*(EQ$6-$F84)),\"x\")))","v":"x"},"x","x","x","x","x","x","x","x","x","x","x","x","x","x","x","x","x","x","x","x","x","x","x","x","x","x","x","x","x","x","x",{"$f":"IF(OR($V84=\"Utility\",$AA84=0),\"x\",IF($G84=\"cold\",\"x\",IF(AND(FW$6>$F84,FV$6<$E84),IF(FV$6>$F84,IF(FW$6>$E84,$U84/($E84-$F84)*($E84-FV$6),$U84/($E84-$F84)*(FW$6-FV$6)),$U84/($E84-$F84)*(FW$6-$F84)),\"x\")))","v":"x"},"x","x","x","x","x","x","x","x","x","x","x","x","x","x","x","x","x","x","x","x","x","x","x","x","x","x","x","x","x","x","x",{"$f":"IF(OR($V84=\"Utility\",$AA84=0),\"x\",IF($G84=\"cold\",\"x\",IF(AND(HC$6>$F84,HB$6<$E84),IF(HB$6>$F84,IF(HC$6>$E84,$U84/($E84-$F84)*($E84-HB$6),$U84/($E84-$F84)*(HC$6-HB$6)),$U84/($E84-$F84)*(HC$6-$F84)),\"x\")))","v":"x"},"x","x","x","x","x","x","x","x","x","x","x","x","x","x","x","x","x","x","x","x","x","x","x","x","x","x","x","x","x","x","x","x","x","x","x","x"]
["",{"$f":"IF(G87=\"hot\",COUNTIF($G$5:G87,\"hot\"),\"\")","v":""},{"$f":"IF(G87=\"cold\",COUNTIF($G$5:G87,\"cold\"),\"\")","v":""},null,null,null,"",null,null,"","","",null,null,null,null,null,null,null,null,"",null,"","","","","",null,null,null,null,null,null,null,null,null,null,null,0,null,{"$f":"IF(OR($V85=\"Utility\",$AA85=0),\"x\",IF($G85=\"hot\",\"x\",IF(AND(AO$6>$E85,AN$6<$F85),IF(AN$6>$E85,IF(AO$6>$F85,$U85/($F85-$E85)*($F85-AN$6),$U85/($F85-$E85)*(AO$6-AN$6)),$U85/($F85-$E85)*(AO$6-$E85)),\"x\")))","v":"x"},"x","x","x","x","x","x","x","x","x","x","x","x","x","x","x","x","x","x","x","x","x","x","x","x","x","x","x","x","x","x","x",{"$f":"IF(OR($V85=\"Utility\",$AA85=0),\"x\",IF($G85=\"hot\",\"x\",IF(AND(BU$6>$E85,BT$6<$F85),IF(BT$6>$E85,IF(BU$6>$F85,$U85/($F85-$E85)*($F85-BT$6),$U85/($F85-$E85)*(BU$6-BT$6)),$U85/($F85-$E85)*(BU$6-$E85)),\"x\")))","v":"x"},"x","x","x","x","x","x","x","x","x","x","x","x","x","x","x","x","x","x","x","x","x","x","x","x","x","x","x","x","x","x","x",{"$f":"IF(OR($V85=\"Utility\",$AA85=0),\"x\",IF($G85=\"hot\",\"x\",IF(AND(DA$6>$E85,CZ$6<$F85),IF(CZ$6>$E85,IF(DA$6>$F85,$U85/($F85-$E85)*($F85-CZ$6),$U85/($F85-$E85)*(DA$6-CZ$6)),$U85/($F85-$E85)*(DA$6-$E85)),\"x\")))","v":"x"},"x","x","x","x","x","x","x","x","x","x","x","x","x","x","x","x","x","x","x","x","x","x","x","x","x","x","x","x","x","x","x","x","x","x","x","x",null,null,null,0,null,{"$f":"IF(OR($V85=\"Utility\",$AA85=0),\"x\",IF($G85=\"cold\",\"x\",IF(AND(EQ$6>$F85,EP$6<$E85),IF(EP$6>$F85,IF(EQ$6>$E85,$U85/($E85-$F85)*($E85-EP$6),$U85/($E85-$F85)*(EQ$6-EP$6)),$U85/($E85-$F85)*(EQ$6-$F85)),\"x\")))","v":"x"},"x","x","x","x","x","x","x","x","x","x","x","x","x","x","x","x","x","x","x","x","x","x","x","x","x","x","x","x","x","x","x",{"$f":"IF(OR($V85=\"Utility\",$AA85=0),\"x\",IF($G85=\"cold\",\"x\",IF(AND(FW$6>$F85,FV$6<$E85),IF(FV$6>$F85,IF(FW$6>$E85,$U85/($E85-$F85)*($E85-FV$6),$U85/($E85-$F85)*(FW$6-FV$6)),$U85/($E85-$F85)*(FW$6-$F85)),\"x\")))","v":"x"},"x","x","x","x","x","x","x","x","x","x","x","x","x","x","x","x","x","x","x","x","x","x","x","x","x","x","x","x","x","x","x",{"$f":"IF(OR($V85=\"Utility\",$AA85=0),\"x\",IF($G85=\"cold\",\"x\",IF(AND(HC$6>$F85,HB$6<$E85),IF(HB$6>$F85,IF(HC$6>$E85,$U85/($E85-$F85)*($E85-HB$6),$U85/($E85-$F85)*(HC$6-HB$6)),$U85/($E85-$F85)*(HC$6-$F85)),\"x\")))","v":"x"},"x","x","x","x","x","x","x","x","x","x","x","x","x","x","x","x","x","x","x","x","x","x","x","x","x","x","x","x","x","x","x","x","x","x","x","x"]
["",{"$f":"IF(G88=\"hot\",COUNTIF($G$5:G88,\"hot\"),\"\")","v":""},{"$f":"IF(G88=\"cold\",COUNTIF($G$5:G88,\"cold\"),\"\")","v":""},null,null,null,"",null,null,"","","",null,null,null,null,null,null,null,null,"",null,"","","","","",null,null,null,null,null,null,null,null,null,null,null,0,null,{"$f":"IF(OR($V86=\"Utility\",$AA86=0),\"x\",IF($G86=\"hot\",\"x\",IF(AND(AO$6>$E86,AN$6<$F86),IF(AN$6>$E86,IF(AO$6>$F86,$U86/($F86-$E86)*($F86-AN$6),$U86/($F86-$E86)*(AO$6-AN$6)),$U86/($F86-$E86)*(AO$6-$E86)),\"x\")))","v":"x"},"x","x","x","x","x","x","x","x","x","x","x","x","x","x","x","x","x","x","x","x","x","x","x","x","x","x","x","x","x","x","x",{"$f":"IF(OR($V86=\"Utility\",$AA86=0),\"x\",IF($G86=\"hot\",\"x\",IF(AND(BU$6>$E86,BT$6<$F86),IF(BT$6>$E86,IF(BU$6>$F86,$U86/($F86-$E86)*($F86-BT$6),$U86/($F86-$E86)*(BU$6-BT$6)),$U86/($F86-$E86)*(BU$6-$E86)),\"x\")))","v":"x"},"x","x","x","x","x","x","x","x","x","x","x","x","x","x","x","x","x","x","x","x","x","x","x","x","x","x","x","x","x","x","x",{"$f":"IF(OR($V86=\"Utility\",$AA86=0),\"x\",IF($G86=\"hot\",\"x\",IF(AND(DA$6>$E86,CZ$6<$F86),IF(CZ$6>$E86,IF(DA$6>$F86,$U86/($F86-$E86)*($F86-CZ$6),$U86/($F86-$E86)*(DA$6-CZ$6)),$U86/($F86-$E86)*(DA$6-$E86)),\"x\")))","v":"x"},"x","x","x","x","x","x","x","x","x","x","x","x","x","x","x","x","x","x","x","x","x","x","x","x","x","x","x","x","x","x","x","x","x","x","x","x",null,null,null,0,null,{"$f":"IF(OR($V86=\"Utility\",$AA86=0),\"x\",IF($G86=\"cold\",\"x\",IF(AND(EQ$6>$F86,EP$6<$E86),IF(EP$6>$F86,IF(EQ$6>$E86,$U86/($E86-$F86)*($E86-EP$6),$U86/($E86-$F86)*(EQ$6-EP$6)),$U86/($E86-$F86)*(EQ$6-$F86)),\"x\")))","v":"x"},"x","x","x","x","x","x","x","x","x","x","x","x","x","x","x","x","x","x","x","x","x","x","x","x","x","x","x","x","x","x","x",{"$f":"IF(OR($V86=\"Utility\",$AA86=0),\"x\",IF($G86=\"cold\",\"x\",IF(AND(FW$6>$F86,FV$6<$E86),IF(FV$6>$F86,IF(FW$6>$E86,$U86/($E86-$F86)*($E86-FV$6),$U86/($E86-$F86)*(FW$6-FV$6)),$U86/($E86-$F86)*(FW$6-$F86)),\"x\")))","v":"x"},"x","x","x","x","x","x","x","x","x","x","x","x","x","x","x","x","x","x","x","x","x","x","x","x","x","x","x","x","x","x","x",{"$f":"IF(OR($V86=\"Utility\",$AA86=0),\"x\",IF($G86=\"cold\",\"x\",IF(AND(HC$6>$F86,HB$6<$E86),IF(HB$6>$F86,IF(HC$6>$E86,$U86/($E86-$F86)*($E86-HB$6),$U86/($E86-$F86)*(HC$6-HB$6)),$U86/($E86-$F86)*(HC$6-$F86)),\"x\")))","v":"x"},"x","x","x","x","x","x","x","x","x","x","x","x","x","x","x","x","x","x","x","x","x","x","x","x","x","x","x","x","x","x","x","x","x","x","x","x"]
["",{"$f":"IF(G89=\"hot\",COUNTIF($G$5:G89,\"hot\"),\"\")","v":""},{"$f":"IF(G89=\"cold\",COUNTIF($G$5:G89,\"cold\"),\"\")","v":""},null,null,null,"",null,null,"","","",null,null,null,null,null,null,null,null,"",null,"","","","","",null,null,null,null,null,null,null,null,null,null,null,0,null,{"$f":"IF(OR($V87=\"Utility\",$AA87=0),\"x\",IF($G87=\"hot\",\"x\",IF(AND(AO$6>$E87,AN$6<$F87),IF(AN$6>$E87,IF(AO$6>$F87,$U87/($F87-$E87)*($F87-AN$6),$U87/($F87-$E87)*(AO$6-AN$6)),$U87/($F87-$E87)*(AO$6-$E87)),\"x\")))","v":"x"},"x","x","x","x","x","x","x","x","x","x","x","x","x","x","x","x","x","x","x","x","x","x","x","x","x","x","x","x","x","x","x",{"$f":"IF(OR($V87=\"Utility\",$AA87=0),\"x\",IF($G87=\"hot\",\"x\",IF(AND(BU$6>$E87,BT$6<$F87),IF(BT$6>$E87,IF(BU$6>$F87,$U87/($F87-$E87)*($F87-BT$6),$U87/($F87-$E87)*(BU$6-BT$6)),$U87/($F87-$E87)*(BU$6-$E87)),\"x\")))","v":"x"},"x","x","x","x","x","x","x","x","x","x","x","x","x","x","x","x","x","x","x","x","x","x","x","x","x","x","x","x","x","x","x",{"$f":"IF(OR($V87=\"Utility\",$AA87=0),\"x\",IF($G87=\"hot\",\"x\",IF(AND(DA$6>$E87,CZ$6<$F87),IF(CZ$6>$E87,IF(DA$6>$F87,$U87/($F87-$E87)*($F87-CZ$6),$U87/($F87-$E87)*(DA$6-CZ$6)),$U87/($F87-$E87)*(DA$6-$E87)),\"x\")))","v":"x"},"x","x","x","x","x","x","x","x","x","x","x","x","x","x","x","x","x","x","x","x","x","x","x","x","x","x","x","x","x","x","x","x","x","x","x","x",null,null,null,0,null,{"$f":"IF(OR($V87=\"Utility\",$AA87=0),\"x\",IF($G87=\"cold\",\"x\",IF(AND(EQ$6>$F87,EP$6<$E87),IF(EP$6>$F87,IF(EQ$6>$E87,$U87/($E87-$F87)*($E87-EP$6),$U87/($E87-$F87)*(EQ$6-EP$6)),$U87/($E87-$F87)*(EQ$6-$F87)),\"x\")))","v":"x"},"x","x","x","x","x","x","x","x","x","x","x","x","x","x","x","x","x","x","x","x","x","x","x","x","x","x","x","x","x","x","x",{"$f":"IF(OR($V87=\"Utility\",$AA87=0),\"x\",IF($G87=\"cold\",\"x\",IF(AND(FW$6>$F87,FV$6<$E87),IF(FV$6>$F87,IF(FW$6>$E87,$U87/($E87-$F87)*($E87-FV$6),$U87/($E87-$F87)*(FW$6-FV$6)),$U87/($E87-$F87)*(FW$6-$F87)),\"x\")))","v":"x"},"x","x","x","x","x","x","x","x","x","x","x","x","x","x","x","x","x","x","x","x","x","x","x","x","x","x","x","x","x","x","x",{"$f":"IF(OR($V87=\"Utility\",$AA87=0),\"x\",IF($G87=\"cold\",\"x\",IF(AND(HC$6>$F87,HB$6<$E87),IF(HB$6>$F87,IF(HC$6>$E87,$U87/($E87-$F87)*($E87-HB$6),$U87/($E87-$F87)*(HC$6-HB$6)),$U87/($E87-$F87)*(HC$6-$F87)),\"x\")))","v":"x"},"x","x","x","x","x","x","x","x","x","x","x","x","x","x","x","x","x","x","x","x","x","x","x","x","x","x","x","x","x","x","x","x","x","x","x","x"]
["",{"$f":"IF(G90=\"hot\",COUNTIF($G$5:G90,\"hot\"),\"\")","v":""},{"$f":"IF(G90=\"cold\",COUNTIF($G$5:G90,\"cold\"),\"\")","v":""},null,null,null,"",null,null,"","","",null,null,null,null,null,null,null,null,"",null,"","","","","",null,null,null,null,null,null,null,null,null,null,null,0,null,{"$f":"IF(OR($V88=\"Utility\",$AA88=0),\"x\",IF($G88=\"hot\",\"x\",IF(AND(AO$6>$E88,AN$6<$F88),IF(AN$6>$E88,IF(AO$6>$F88,$U88/($F88-$E88)*($F88-AN$6),$U88/($F88-$E88)*(AO$6-AN$6)),$U88/($F88-$E88)*(AO$6-$E88)),\"x\")))","v":"x"},"x","x","x","x","x","x","x","x","x","x","x","x","x","x","x","x","x","x","x","x","x","x","x","x","x","x","x","x","x","x","x",{"$f":"IF(OR($V88=\"Utility\",$AA88=0),\"x\",IF($G88=\"hot\",\"x\",IF(AND(BU$6>$E88,BT$6<$F88),IF(BT$6>$E88,IF(BU$6>$F88,$U88/($F88-$E88)*($F88-BT$6),$U88/($F88-$E88)*(BU$6-BT$6)),$U88/($F88-$E88)*(BU$6-$E88)),\"x\")))","v":"x"},"x","x","x","x","x","x","x","x","x","x","x","x","x","x","x","x","x","x","x","x","x","x","x","x","x","x","x","x","x","x","x",{"$f":"IF(OR($V88=\"Utility\",$AA88=0),\"x\",IF($G88=\"hot\",\"x\",IF(AND(DA$6>$E88,CZ$6<$F88),IF(CZ$6>$E88,IF(DA$6>$F88,$U88/($F88-$E88)*($F88-CZ$6),$U88/($F88-$E88)*(DA$6-CZ$6)),$U88/($F88-$E88)*(DA$6-$E88)),\"x\")))","v":"x"},"x","x","x","x","x","x","x","x","x","x","x","x","x","x","x","x","x","x","x","x","x","x","x","x","x","x","x","x","x","x","x","x","x","x","x","x",null,null,null,0,null,{"$f":"IF(OR($V88=\"Utility\",$AA88=0),\"x\",IF($G88=\"cold\",\"x\",IF(AND(EQ$6>$F88,EP$6<$E88),IF(EP$6>$F88,IF(EQ$6>$E88,$U88/($E88-$F88)*($E88-EP$6),$U88/($E88-$F88)*(EQ$6-EP$6)),$U88/($E88-$F88)*(EQ$6-$F88)),\"x\")))","v":"x"},"x","x","x","x","x","x","x","x","x","x","x","x","x","x","x","x","x","x","x","x","x","x","x","x","x","x","x","x","x","x","x",{"$f":"IF(OR($V88=\"Utility\",$AA88=0),\"x\",IF($G88=\"cold\",\"x\",IF(AND(FW$6>$F88,FV$6<$E88),IF(FV$6>$F88,IF(FW$6>$E88,$U88/($E88-$F88)*($E88-FV$6),$U88/($E88-$F88)*(FW$6-FV$6)),$U88/($E88-$F88)*(FW$6-$F88)),\"x\")))","v":"x"},"x","x","x","x","x","x","x","x","x","x","x","x","x","x","x","x","x","x","x","x","x","x","x","x","x","x","x","x","x","x","x",{"$f":"IF(OR($V88=\"Utility\",$AA88=0),\"x\",IF($G88=\"cold\",\"x\",IF(AND(HC$6>$F88,HB$6<$E88),IF(HB$6>$F88,IF(HC$6>$E88,$U88/($E88-$F88)*($E88-HB$6),$U88/($E88-$F88)*(HC$6-HB$6)),$U88/($E88-$F88)*(HC$6-$F88)),\"x\")))","v":"x"},"x","x","x","x","x","x","x","x","x","x","x","x","x","x","x","x","x","x","x","x","x","x","x","x","x","x","x","x","x","x","x","x","x","x","x","x"]
["",{"$f":"IF(G91=\"hot\",COUNTIF($G$5:G91,\"hot\"),\"\")","v":""},{"$f":"IF(G91=\"cold\",COUNTIF($G$5:G91,\"cold\"),\"\")","v":""},null,null,null,"",null,null,"","","",null,null,null,null,null,null,null,null,"",null,"","","","","",null,null,null,null,null,null,null,null,null,null,null,0,null,{"$f":"IF(OR($V89=\"Utility\",$AA89=0),\"x\",IF($G89=\"hot\",\"x\",IF(AND(AO$6>$E89,AN$6<$F89),IF(AN$6>$E89,IF(AO$6>$F89,$U89/($F89-$E89)*($F89-AN$6),$U89/($F89-$E89)*(AO$6-AN$6)),$U89/($F89-$E89)*(AO$6-$E89)),\"x\")))","v":"x"},"x","x","x","x","x","x","x","x","x","x","x","x","x","x","x","x","x","x","x","x","x","x","x","x","x","x","x","x","x","x","x",{"$f":"IF(OR($V89=\"Utility\",$AA89=0),\"x\",IF($G89=\"hot\",\"x\",IF(AND(BU$6>$E89,BT$6<$F89),IF(BT$6>$E89,IF(BU$6>$F89,$U89/($F89-$E89)*($F89-BT$6),$U89/($F89-$E89)*(BU$6-BT$6)),$U89/($F89-$E89)*(BU$6-$E89)),\"x\")))","v":"x"},"x","x","x","x","x","x","x","x","x","x","x","x","x","x","x","x","x","x","x","x","x","x","x","x","x","x","x","x","x","x","x",{"$f":"IF(OR($V89=\"Utility\",$AA89=0),\"x\",IF($G89=\"hot\",\"x\",IF(AND(DA$6>$E89,CZ$6<$F89),IF(CZ$6>$E89,IF(DA$6>$F89,$U89/($F89-$E89)*($F89-CZ$6),$U89/($F89-$E89)*(DA$6-CZ$6)),$U89/($F89-$E89)*(DA$6-$E89)),\"x\")))","v":"x"},"x","x","x","x","x","x","x","x","x","x","x","x","x","x","x","x","x","x","x","x","x","x","x","x","x","x","x","x","x","x","x","x","x","x","x","x",null,null,null,0,null,{"$f":"IF(OR($V89=\"Utility\",$AA89=0),\"x\",IF($G89=\"cold\",\"x\",IF(AND(EQ$6>$F89,EP$6<$E89),IF(EP$6>$F89,IF(EQ$6>$E89,$U89/($E89-$F89)*($E89-EP$6),$U89/($E89-$F89)*(EQ$6-EP$6)),$U89/($E89-$F89)*(EQ$6-$F89)),\"x\")))","v":"x"},"x","x","x","x","x","x","x","x","x","x","x","x","x","x","x","x","x","x","x","x","x","x","x","x","x","x","x","x","x","x","x",{"$f":"IF(OR($V89=\"Utility\",$AA89=0),\"x\",IF($G89=\"cold\",\"x\",IF(AND(FW$6>$F89,FV$6<$E89),IF(FV$6>$F89,IF(FW$6>$E89,$U89/($E89-$F89)*($E89-FV$6),$U89/($E89-$F89)*(FW$6-FV$6)),$U89/($E89-$F89)*(FW$6-$F89)),\"x\")))","v":"x"},"x","x","x","x","x","x","x","x","x","x","x","x","x","x","x","x","x","x","x","x","x","x","x","x","x","x","x","x","x","x","x",{"$f":"IF(OR($V89=\"Utility\",$AA89=0),\"x\",IF($G89=\"cold\",\"x\",IF(AND(HC$6>$F89,HB$6<$E89),IF(HB$6>$F89,IF(HC$6>$E89,$U89/($E89-$F89)*($E89-HB$6),$U89/($E89-$F89)*(HC$6-HB$6)),$U89/($E89-$F89)*(HC$6-$F89)),\"x\")))","v":"x"},"x","x","x","x","x","x","x","x","x","x","x","x","x","x","x","x","x","x","x","x","x","x","x","x","x","x","x","x","x","x","x","x","x","x","x","x"]
["",{"$f":"IF(G92=\"hot\",COUNTIF($G$5:G92,\"hot\"),\"\")","v":""},{"$f":"IF(G92=\"cold\",COUNTIF($G$5:G92,\"cold\"),\"\")","v":""},null,null,null,"",null,null,"","","",null,null,null,null,null,null,null,null,"",null,"","","","","",null,null,null,null,null,null,null,null,null,null,null,0,null,{"$f":"IF(OR($V90=\"Utility\",$AA90=0),\"x\",IF($G90=\"hot\",\"x\",IF(AND(AO$6>$E90,AN$6<$F90),IF(AN$6>$E90,IF(AO$6>$F90,$U90/($F90-$E90)*($F90-AN$6),$U90/($F90-$E90)*(AO$6-AN$6)),$U90/($F90-$E90)*(AO$6-$E90)),\"x\")))","v":"x"},"x","x","x","x","x","x","x","x","x","x","x","x","x","x","x","x","x","x","x","x","x","x","x","x","x","x","x","x","x","x","x",{"$f":"IF(OR($V90=\"Utility\",$AA90=0),\"x\",IF($G90=\"hot\",\"x\",IF(AND(BU$6>$E90,BT$6<$F90),IF(BT$6>$E90,IF(BU$6>$F90,$U90/($F90-$E90)*($F90-BT$6),$U90/($F90-$E90)*(BU$6-BT$6)),$U90/($F90-$E90)*(BU$6-$E90)),\"x\")))","v":"x"},"x","x","x","x","x","x","x","x","x","x","x","x","x","x","x","x","x","x","x","x","x","x","x","x","x","x","x","x","x","x","x",{"$f":"IF(OR($V90=\"Utility\",$AA90=0),\"x\",IF($G90=\"hot\",\"x\",IF(AND(DA$6>$E90,CZ$6<$F90),IF(CZ$6>$E90,IF(DA$6>$F90,$U90/($F90-$E90)*($F90-CZ$6),$U90/($F90-$E90)*(DA$6-CZ$6)),$U90/($F90-$E90)*(DA$6-$E90)),\"x\")))","v":"x"},"x","x","x","x","x","x","x","x","x","x","x","x","x","x","x","x","x","x","x","x","x","x","x","x","x","x","x","x","x","x","x","x","x","x","x","x",null,null,null,0,null,{"$f":"IF(OR($V90=\"Utility\",$AA90=0),\"x\",IF($G90=\"cold\",\"x\",IF(AND(EQ$6>$F90,EP$6<$E90),IF(EP$6>$F90,IF(EQ$6>$E90,$U90/($E90-$F90)*($E90-EP$6),$U90/($E90-$F90)*(EQ$6-EP$6)),$U90/($E90-$F90)*(EQ$6-$F90)),\"x\")))","v":"x"},"x","x","x","x","x","x","x","x","x","x","x","x","x","x","x","x","x","x","x","x","x","x","x","x","x","x","x","x","x","x","x",{"$f":"IF(OR($V90=\"Utility\",$AA90=0),\"x\",IF($G90=\"cold\",\"x\",IF(AND(FW$6>$F90,FV$6<$E90),IF(FV$6>$F90,IF(FW$6>$E90,$U90/($E90-$F90)*($E90-FV$6),$U90/($E90-$F90)*(FW$6-FV$6)),$U90/($E90-$F90)*(FW$6-$F90)),\"x\")))","v":"x"},"x","x","x","x","x","x","x","x","x","x","x","x","x","x","x","x","x","x","x","x","x","x","x","x","x","x","x","x","x","x","x",{"$f":"IF(OR($V90=\"Utility\",$AA90=0),\"x\",IF($G90=\"cold\",\"x\",IF(AND(HC$6>$F90,HB$6<$E90),IF(HB$6>$F90,IF(HC$6>$E90,$U90/($E90-$F90)*($E90-HB$6),$U90/($E90-$F90)*(HC$6-HB$6)),$U90/($E90-$F90)*(HC$6-$F90)),\"x\")))","v":"x"},"x","x","x","x","x","x","x","x","x","x","x","x","x","x","x","x","x","x","x","x","x","x","x","x","x","x","x","x","x","x","x","x","x","x","x","x"]
["",{"$f":"IF(G93=\"hot\",COUNTIF($G$5:G93,\"hot\"),\"\")","v":""},{"$f":"IF(G93=\"cold\",COUNTIF($G$5:G93,\"cold\"),\"\")","v":""},null,null,null,"",null,null,"","","",null,null,null,null,null,null,null,null,"",null,"","","","","",null,null,null,null,null,null,null,null,null,null,null,0,null,{"$f":"IF(OR($V91=\"Utility\",$AA91=0),\"x\",IF($G91=\"hot\",\"x\",IF(AND(AO$6>$E91,AN$6<$F91),IF(AN$6>$E91,IF(AO$6>$F91,$U91/($F91-$E91)*($F91-AN$6),$U91/($F91-$E91)*(AO$6-AN$6)),$U91/($F91-$E91)*(AO$6-$E91)),\"x\")))","v":"x"},"x","x","x","x","x","x","x","x","x","x","x","x","x","x","x","x","x","x","x","x","x","x","x","x","x","x","x","x","x","x","x",{"$f":"IF(OR($V91=\"Utility\",$AA91=0),\"x\",IF($G91=\"hot\",\"x\",IF(AND(BU$6>$E91,BT$6<$F91),IF(BT$6>$E91,IF(BU$6>$F91,$U91/($F91-$E91)*($F91-BT$6),$U91/($F91-$E91)*(BU$6-BT$6)),$U91/($F91-$E91)*(BU$6-$E91)),\"x\")))","v":"x"},"x","x","x","x","x","x","x","x","x","x","x","x","x","x","x","x","x","x","x","x","x","x","x","x","x","x","x","x","x","x","x",{"$f":"IF(OR($V91=\"Utility\",$AA91=0),\"x\",IF($G91=\"hot\",\"x\",IF(AND(DA$6>$E91,CZ$6<$F91),IF(CZ$6>$E91,IF(DA$6>$F91,$U91/($F91-$E91)*($F91-CZ$6),$U91/($F91-$E91)*(DA$6-CZ$6)),$U91/($F91-$E91)*(DA$6-$E91)),\"x\")))","v":"x"},"x","x","x","x","x","x","x","x","x","x","x","x","x","x","x","x","x","x","x","x","x","x","x","x","x","x","x","x","x","x","x","x","x","x","x","x",null,null,null,0,null,{"$f":"IF(OR($V91=\"Utility\",$AA91=0),\"x\",IF($G91=\"cold\",\"x\",IF(AND(EQ$6>$F91,EP$6<$E91),IF(EP$6>$F91,IF(EQ$6>$E91,$U91/($E91-$F91)*($E91-EP$6),$U91/($E91-$F91)*(EQ$6-EP$6)),$U91/($E91-$F91)*(EQ$6-$F91)),\"x\")))","v":"x"},"x","x","x","x","x","x","x","x","x","x","x","x","x","x","x","x","x","x","x","x","x","x","x","x","x","x","x","x","x","x","x",{"$f":"IF(OR($V91=\"Utility\",$AA91=0),\"x\",IF($G91=\"cold\",\"x\",IF(AND(FW$6>$F91,FV$6<$E91),IF(FV$6>$F91,IF(FW$6>$E91,$U91/($E91-$F91)*($E91-FV$6),$U91/($E91-$F91)*(FW$6-FV$6)),$U91/($E91-$F91)*(FW$6-$F91)),\"x\")))","v":"x"},"x","x","x","x","x","x","x","x","x","x","x","x","x","x","x","x","x","x","x","x","x","x","x","x","x","x","x","x","x","x","x",{"$f":"IF(OR($V91=\"Utility\",$AA91=0),\"x\",IF($G91=\"cold\",\"x\",IF(AND(HC$6>$F91,HB$6<$E91),IF(HB$6>$F91,IF(HC$6>$E91,$U91/($E91-$F91)*($E91-HB$6),$U91/($E91-$F91)*(HC$6-HB$6)),$U91/($E91-$F91)*(HC$6-$F91)),\"x\")))","v":"x"},"x","x","x","x","x","x","x","x","x","x","x","x","x","x","x","x","x","x","x","x","x","x","x","x","x","x","x","x","x","x","x","x","x","x","x","x"]
["",{"$f":"IF(G94=\"hot\",COUNTIF($G$5:G94,\"hot\"),\"\")","v":""},{"$f":"IF(G94=\"cold\",COUNTIF($G$5:G94,\"cold\"),\"\")","v":""},null,null,null,"",null,null,"","","",null,null,null,null,null,null,null,null,"",null,"","","","","",null,null,null,null,null,null,null,null,null,null,null,0,null,{"$f":"IF(OR($V92=\"Utility\",$AA92=0),\"x\",IF($G92=\"hot\",\"x\",IF(AND(AO$6>$E92,AN$6<$F92),IF(AN$6>$E92,IF(AO$6>$F92,$U92/($F92-$E92)*($F92-AN$6),$U92/($F92-$E92)*(AO$6-AN$6)),$U92/($F92-$E92)*(AO$6-$E92)),\"x\")))","v":"x"},"x","x","x","x","x","x","x","x","x","x","x","x","x","x","x","x","x","x","x","x","x","x","x","x","x","x","x","x","x","x","x",{"$f":"IF(OR($V92=\"Utility\",$AA92=0),\"x\",IF($G92=\"hot\",\"x\",IF(AND(BU$6>$E92,BT$6<$F92),IF(BT$6>$E92,IF(BU$6>$F92,$U92/($F92-$E92)*($F92-BT$6),$U92/($F92-$E92)*(BU$6-BT$6)),$U92/($F92-$E92)*(BU$6-$E92)),\"x\")))","v":"x"},"x","x","x","x","x","x","x","x","x","x","x","x","x","x","x","x","x","x","x","x","x","x","x","x","x","x","x","x","x","x","x",{"$f":"IF(OR($V92=\"Utility\",$AA92=0),\"x\",IF($G92=\"hot\",\"x\",IF(AND(DA$6>$E92,CZ$6<$F92),IF(CZ$6>$E92,IF(DA$6>$F92,$U92/($F92-$E92)*($F92-CZ$6),$U92/($F92-$E92)*(DA$6-CZ$6)),$U92/($F92-$E92)*(DA$6-$E92)),\"x\")))","v":"x"},"x","x","x","x","x","x","x","x","x","x","x","x","x","x","x","x","x","x","x","x","x","x","x","x","x","x","x","x","x","x","x","x","x","x","x","x",null,null,null,0,null,{"$f":"IF(OR($V92=\"Utility\",$AA92=0),\"x\",IF($G92=\"cold\",\"x\",IF(AND(EQ$6>$F92,EP$6<$E92),IF(EP$6>$F92,IF(EQ$6>$E92,$U92/($E92-$F92)*($E92-EP$6),$U92/($E92-$F92)*(EQ$6-EP$6)),$U92/($E92-$F92)*(EQ$6-$F92)),\"x\")))","v":"x"},"x","x","x","x","x","x","x","x","x","x","x","x","x","x","x","x","x","x","x","x","x","x","x","x","x","x","x","x","x","x","x",{"$f":"IF(OR($V92=\"Utility\",$AA92=0),\"x\",IF($G92=\"cold\",\"x\",IF(AND(FW$6>$F92,FV$6<$E92),IF(FV$6>$F92,IF(FW$6>$E92,$U92/($E92-$F92)*($E92-FV$6),$U92/($E92-$F92)*(FW$6-FV$6)),$U92/($E92-$F92)*(FW$6-$F92)),\"x\")))","v":"x"},"x","x","x","x","x","x","x","x","x","x","x","x","x","x","x","x","x","x","x","x","x","x","x","x","x","x","x","x","x","x","x",{"$f":"IF(OR($V92=\"Utility\",$AA92=0),\"x\",IF($G92=\"cold\",\"x\",IF(AND(HC$6>$F92,HB$6<$E92),IF(HB$6>$F92,IF(HC$6>$E92,$U92/($E92-$F92)*($E92-HB$6),$U92/($E92-$F92)*(HC$6-HB$6)),$U92/($E92-$F92)*(HC$6-$F92)),\"x\")))","v":"x"},"x","x","x","x","x","x","x","x","x","x","x","x","x","x","x","x","x","x","x","x","x","x","x","x","x","x","x","x","x","x","x","x","x","x","x","x"]
["",{"$f":"IF(G95=\"hot\",COUNTIF($G$5:G95,\"hot\"),\"\")","v":""},{"$f":"IF(G95=\"cold\",COUNTIF($G$5:G95,\"cold\"),\"\")","v":""},null,null,null,"",null,null,"","","",null,null,null,null,null,null,null,null,"",null,"","","","","",null,null,null,null,null,null,null,null,null,null,null,0,null,{"$f":"IF(OR($V93=\"Utility\",$AA93=0),\"x\",IF($G93=\"hot\",\"x\",IF(AND(AO$6>$E93,AN$6<$F93),IF(AN$6>$E93,IF(AO$6>$F93,$U93/($F93-$E93)*($F93-AN$6),$U93/($F93-$E93)*(AO$6-AN$6)),$U93/($F93-$E93)*(AO$6-$E93)),\"x\")))","v":"x"},"x","x","x","x","x","x","x","x","x","x","x","x","x","x","x","x","x","x","x","x","x","x","x","x","x","x","x","x","x","x","x",{"$f":"IF(OR($V93=\"Utility\",$AA93=0),\"x\",IF($G93=\"hot\",\"x\",IF(AND(BU$6>$E93,BT$6<$F93),IF(BT$6>$E93,IF(BU$6>$F93,$U93/($F93-$E93)*($F93-BT$6),$U93/($F93-$E93)*(BU$6-BT$6)),$U93/($F93-$E93)*(BU$6-$E93)),\"x\")))","v":"x"},"x","x","x","x","x","x","x","x","x","x","x","x","x","x","x","x","x","x","x","x","x","x","x","x","x","x","x","x","x","x","x",{"$f":"IF(OR($V93=\"Utility\",$AA93=0),\"x\",IF($G93=\"hot\",\"x\",IF(AND(DA$6>$E93,CZ$6<$F93),IF(CZ$6>$E93,IF(DA$6>$F93,$U93/($F93-$E93)*($F93-CZ$6),$U93/($F93-$E93)*(DA$6-CZ$6)),$U93/($F93-$E93)*(DA$6-$E93)),\"x\")))","v":"x"},"x","x","x","x","x","x","x","x","x","x","x","x","x","x","x","x","x","x","x","x","x","x","x","x","x","x","x","x","x","x","x","x","x","x","x","x",null,null,null,0,null,{"$f":"IF(OR($V93=\"Utility\",$AA93=0),\"x\",IF($G93=\"cold\",\"x\",IF(AND(EQ$6>$F93,EP$6<$E93),IF(EP$6>$F93,IF(EQ$6>$E93,$U93/($E93-$F93)*($E93-EP$6),$U93/($E93-$F93)*(EQ$6-EP$6)),$U93/($E93-$F93)*(EQ$6-$F93)),\"x\")))","v":"x"},"x","x","x","x","x","x","x","x","x","x","x","x","x","x","x","x","x","x","x","x","x","x","x","x","x","x","x","x","x","x","x",{"$f":"IF(OR($V93=\"Utility\",$AA93=0),\"x\",IF($G93=\"cold\",\"x\",IF(AND(FW$6>$F93,FV$6<$E93),IF(FV$6>$F93,IF(FW$6>$E93,$U93/($E93-$F93)*($E93-FV$6),$U93/($E93-$F93)*(FW$6-FV$6)),$U93/($E93-$F93)*(FW$6-$F93)),\"x\")))","v":"x"},"x","x","x","x","x","x","x","x","x","x","x","x","x","x","x","x","x","x","x","x","x","x","x","x","x","x","x","x","x","x","x",{"$f":"IF(OR($V93=\"Utility\",$AA93=0),\"x\",IF($G93=\"cold\",\"x\",IF(AND(HC$6>$F93,HB$6<$E93),IF(HB$6>$F93,IF(HC$6>$E93,$U93/($E93-$F93)*($E93-HB$6),$U93/($E93-$F93)*(HC$6-HB$6)),$U93/($E93-$F93)*(HC$6-$F93)),\"x\")))","v":"x"},"x","x","x","x","x","x","x","x","x","x","x","x","x","x","x","x","x","x","x","x","x","x","x","x","x","x","x","x","x","x","x","x","x","x","x","x"]
["",{"$f":"IF(G96=\"hot\",COUNTIF($G$5:G96,\"hot\"),\"\")","v":""},{"$f":"IF(G96=\"cold\",COUNTIF($G$5:G96,\"cold\"),\"\")","v":""},null,null,null,"",null,null,"","","",null,null,null,null,null,null,null,null,"",null,"","","","","",null,null,null,null,null,null,null,null,null,null,null,0,null,{"$f":"IF(OR($V94=\"Utility\",$AA94=0),\"x\",IF($G94=\"hot\",\"x\",IF(AND(AO$6>$E94,AN$6<$F94),IF(AN$6>$E94,IF(AO$6>$F94,$U94/($F94-$E94)*($F94-AN$6),$U94/($F94-$E94)*(AO$6-AN$6)),$U94/($F94-$E94)*(AO$6-$E94)),\"x\")))","v":"x"},"x","x","x","x","x","x","x","x","x","x","x","x","x","x","x","x","x","x","x","x","x","x","x","x","x","x","x","x","x","x","x",{"$f":"IF(OR($V94=\"Utility\",$AA94=0),\"x\",IF($G94=\"hot\",\"x\",IF(AND(BU$6>$E94,BT$6<$F94),IF(BT$6>$E94,IF(BU$6>$F94,$U94/($F94-$E94)*($F94-BT$6),$U94/($F94-$E94)*(BU$6-BT$6)),$U94/($F94-$E94)*(BU$6-$E94)),\"x\")))","v":"x"},"x","x","x","x","x","x","x","x","x","x","x","x","x","x","x","x","x","x","x","x","x","x","x","x","x","x","x","x","x","x","x",{"$f":"IF(OR($V94=\"Utility\",$AA94=0),\"x\",IF($G94=\"hot\",\"x\",IF(AND(DA$6>$E94,CZ$6<$F94),IF(CZ$6>$E94,IF(DA$6>$F94,$U94/($F94-$E94)*($F94-CZ$6),$U94/($F94-$E94)*(DA$6-CZ$6)),$U94/($F94-$E94)*(DA$6-$E94)),\"x\")))","v":"x"},"x","x","x","x","x","x","x","x","x","x","x","x","x","x","x","x","x","x","x","x","x","x","x","x","x","x","x","x","x","x","x","x","x","x","x","x",null,null,null,0,null,{"$f":"IF(OR($V94=\"Utility\",$AA94=0),\"x\",IF($G94=\"cold\",\"x\",IF(AND(EQ$6>$F94,EP$6<$E94),IF(EP$6>$F94,IF(EQ$6>$E94,$U94/($E94-$F94)*($E94-EP$6),$U94/($E94-$F94)*(EQ$6-EP$6)),$U94/($E94-$F94)*(EQ$6-$F94)),\"x\")))","v":"x"},"x","x","x","x","x","x","x","x","x","x","x","x","x","x","x","x","x","x","x","x","x","x","x","x","x","x","x","x","x","x","x",{"$f":"IF(OR($V94=\"Utility\",$AA94=0),\"x\",IF($G94=\"cold\",\"x\",IF(AND(FW$6>$F94,FV$6<$E94),IF(FV$6>$F94,IF(FW$6>$E94,$U94/($E94-$F94)*($E94-FV$6),$U94/($E94-$F94)*(FW$6-FV$6)),$U94/($E94-$F94)*(FW$6-$F94)),\"x\")))","v":"x"},"x","x","x","x","x","x","x","x","x","x","x","x","x","x","x","x","x","x","x","x","x","x","x","x","x","x","x","x","x","x","x",{"$f":"IF(OR($V94=\"Utility\",$AA94=0),\"x\",IF($G94=\"cold\",\"x\",IF(AND(HC$6>$F94,HB$6<$E94),IF(HB$6>$F94,IF(HC$6>$E94,$U94/($E94-$F94)*($E94-HB$6),$U94/($E94-$F94)*(HC$6-HB$6)),$U94/($E94-$F94)*(HC$6-$F94)),\"x\")))","v":"x"},"x","x","x","x","x","x","x","x","x","x","x","x","x","x","x","x","x","x","x","x","x","x","x","x","x","x","x","x","x","x","x","x","x","x","x","x"]
["",{"$f":"IF(G97=\"hot\",COUNTIF($G$5:G97,\"hot\"),\"\")","v":""},{"$f":"IF(G97=\"cold\",COUNTIF($G$5:G97,\"cold\"),\"\")","v":""},null,null,null,"",null,null,"","","",null,null,null,null,null,null,null,null,"",null,"","","","","",null,null,null,null,null,null,null,null,null,null,null,0,null,{"$f":"IF(OR($V95=\"Utility\",$AA95=0),\"x\",IF($G95=\"hot\",\"x\",IF(AND(AO$6>$E95,AN$6<$F95),IF(AN$6>$E95,IF(AO$6>$F95,$U95/($F95-$E95)*($F95-AN$6),$U95/($F95-$E95)*(AO$6-AN$6)),$U95/($F95-$E95)*(AO$6-$E95)),\"x\")))","v":"x"},"x","x","x","x","x","x","x","x","x","x","x","x","x","x","x","x","x","x","x","x","x","x","x","x","x","x","x","x","x","x","x",{"$f":"IF(OR($V95=\"Utility\",$AA95=0),\"x\",IF($G95=\"hot\",\"x\",IF(AND(BU$6>$E95,BT$6<$F95),IF(BT$6>$E95,IF(BU$6>$F95,$U95/($F95-$E95)*($F95-BT$6),$U95/($F95-$E95)*(BU$6-BT$6)),$U95/($F95-$E95)*(BU$6-$E95)),\"x\")))","v":"x"},"x","x","x","x","x","x","x","x","x","x","x","x","x","x","x","x","x","x","x","x","x","x","x","x","x","x","x","x","x","x","x",{"$f":"IF(OR($V95=\"Utility\",$AA95=0),\"x\",IF($G95=\"hot\",\"x\",IF(AND(DA$6>$E95,CZ$6<$F95),IF(CZ$6>$E95,IF(DA$6>$F95,$U95/($F95-$E95)*($F95-CZ$6),$U95/($F95-$E95)*(DA$6-CZ$6)),$U95/($F95-$E95)*(DA$6-$E95)),\"x\")))","v":"x"},"x","x","x","x","x","x","x","x","x","x","x","x","x","x","x","x","x","x","x","x","x","x","x","x","x","x","x","x","x","x","x","x","x","x","x","x",null,null,null,0,null,{"$f":"IF(OR($V95=\"Utility\",$AA95=0),\"x\",IF($G95=\"cold\",\"x\",IF(AND(EQ$6>$F95,EP$6<$E95),IF(EP$6>$F95,IF(EQ$6>$E95,$U95/($E95-$F95)*($E95-EP$6),$U95/($E95-$F95)*(EQ$6-EP$6)),$U95/($E95-$F95)*(EQ$6-$F95)),\"x\")))","v":"x"},"x","x","x","x","x","x","x","x","x","x","x","x","x","x","x","x","x","x","x","x","x","x","x","x","x","x","x","x","x","x","x",{"$f":"IF(OR($V95=\"Utility\",$AA95=0),\"x\",IF($G95=\"cold\",\"x\",IF(AND(FW$6>$F95,FV$6<$E95),IF(FV$6>$F95,IF(FW$6>$E95,$U95/($E95-$F95)*($E95-FV$6),$U95/($E95-$F95)*(FW$6-FV$6)),$U95/($E95-$F95)*(FW$6-$F95)),\"x\")))","v":"x"},"x","x","x","x","x","x","x","x","x","x","x","x","x","x","x","x","x","x","x","x","x","x","x","x","x","x","x","x","x","x","x",{"$f":"IF(OR($V95=\"Utility\",$AA95=0),\"x\",IF($G95=\"cold\",\"x\",IF(AND(HC$6>$F95,HB$6<$E95),IF(HB$6>$F95,IF(HC$6>$E95,$U95/($E95-$F95)*($E95-HB$6),$U95/($E95-$F95)*(HC$6-HB$6)),$U95/($E95-$F95)*(HC$6-$F95)),\"x\")))","v":"x"},"x","x","x","x","x","x","x","x","x","x","x","x","x","x","x","x","x","x","x","x","x","x","x","x","x","x","x","x","x","x","x","x","x","x","x","x"]
["",{"$f":"IF(G98=\"hot\",COUNTIF($G$5:G98,\"hot\"),\"\")","v":""},{"$f":"IF(G98=\"cold\",COUNTIF($G$5:G98,\"cold\"),\"\")","v":""},null,null,null,"",null,null,"","","",null,null,null,null,null,null,null,null,"",null,"","","","","",null,null,null,null,null,null,null,null,null,null,null,0,null,{"$f":"IF(OR($V96=\"Utility\",$AA96=0),\"x\",IF($G96=\"hot\",\"x\",IF(AND(AO$6>$E96,AN$6<$F96),IF(AN$6>$E96,IF(AO$6>$F96,$U96/($F96-$E96)*($F96-AN$6),$U96/($F96-$E96)*(AO$6-AN$6)),$U96/($F96-$E96)*(AO$6-$E96)),\"x\")))","v":"x"},"x","x","x","x","x","x","x","x","x","x","x","x","x","x","x","x","x","x","x","x","x","x","x","x","x","x","x","x","x","x","x",{"$f":"IF(OR($V96=\"Utility\",$AA96=0),\"x\",IF($G96=\"hot\",\"x\",IF(AND(BU$6>$E96,BT$6<$F96),IF(BT$6>$E96,IF(BU$6>$F96,$U96/($F96-$E96)*($F96-BT$6),$U96/($F96-$E96)*(BU$6-BT$6)),$U96/($F96-$E96)*(BU$6-$E96)),\"x\")))","v":"x"},"x","x","x","x","x","x","x","x","x","x","x","x","x","x","x","x","x","x","x","x","x","x","x","x","x","x","x","x","x","x","x",{"$f":"IF(OR($V96=\"Utility\",$AA96=0),\"x\",IF($G96=\"hot\",\"x\",IF(AND(DA$6>$E96,CZ$6<$F96),IF(CZ$6>$E96,IF(DA$6>$F96,$U96/($F96-$E96)*($F96-CZ$6),$U96/($F96-$E96)*(DA$6-CZ$6)),$U96/($F96-$E96)*(DA$6-$E96)),\"x\")))","v":"x"},"x","x","x","x","x","x","x","x","x","x","x","x","x","x","x","x","x","x","x","x","x","x","x","x","x","x","x","x","x","x","x","x","x","x","x","x",null,null,null,0,null,{"$f":"IF(OR($V96=\"Utility\",$AA96=0),\"x\",IF($G96=\"cold\",\"x\",IF(AND(EQ$6>$F96,EP$6<$E96),IF(EP$6>$F96,IF(EQ$6>$E96,$U96/($E96-$F96)*($E96-EP$6),$U96/($E96-$F96)*(EQ$6-EP$6)),$U96/($E96-$F96)*(EQ$6-$F96)),\"x\")))","v":"x"},"x","x","x","x","x","x","x","x","x","x","x","x","x","x","x","x","x","x","x","x","x","x","x","x","x","x","x","x","x","x","x",{"$f":"IF(OR($V96=\"Utility\",$AA96=0),\"x\",IF($G96=\"cold\",\"x\",IF(AND(FW$6>$F96,FV$6<$E96),IF(FV$6>$F96,IF(FW$6>$E96,$U96/($E96-$F96)*($E96-FV$6),$U96/($E96-$F96)*(FW$6-FV$6)),$U96/($E96-$F96)*(FW$6-$F96)),\"x\")))","v":"x"},"x","x","x","x","x","x","x","x","x","x","x","x","x","x","x","x","x","x","x","x","x","x","x","x","x","x","x","x","x","x","x",{"$f":"IF(OR($V96=\"Utility\",$AA96=0),\"x\",IF($G96=\"cold\",\"x\",IF(AND(HC$6>$F96,HB$6<$E96),IF(HB$6>$F96,IF(HC$6>$E96,$U96/($E96-$F96)*($E96-HB$6),$U96/($E96-$F96)*(HC$6-HB$6)),$U96/($E96-$F96)*(HC$6-$F96)),\"x\")))","v":"x"},"x","x","x","x","x","x","x","x","x","x","x","x","x","x","x","x","x","x","x","x","x","x","x","x","x","x","x","x","x","x","x","x","x","x","x","x"]
["",{"$f":"IF(G99=\"hot\",COUNTIF($G$5:G99,\"hot\"),\"\")","v":""},{"$f":"IF(G99=\"cold\",COUNTIF($G$5:G99,\"cold\"),\"\")","v":""},null,null,null,"",null,null,"","","",null,null,null,null,null,null,null,null,"",null,"","","","","",null,null,null,null,null,null,null,null,null,null,null,0,null,{"$f":"IF(OR($V97=\"Utility\",$AA97=0),\"x\",IF($G97=\"hot\",\"x\",IF(AND(AO$6>$E97,AN$6<$F97),IF(AN$6>$E97,IF(AO$6>$F97,$U97/($F97-$E97)*($F97-AN$6),$U97/($F97-$E97)*(AO$6-AN$6)),$U97/($F97-$E97)*(AO$6-$E97)),\"x\")))","v":"x"},"x","x","x","x","x","x","x","x","x","x","x","x","x","x","x","x","x","x","x","x","x","x","x","x","x","x","x","x","x","x","x",{"$f":"IF(OR($V97=\"Utility\",$AA97=0),\"x\",IF($G97=\"hot\",\"x\",IF(AND(BU$6>$E97,BT$6<$F97),IF(BT$6>$E97,IF(BU$6>$F97,$U97/($F97-$E97)*($F97-BT$6),$U97/($F97-$E97)*(BU$6-BT$6)),$U97/($F97-$E97)*(BU$6-$E97)),\"x\")))","v":"x"},"x","x","x","x","x","x","x","x","x","x","x","x","x","x","x","x","x","x","x","x","x","x","x","x","x","x","x","x","x","x","x",{"$f":"IF(OR($V97=\"Utility\",$AA97=0),\"x\",IF($G97=\"hot\",\"x\",IF(AND(DA$6>$E97,CZ$6<$F97),IF(CZ$6>$E97,IF(DA$6>$F97,$U97/($F97-$E97)*($F97-CZ$6),$U97/($F97-$E97)*(DA$6-CZ$6)),$U97/($F97-$E97)*(DA$6-$E97)),\"x\")))","v":"x"},"x","x","x","x","x","x","x","x","x","x","x","x","x","x","x","x","x","x","x","x","x","x","x","x","x","x","x","x","x","x","x","x","x","x","x","x",null,null,null,0,null,{"$f":"IF(OR($V97=\"Utility\",$AA97=0),\"x\",IF($G97=\"cold\",\"x\",IF(AND(EQ$6>$F97,EP$6<$E97),IF(EP$6>$F97,IF(EQ$6>$E97,$U97/($E97-$F97)*($E97-EP$6),$U97/($E97-$F97)*(EQ$6-EP$6)),$U97/($E97-$F97)*(EQ$6-$F97)),\"x\")))","v":"x"},"x","x","x","x","x","x","x","x","x","x","x","x","x","x","x","x","x","x","x","x","x","x","x","x","x","x","x","x","x","x","x",{"$f":"IF(OR($V97=\"Utility\",$AA97=0),\"x\",IF($G97=\"cold\",\"x\",IF(AND(FW$6>$F97,FV$6<$E97),IF(FV$6>$F97,IF(FW$6>$E97,$U97/($E97-$F97)*($E97-FV$6),$U97/($E97-$F97)*(FW$6-FV$6)),$U97/($E97-$F97)*(FW$6-$F97)),\"x\")))","v":"x"},"x","x","x","x","x","x","x","x","x","x","x","x","x","x","x","x","x","x","x","x","x","x","x","x","x","x","x","x","x","x","x",{"$f":"IF(OR($V97=\"Utility\",$AA97=0),\"x\",IF($G97=\"cold\",\"x\",IF(AND(HC$6>$F97,HB$6<$E97),IF(HB$6>$F97,IF(HC$6>$E97,$U97/($E97-$F97)*($E97-HB$6),$U97/($E97-$F97)*(HC$6-HB$6)),$U97/($E97-$F97)*(HC$6-$F97)),\"x\")))","v":"x"},"x","x","x","x","x","x","x","x","x","x","x","x","x","x","x","x","x","x","x","x","x","x","x","x","x","x","x","x","x","x","x","x","x","x","x","x"]
["",{"$f":"IF(G100=\"hot\",COUNTIF($G$5:G100,\"hot\"),\"\")","v":""},{"$f":"IF(G100=\"cold\",COUNTIF($G$5:G100,\"cold\"),\"\")","v":""},null,null,null,"",null,null,"","","",null,null,null,null,null,null,null,null,"",null,"","","","","",null,null,null,null,null,null,null,null,null,null,null,0,null,{"$f":"IF(OR($V98=\"Utility\",$AA98=0),\"x\",IF($G98=\"hot\",\"x\",IF(AND(AO$6>$E98,AN$6<$F98),IF(AN$6>$E98,IF(AO$6>$F98,$U98/($F98-$E98)*($F98-AN$6),$U98/($F98-$E98)*(AO$6-AN$6)),$U98/($F98-$E98)*(AO$6-$E98)),\"x\")))","v":"x"},"x","x","x","x","x","x","x","x","x","x","x","x","x","x","x","x","x","x","x","x","x","x","x","x","x","x","x","x","x","x","x",{"$f":"IF(OR($V98=\"Utility\",$AA98=0),\"x\",IF($G98=\"hot\",\"x\",IF(AND(BU$6>$E98,BT$6<$F98),IF(BT$6>$E98,IF(BU$6>$F98,$U98/($F98-$E98)*($F98-BT$6),$U98/($F98-$E98)*(BU$6-BT$6)),$U98/($F98-$E98)*(BU$6-$E98)),\"x\")))","v":"x"},"x","x","x","x","x","x","x","x","x","x","x","x","x","x","x","x","x","x","x","x","x","x","x","x","x","x","x","x","x","x","x",{"$f":"IF(OR($V98=\"Utility\",$AA98=0),\"x\",IF($G98=\"hot\",\"x\",IF(AND(DA$6>$E98,CZ$6<$F98),IF(CZ$6>$E98,IF(DA$6>$F98,$U98/($F98-$E98)*($F98-CZ$6),$U98/($F98-$E98)*(DA$6-CZ$6)),$U98/($F98-$E98)*(DA$6-$E98)),\"x\")))","v":"x"},"x","x","x","x","x","x","x","x","x","x","x","x","x","x","x","x","x","x","x","x","x","x","x","x","x","x","x","x","x","x","x","x","x","x","x","x",null,null,null,0,null,{"$f":"IF(OR($V98=\"Utility\",$AA98=0),\"x\",IF($G98=\"cold\",\"x\",IF(AND(EQ$6>$F98,EP$6<$E98),IF(EP$6>$F98,IF(EQ$6>$E98,$U98/($E98-$F98)*($E98-EP$6),$U98/($E98-$F98)*(EQ$6-EP$6)),$U98/($E98-$F98)*(EQ$6-$F98)),\"x\")))","v":"x"},"x","x","x","x","x","x","x","x","x","x","x","x","x","x","x","x","x","x","x","x","x","x","x","x","x","x","x","x","x","x","x",{"$f":"IF(OR($V98=\"Utility\",$AA98=0),\"x\",IF($G98=\"cold\",\"x\",IF(AND(FW$6>$F98,FV$6<$E98),IF(FV$6>$F98,IF(FW$6>$E98,$U98/($E98-$F98)*($E98-FV$6),$U98/($E98-$F98)*(FW$6-FV$6)),$U98/($E98-$F98)*(FW$6-$F98)),\"x\")))","v":"x"},"x","x","x","x","x","x","x","x","x","x","x","x","x","x","x","x","x","x","x","x","x","x","x","x","x","x","x","x","x","x","x",{"$f":"IF(OR($V98=\"Utility\",$AA98=0),\"x\",IF($G98=\"cold\",\"x\",IF(AND(HC$6>$F98,HB$6<$E98),IF(HB$6>$F98,IF(HC$6>$E98,$U98/($E98-$F98)*($E98-HB$6),$U98/($E98-$F98)*(HC$6-HB$6)),$U98/($E98-$F98)*(HC$6-$F98)),\"x\")))","v":"x"},"x","x","x","x","x","x","x","x","x","x","x","x","x","x","x","x","x","x","x","x","x","x","x","x","x","x","x","x","x","x","x","x","x","x","x","x"]
["",{"$f":"IF(G101=\"hot\",COUNTIF($G$5:G101,\"hot\"),\"\")","v":""},{"$f":"IF(G101=\"cold\",COUNTIF($G$5:G101,\"cold\"),\"\")","v":""},null,null,null,"",null,null,"","","",null,null,null,null,null,null,null,null,"",null,"","",{"$f":"IF(G101=\"\",\"\",IF(G101=\"hot\",_xlfn.RANK.EQ(W101,$W$5:$W$104),_xlfn.RANK.EQ(X101,$X$5:$X$104)))","v":""},"","",null,null,null,null,null,null,null,null,null,null,null,0,null,{"$f":"IF(OR($V99=\"Utility\",$AA99=0),\"x\",IF($G99=\"hot\",\"x\",IF(AND(AO$6>$E99,AN$6<$F99),IF(AN$6>$E99,IF(AO$6>$F99,$U99/($F99-$E99)*($F99-AN$6),$U99/($F99-$E99)*(AO$6-AN$6)),$U99/($F99-$E99)*(AO$6-$E99)),\"x\")))","v":"x"},"x","x","x","x","x","x","x","x","x","x","x","x","x","x","x","x","x","x","x","x","x","x","x","x","x","x","x","x","x","x","x",{"$f":"IF(OR($V99=\"Utility\",$AA99=0),\"x\",IF($G99=\"hot\",\"x\",IF(AND(BU$6>$E99,BT$6<$F99),IF(BT$6>$E99,IF(BU$6>$F99,$U99/($F99-$E99)*($F99-BT$6),$U99/($F99-$E99)*(BU$6-BT$6)),$U99/($F99-$E99)*(BU$6-$E99)),\"x\")))","v":"x"},"x","x","x","x","x","x","x","x","x","x","x","x","x","x","x","x","x","x","x","x","x","x","x","x","x","x","x","x","x","x","x",{"$f":"IF(OR($V99=\"Utility\",$AA99=0),\"x\",IF($G99=\"hot\",\"x\",IF(AND(DA$6>$E99,CZ$6<$F99),IF(CZ$6>$E99,IF(DA$6>$F99,$U99/($F99-$E99)*($F99-CZ$6),$U99/($F99-$E99)*(DA$6-CZ$6)),$U99/($F99-$E99)*(DA$6-$E99)),\"x\")))","v":"x"},"x","x","x","x","x","x","x","x","x","x","x","x","x","x","x","x","x","x","x","x","x","x","x","x","x","x","x","x","x","x","x","x","x","x","x","x",null,null,null,0,null,{"$f":"IF(OR($V99=\"Utility\",$AA99=0),\"x\",IF($G99=\"cold\",\"x\",IF(AND(EQ$6>$F99,EP$6<$E99),IF(EP$6>$F99,IF(EQ$6>$E99,$U99/($E99-$F99)*($E99-EP$6),$U99/($E99-$F99)*(EQ$6-EP$6)),$U99/($E99-$F99)*(EQ$6-$F99)),\"x\")))","v":"x"},"x","x","x","x","x","x","x","x","x","x","x","x","x","x","x","x","x","x","x","x","x","x","x","x","x","x","x","x","x","x","x",{"$f":"IF(OR($V99=\"Utility\",$AA99=0),\"x\",IF($G99=\"cold\",\"x\",IF(AND(FW$6>$F99,FV$6<$E99),IF(FV$6>$F99,IF(FW$6>$E99,$U99/($E99-$F99)*($E99-FV$6),$U99/($E99-$F99)*(FW$6-FV$6)),$U99/($E99-$F99)*(FW$6-$F99)),\"x\")))","v":"x"},"x","x","x","x","x","x","x","x","x","x","x","x","x","x","x","x","x","x","x","x","x","x","x","x","x","x","x","x","x","x","x",{"$f":"IF(OR($V99=\"Utility\",$AA99=0),\"x\",IF($G99=\"cold\",\"x\",IF(AND(HC$6>$F99,HB$6<$E99),IF(HB$6>$F99,IF(HC$6>$E99,$U99/($E99-$F99)*($E99-HB$6),$U99/($E99-$F99)*(HC$6-HB$6)),$U99/($E99-$F99)*(HC$6-$F99)),\"x\")))","v":"x"},"x","x","x","x","x","x","x","x","x","x","x","x","x","x","x","x","x","x","x","x","x","x","x","x","x","x","x","x","x","x","x","x","x","x","x","x"]
["",{"$f":"IF(G102=\"hot\",COUNTIF($G$5:G102,\"hot\"),\"\")","v":""},{"$f":"IF(G102=\"cold\",COUNTIF($G$5:G102,\"cold\"),\"\")","v":""},null,null,null,"",null,null,"","","",null,null,null,null,null,null,null,null,"",null,"","","","","",null,null,null,null,null,null,null,null,null,null,null,0,null,{"$f":"IF(OR($V100=\"Utility\",$AA100=0),\"x\",IF($G100=\"hot\",\"x\",IF(AND(AO$6>$E100,AN$6<$F100),IF(AN$6>$E100,IF(AO$6>$F100,$U100/($F100-$E100)*($F100-AN$6),$U100/($F100-$E100)*(AO$6-AN$6)),$U100/($F100-$E100)*(AO$6-$E100)),\"x\")))","v":"x"},"x","x","x","x","x","x","x","x","x","x","x","x","x","x","x","x","x","x","x","x","x","x","x","x","x","x","x","x","x","x","x",{"$f":"IF(OR($V100=\"Utility\",$AA100=0),\"x\",IF($G100=\"hot\",\"x\",IF(AND(BU$6>$E100,BT$6<$F100),IF(BT$6>$E100,IF(BU$6>$F100,$U100/($F100-$E100)*($F100-BT$6),$U100/($F100-$E100)*(BU$6-BT$6)),$U100/($F100-$E100)*(BU$6-$E100)),\"x\")))","v":"x"},"x","x","x","x","x","x","x","x","x","x","x","x","x","x","x","x","x","x","x","x","x","x","x","x","x","x","x","x","x","x","x",{"$f":"IF(OR($V100=\"Utility\",$AA100=0),\"x\",IF($G100=\"hot\",\"x\",IF(AND(DA$6>$E100,CZ$6<$F100),IF(CZ$6>$E100,IF(DA$6>$F100,$U100/($F100-$E100)*($F100-CZ$6),$U100/($F100-$E100)*(DA$6-CZ$6)),$U100/($F100-$E100)*(DA$6-$E100)),\"x\")))","v":"x"},"x","x","x","x","x","x","x","x","x","x","x","x","x","x","x","x","x","x","x","x","x","x","x","x","x","x","x","x","x","x","x","x","x","x","x","x",null,null,null,0,null,{"$f":"IF(OR($V100=\"Utility\",$AA100=0),\"x\",IF($G100=\"cold\",\"x\",IF(AND(EQ$6>$F100,EP$6<$E100),IF(EP$6>$F100,IF(EQ$6>$E100,$U100/($E100-$F100)*($E100-EP$6),$U100/($E100-$F100)*(EQ$6-EP$6)),$U100/($E100-$F100)*(EQ$6-$F100)),\"x\")))","v":"x"},"x","x","x","x","x","x","x","x","x","x","x","x","x","x","x","x","x","x","x","x","x","x","x","x","x","x","x","x","x","x","x",{"$f":"IF(OR($V100=\"Utility\",$AA100=0),\"x\",IF($G100=\"cold\",\"x\",IF(AND(FW$6>$F100,FV$6<$E100),IF(FV$6>$F100,IF(FW$6>$E100,$U100/($E100-$F100)*($E100-FV$6),$U100/($E100-$F100)*(FW$6-FV$6)),$U100/($E100-$F100)*(FW$6-$F100)),\"x\")))","v":"x"},"x","x","x","x","x","x","x","x","x","x","x","x","x","x","x","x","x","x","x","x","x","x","x","x","x","x","x","x","x","x","x",{"$f":"IF(OR($V100=\"Utility\",$AA100=0),\"x\",IF($G100=\"cold\",\"x\",IF(AND(HC$6>$F100,HB$6<$E100),IF(HB$6>$F100,IF(HC$6>$E100,$U100/($E100-$F100)*($E100-HB$6),$U100/($E100-$F100)*(HC$6-HB$6)),$U100/($E100-$F100)*(HC$6-$F100)),\"x\")))","v":"x"},"x","x","x","x","x","x","x","x","x","x","x","x","x","x","x","x","x","x","x","x","x","x","x","x","x","x","x","x","x","x","x","x","x","x","x","x"]
["",{"$f":"IF(G103=\"hot\",COUNTIF($G$5:G103,\"hot\"),\"\")","v":""},{"$f":"IF(G103=\"cold\",COUNTIF($G$5:G103,\"cold\"),\"\")","v":""},null,null,null,"",null,null,"","","",null,null,null,null,null,null,null,null,"",null,"","","","","",null,null,null,null,null,null,null,null,null,null,null,{"$f":"D101","v":0},null,{"$f":"IF(OR($V101=\"Utility\",$AA101=0),\"x\",IF($G101=\"hot\",\"x\",IF(AND(AO$6>$E101,AN$6<$F101),IF(AN$6>$E101,IF(AO$6>$F101,$U101/($F101-$E101)*($F101-AN$6),$U101/($F101-$E101)*(AO$6-AN$6)),$U101/($F101-$E101)*(AO$6-$E101)),\"x\")))","v":"x"},"x","x","x","x","x","x","x","x","x","x","x","x","x","x","x","x","x","x","x","x","x","x","x","x","x","x","x","x","x","x","x",{"$f":"IF(OR($V101=\"Utility\",$AA101=0),\"x\",IF($G101=\"hot\",\"x\",IF(AND(BU$6>$E101,BT$6<$F101),IF(BT$6>$E101,IF(BU$6>$F101,$U101/($F101-$E101)*($F101-BT$6),$U101/($F101-$E101)*(BU$6-BT$6)),$U101/($F101-$E101)*(BU$6-$E101)),\"x\")))","v":"x"},"x","x","x","x","x","x","x","x","x","x","x","x","x","x","x","x","x","x","x","x","x","x","x","x","x","x","x","x","x","x","x",{"$f":"IF(OR($V101=\"Utility\",$AA101=0),\"x\",IF($G101=\"hot\",\"x\",IF(AND(DA$6>$E101,CZ$6<$F101),IF(CZ$6>$E101,IF(DA$6>$F101,$U101/($F101-$E101)*($F101-CZ$6),$U101/($F101-$E101)*(DA$6-CZ$6)),$U101/($F101-$E101)*(DA$6-$E101)),\"x\")))","v":"x"},"x","x","x","x","x","x","x","x","x","x","x","x","x","x","x","x","x","x","x","x","x","x","x","x","x","x","x","x","x","x","x","x","x","x","x","x",null,null,null,{"$f":"D101","v":0},null,{"$f":"IF(OR($V101=\"Utility\",$AA101=0),\"x\",IF($G101=\"cold\",\"x\",IF(AND(EQ$6>$F101,EP$6<$E101),IF(EP$6>$F101,IF(EQ$6>$E101,$U101/($E101-$F101)*($E101-EP$6),$U101/($E101-$F101)*(EQ$6-EP$6)),$U101/($E101-$F101)*(EQ$6-$F101)),\"x\")))","v":"x"},"x","x","x","x","x","x","x","x","x","x","x","x","x","x","x","x","x","x","x","x","x","x","x","x","x","x","x","x","x","x","x",{"$f":"IF(OR($V101=\"Utility\",$AA101=0),\"x\",IF($G101=\"cold\",\"x\",IF(AND(FW$6>$F101,FV$6<$E101),IF(FV$6>$F101,IF(FW$6>$E101,$U101/($E101-$F101)*($E101-FV$6),$U101/($E101-$F101)*(FW$6-FV$6)),$U101/($E101-$F101)*(FW$6-$F101)),\"x\")))","v":"x"},"x","x","x","x","x","x","x","x","x","x","x","x","x","x","x","x","x","x","x","x","x","x","x","x","x","x","x","x","x","x","x",{"$f":"IF(OR($V101=\"Utility\",$AA101=0),\"x\",IF($G101=\"cold\",\"x\",IF(AND(HC$6>$F101,HB$6<$E101),IF(HB$6>$F101,IF(HC$6>$E101,$U101/($E101-$F101)*($E101-HB$6),$U101/($E101-$F101)*(HC$6-HB$6)),$U101/($E101-$F101)*(HC$6-$F101)),\"x\")))","v":"x"},"x","x","x","x","x","x","x","x","x","x","x","x","x","x","x","x","x","x","x","x","x","x","x","x","x","x","x","x","x","x","x","x","x","x","x","x"]
["",{"$f":"IF(G104=\"hot\",COUNTIF($G$5:G104,\"hot\"),\"\")","v":""},{"$f":"IF(G104=\"cold\",COUNTIF($G$5:G104,\"cold\"),\"\")","v":""},null,null,null,"",null,null,"","","",null,null,null,null,null,null,null,null,"",null,"","","","","",null,null,null,null,null,null,null,null,null,null,null,0,null,{"$f":"IF(OR($V102=\"Utility\",$AA102=0),\"x\",IF($G102=\"hot\",\"x\",IF(AND(AO$6>$E102,AN$6<$F102),IF(AN$6>$E102,IF(AO$6>$F102,$U102/($F102-$E102)*($F102-AN$6),$U102/($F102-$E102)*(AO$6-AN$6)),$U102/($F102-$E102)*(AO$6-$E102)),\"x\")))","v":"x"},"x","x","x","x","x","x","x","x","x","x","x","x","x","x","x","x","x","x","x","x","x","x","x","x","x","x","x","x","x","x","x",{"$f":"IF(OR($V102=\"Utility\",$AA102=0),\"x\",IF($G102=\"hot\",\"x\",IF(AND(BU$6>$E102,BT$6<$F102),IF(BT$6>$E102,IF(BU$6>$F102,$U102/($F102-$E102)*($F102-BT$6),$U102/($F102-$E102)*(BU$6-BT$6)),$U102/($F102-$E102)*(BU$6-$E102)),\"x\")))","v":"x"},"x","x","x","x","x","x","x","x","x","x","x","x","x","x","x","x","x","x","x","x","x","x","x","x","x","x","x","x","x","x","x",{"$f":"IF(OR($V102=\"Utility\",$AA102=0),\"x\",IF($G102=\"hot\",\"x\",IF(AND(DA$6>$E102,CZ$6<$F102),IF(CZ$6>$E102,IF(DA$6>$F102,$U102/($F102-$E102)*($F102-CZ$6),$U102/($F102-$E102)*(DA$6-CZ$6)),$U102/($F102-$E102)*(DA$6-$E102)),\"x\")))","v":"x"},"x","x","x","x","x","x","x","x","x","x","x","x","x","x","x","x","x","x","x","x","x","x","x","x","x","x","x","x","x","x","x","x","x","x","x","x",null,null,null,0,null,{"$f":"IF(OR($V102=\"Utility\",$AA102=0),\"x\",IF($G102=\"cold\",\"x\",IF(AND(EQ$6>$F102,EP$6<$E102),IF(EP$6>$F102,IF(EQ$6>$E102,$U102/($E102-$F102)*($E102-EP$6),$U102/($E102-$F102)*(EQ$6-EP$6)),$U102/($E102-$F102)*(EQ$6-$F102)),\"x\")))","v":"x"},"x","x","x","x","x","x","x","x","x","x","x","x","x","x","x","x","x","x","x","x","x","x","x","x","x","x","x","x","x","x","x",{"$f":"IF(OR($V102=\"Utility\",$AA102=0),\"x\",IF($G102=\"cold\",\"x\",IF(AND(FW$6>$F102,FV$6<$E102),IF(FV$6>$F102,IF(FW$6>$E102,$U102/($E102-$F102)*($E102-FV$6),$U102/($E102-$F102)*(FW$6-FV$6)),$U102/($E102-$F102)*(FW$6-$F102)),\"x\")))","v":"x"},"x","x","x","x","x","x","x","x","x","x","x","x","x","x","x","x","x","x","x","x","x","x","x","x","x","x","x","x","x","x","x",{"$f":"IF(OR($V102=\"Utility\",$AA102=0),\"x\",IF($G102=\"cold\",\"x\",IF(AND(HC$6>$F102,HB$6<$E102),IF(HB$6>$F102,IF(HC$6>$E102,$U102/($E102-$F102)*($E102-HB$6),$U102/($E102-$F102)*(HC$6-HB$6)),$U102/($E102-$F102)*(HC$6-$F102)),\"x\")))","v":"x"},"x","x","x","x","x","x","x","x","x","x","x","x","x","x","x","x","x","x","x","x","x","x","x","x","x","x","x","x","x","x","x","x","x","x","x","x"]
[null,"ES KÖNNEN MAXIMAL 100 STRÖME DEFINIERT WERDEN"]

{"sheet":"02_PinchKurven","index":2,"n_rows":13,"n_cols":10,"rows_kept":13,"cut":false,"hidden":false,"merged":[[12,1,12,5],[12,7,12,11],[0,0,0,2],[7,5,10,5]]}
["Schritt 2 / Pinch Kurven"]
[]
[]
[]
[]
[null,"Minimaler Temperaturunterschied",null,0,"[K]",null,null,"Pinch Temperatur",{"$f":"(PinchT+PinchTlow)/2","v":0},"[°C]"]
[]
[null,"Leistung-Kriterium",null,30,"%",{"$f":"IF(rng_SummeGewichtung<>100,\"Die Summe der Gewichtungen sollte 100% sein.\",\"\")","v":""},null,"Maximal mögliche Wärmerückgewinnung",{"$f":"MaxHR","v":0},"[MWh]"]
[null,"Energie-Kriterium",null,30,"%",null,null,"Verbleibender externer Wärmebedarf",{"$f":"MinHU","v":0},"[MWh]"]
[null,"Exergie-Kriterium",null,40,"%",null,null,"Verbleibender externer Kältebedarf",{"$f":"MinCU","v":0},"[MWh]"]
[null,"Summe Gewichtung",null,{"$f":"rng_Power+rng_Energy+rng_Exergy","v":100},"%"]
[]
[null,"Hot and Cold Composite Curve",null,null,null,null,null,"Grand Composite Curve"]

{"sheet":"03_WT_Prioritätenliste","index":3,"n_rows":16,"n_cols":15,"rows_kept":16,"cut":false,"hidden":false,"merged":[]}
["Schritt 3 / Prioritätenliste"]
[]
["Rang","WT ID","Heißer Strom ID","Kalter Strom ID","WT Name","Heißer Strom HS","Kalter Strom KS","Leistung ","Energie","T HS Ein","T KS Ein","T HS Aus","T KS Aus","Bewertung","WT Laufzeit"]
[null,null,null,null,null,null,null,"[kW]","[MWh]","[°C]","[°C]","[°C]","[°C]","[-]","[h/Jahr]"]
[1,{"$f":"'(hid) 03_WtRawList'!A3","v":0},{"$f":"'(hid) 03_WtRawList'!B3","v":0},{"$f":"'(hid) 03_WtRawList'!C3","v":0},{"$f":"\"WT \"&C5&\" --> \"&D5","v":"WT 0 --> 0"},{"$f":"VLOOKUP(C5,varHS!$D$1:$M$100,9,FALSE)","v":0},{"$f":"VLOOKUP(D5,varCS!$D$1:$M$100,9,FALSE)","v":0},{"$f":"'(hid) 03_WtRawList'!Y3","v":0},{"$f":"'(hid) 03_WtRawList'!W3/1000","v":0},{"$f":"'(hid) 03_WtRawList'!D3","v":0},{"$f":"'(hid) 03_WtRawList'!E3","v":0},{"$f":"'(hid) 03_WtRawList'!F3","v":0},{"$f":"'(hid) 03_WtRawList'!G3","v":0},{"$f":"'(hid) 03_WtRawList'!Q3","v":0},{"$f":"'(hid) 03_WtRawList'!L3","v":0}]
[2,{"$f":"'(hid) 03_WtRawList'!A4","v":0},{"$f":"'(hid) 03_WtRawList'!B4","v":0},{"$f":"'(hid) 03_WtRawList'!C4","v":0},{"$f":"\"WT \"&C6&\" --> \"&D6","v":"WT 0 --> 0"},{"$f":"VLOOKUP(C6,varHS!$D$1:$M$100,9,FALSE)","v":0},{"$f":"VLOOKUP(D6,varCS!$D$1:$M$100,9,FALSE)","v":0},{"$f":"'(hid) 03_WtRawList'!Y4","v":0},{"$f":"'(hid) 03_WtRawList'!W4/1000","v":0},{"$f":"'(hid) 03_WtRawList'!D4","v":0},{"$f":"'(hid) 03_WtRawList'!E4","v":0},{"$f":"'(hid) 03_WtRawList'!F4","v":0},{"$f":"'(hid) 03_WtRawList'!G4","v":0},{"$f":"'(hid) 03_WtRawList'!Q4","v":0},{"$f":"'(hid) 03_WtRawList'!L4","v":0}]
[3,{"$f":"'(hid) 03_WtRawList'!A5","v":0},{"$f":"'(hid) 03_WtRawList'!B5","v":0},{"$f":"'(hid) 03_WtRawList'!C5","v":0},"WT 0 --> 0",{"$f":"VLOOKUP(C7,varHS!$D$1:$M$100,9,FALSE)","v":0},{"$f":"VLOOKUP(D7,varCS!$D$1:$M$100,9,FALSE)","v":0},{"$f":"'(hid) 03_WtRawList'!Y5","v":0},{"$f":"'(hid) 03_WtRawList'!W5/1000","v":0},{"$f":"'(hid) 03_WtRawList'!D5","v":0},{"$f":"'(hid) 03_WtRawList'!E5","v":0},{"$f":"'(hid) 03_WtRawList'!F5","v":0},{"$f":"'(hid) 03_WtRawList'!G5","v":0},{"$f":"'(hid) 03_WtRawList'!Q5","v":0},{"$f":"'(hid) 03_WtRawList'!L5","v":0}]
[4,{"$f":"'(hid) 03_WtRawList'!A6","v":0},{"$f":"'(hid) 03_WtRawList'!B6","v":0},{"$f":"'(hid) 03_WtRawList'!C6","v":0},"WT 0 --> 0",{"$f":"VLOOKUP(C8,varHS!$D$1:$M$100,9,FALSE)","v":0},{"$f":"VLOOKUP(D8,varCS!$D$1:$M$100,9,FALSE)","v":0},{"$f":"'(hid) 03_WtRawList'!Y6","v":0},{"$f":"'(hid) 03_WtRawList'!W6/1000","v":0},{"$f":"'(hid) 03_WtRawList'!D6","v":0},{"$f":"'(hid) 03_WtRawList'!E6","v":0},{"$f":"'(hid) 03_WtRawList'!F6","v":0},{"$f":"'(hid) 03_WtRawList'!G6","v":0},{"$f":"'(hid) 03_WtRawList'!Q6","v":0},{"$f":"'(hid) 03_WtRawList'!L6","v":0}]
[5,{"$f":"'(hid) 03_WtRawList'!A7","v":0},{"$f":"'(hid) 03_WtRawList'!B7","v":0},{"$f":"'(hid) 03_WtRawList'!C7","v":0},"WT 0 --> 0",{"$f":"VLOOKUP(C9,varHS!$D$1:$M$100,9,FALSE)","v":0},{"$f":"VLOOKUP(D9,varCS!$D$1:$M$100,9,FALSE)","v":0},{"$f":"'(hid) 03_WtRawList'!Y7","v":0},{"$f":"'(hid) 03_WtRawList'!W7/1000","v":0},{"$f":"'(hid) 03_WtRawList'!D7","v":0},{"$f":"'(hid) 03_WtRawList'!E7","v":0},{"$f":"'(hid) 03_WtRawList'!F7","v":0},{"$f":"'(hid) 03_WtRawList'!G7","v":0},{"$f":"'(hid) 03_WtRawList'!Q7","v":0},{"$f":"'(hid) 03_WtRawList'!L7","v":0}]
[6,{"$f":"'(hid) 03_WtRawList'!A8","v":0},{"$f":"'(hid) 03_WtRawList'!B8","v":0},{"$f":"'(hid) 03_WtRawList'!C8","v":0},"WT 0 --> 0",{"$f":"VLOOKUP(C10,varHS!$D$1:$M$100,9,FALSE)","v":0},{"$f":"VLOOKUP(D10,varCS!$D$1:$M$100,9,FALSE)","v":0},{"$f":"'(hid) 03_WtRawList'!Y8","v":0},{"$f":"'(hid) 03_WtRawList'!W8/1000","v":0},{"$f":"'(hid) 03_WtRawList'!D8","v":0},{"$f":"'(hid) 03_WtRawList'!E8","v":0},{"$f":"'(hid) 03_WtRawList'!F8","v":0},{"$f":"'(hid) 03_WtRawList'!G8","v":0},{"$f":"'(hid) 03_WtRawList'!Q8","v":0},{"$f":"'(hid) 03_WtRawList'!L8","v":0}]
[7,{"$f":"'(hid) 03_WtRawList'!A9","v":0},{"$f":"'(hid) 03_WtRawList'!B9","v":0},{"$f":"'(hid) 03_WtRawList'!C9","v":0},"WT 0 --> 0",{"$f":"VLOOKUP(C11,varHS!$D$1:$M$100,9,FALSE)","v":0},{"$f":"VLOOKUP(D11,varCS!$D$1:$M$100,9,FALSE)","v":0},{"$f":"'(hid) 03_WtRawList'!Y9","v":0},{"$f":"'(hid) 03_WtRawList'!W9/1000","v":0},{"$f":"'(hid) 03_WtRawList'!D9","v":0},{"$f":"'(hid) 03_WtRawList'!E9","v":0},{"$f":"'(hid) 03_WtRawList'!F9","v":0},{"$f":"'(hid) 03_WtRawList'!G9","v":0},{"$f":"'(hid) 03_WtRawList'!Q9","v":0},{"$f":"'(hid) 03_WtRawList'!L9","v":0}]
[8,{"$f":"'(hid) 03_WtRawList'!A10","v":0},{"$f":"'(hid) 03_WtRawList'!B10","v":0},{"$f":"'(hid) 03_WtRawList'!C10","v":0},"WT 0 --> 0",{"$f":"VLOOKUP(C12,varHS!$D$1:$M$100,9,FALSE)","v":0},{"$f":"VLOOKUP(D12,varCS!$D$1:$M$100,9,FALSE)","v":0},{"$f":"'(hid) 03_WtRawList'!Y10","v":0},{"$f":"'(hid) 03_WtRawList'!W10/1000","v":0},{"$f":"'(hid) 03_WtRawList'!D10","v":0},{"$f":"'(hid) 03_WtRawList'!E10","v":0},{"$f":"'(hid) 03_WtRawList'!F10","v":0},{"$f":"'(hid) 03_WtRawList'!G10","v":0},{"$f":"'(hid) 03_WtRawList'!Q10","v":0},{"$f":"'(hid) 03_WtRawList'!L10","v":0}]
[9,{"$f":"'(hid) 03_WtRawList'!A11","v":0},{"$f":"'(hid) 03_WtRawList'!B11","v":0},{"$f":"'(hid) 03_WtRawList'!C11","v":0},"WT 0 --> 0",{"$f":"VLOOKUP(C13,varHS!$D$1:$M$100,9,FALSE)","v":0},{"$f":"VLOOKUP(D13,varCS!$D$1:$M$100,9,FALSE)","v":0},{"$f":"'(hid) 03_WtRawList'!Y11","v":0},{"$f":"'(hid) 03_WtRawList'!W11/1000","v":0},{"$f":"'(hid) 03_WtRawList'!D11","v":0},{"$f":"'(hid) 03_WtRawList'!E11","v":0},{"$f":"'(hid) 03_WtRawList'!F11","v":0},{"$f":"'(hid) 03_WtRawList'!G11","v":0},{"$f":"'(hid) 03_WtRawList'!Q11","v":0},{"$f":"'(hid) 03_WtRawList'!L11","v":0}]
[10,{"$f":"'(hid) 03_WtRawList'!A12","v":0},{"$f":"'(hid) 03_WtRawList'!B12","v":0},{"$f":"'(hid) 03_WtRawList'!C12","v":0},"WT 0 --> 0",{"$f":"VLOOKUP(C14,varHS!$D$1:$M$100,9,FALSE)","v":0},{"$f":"VLOOKUP(D14,varCS!$D$1:$M$100,9,FALSE)","v":0},{"$f":"'(hid) 03_WtRawList'!Y12","v":0},{"$f":"'(hid) 03_WtRawList'!W12/1000","v":0},{"$f":"'(hid) 03_WtRawList'!D12","v":0},{"$f":"'(hid) 03_WtRawList'!E12","v":0},{"$f":"'(hid) 03_WtRawList'!F12","v":0},{"$f":"'(hid) 03_WtRawList'!G12","v":0},{"$f":"'(hid) 03_WtRawList'!Q12","v":0},{"$f":"'(hid) 03_WtRawList'!L12","v":0}]
[]
[null,null,"Wählen Sie einen Wärmetauscher aus um ihn weiter zu bearbeiten"]

{"sheet":"05_WT_Auswahl","index":4,"n_rows":18,"n_cols":23,"rows_kept":18,"cut":false,"hidden":false,"merged":[]}
["Schritt 5 / Auswertung",null,null,null,null,null,null,null,null,null,null,null,null,null,null,null,"Auswahl Energieträger zur Bewertung Primärenergie- und CO2-Einsparungen"]
[]
["Chosen ID","WT ID","Heißer Strom ID","Kalter Strom ID","WT Name","Heißer Strom HS","Kalter Strom KS","Leistung ","Energie","T HS Ein","T KS Ein","T HS Aus","T KS Aus","Bewertung","WT Laufzeit","Energie-Preis","Monetäre Einsparungen","WT Kosten","Statische Amortisations-\nzeit","Eingesparte Primärenergie","CO2-Einsparungen"]
[null,null,null,null,null,null,null,"[kW]","[MWh]","[°C]","[°C]","[°C]","[°C]","[-]","[h/Jahr]","[€/MWh]","[€/Jahr]","[€]","[Jahre]","[MWh PE]","[t CO2]"]
[{"$f":"IF(B5=\"\",\"\",A4+1)","v":""},{"$f":"IF('(hid) 05_WtAuswahl'!$A3=0,\"\",'(hid) 05_WtAuswahl'!A3)","v":""},{"$f":"IF('(hid) 05_WtAuswahl'!$A3=0,\"\",'(hid) 05_WtAuswahl'!B3)","v":""},{"$f":"IF('(hid) 05_WtAuswahl'!$A3=0,\"\",'(hid) 05_WtAuswahl'!C3)","v":""},{"$f":"IF('(hid) 05_WtAuswahl'!$A3=0,\"\",\"WT \"&C5&\" --> \"&D5)","v":""},{"$f":"IF(C5=\"\",\"\",VLOOKUP(C5,varHS!$D$1:$M$100,9,FALSE))","v":""},{"$f":"IF(C5=\"\",\"\",VLOOKUP(D5,varCS!$D$1:$M$100,9,FALSE))","v":""},{"$f":"IF('(hid) 05_WtAuswahl'!$A3=0,\"\",'(hid) 05_WtAuswahl'!Y3)","v":""},{"$f":"IF('(hid) 05_WtAuswahl'!$A3=0,\"\",'(hid) 05_WtAuswahl'!W3/1000)","v":""},{"$f":"IF('(hid) 05_WtAuswahl'!$A3=0,\"\",'(hid) 05_WtAuswahl'!D3)","v":""},{"$f":"IF('(hid) 05_WtAuswahl'!$A3=0,\"\",'(hid) 05_WtAuswahl'!E3)","v":""},{"$f":"IF('(hid) 05_WtAuswahl'!$A3=0,\"\",'(hid) 05_WtAuswahl'!F3)","v":""},{"$f":"IF('(hid) 05_WtAuswahl'!$A3=0,\"\",'(hid) 05_WtAuswahl'!G3)","v":""},{"$f":"IF('(hid) 05_WtAuswahl'!$A3=0,\"\",'(hid) 05_WtAuswahl'!Q3)","v":""},{"$f":"IF('(hid) 05_WtAuswahl'!$A3=0,\"\",'(hid) 05_WtAuswahl'!L3)","v":""},{"$f":"IF('(hid) 05_WtAuswahl'!$A3=0,\"\",'(hid) 05_WtAuswahl'!AA3)","v":""},{"$f":"IF('(hid) 05_WtAuswahl'!$A3=0,\"\",'(hid) 05_WtAuswahl'!AB3)","v":""},{"$f":"IF('(hid) 05_WtAuswahl'!$A3=0,\"\",'(hid) 05_WtAuswahl'!AC3)","v":""},{"$f":"IF('(hid) 05_WtAuswahl'!$A3=0,\"\",IF(OR(R5=0,Q5=0),0,R5/Q5))","v":""},{"$f":"IF('(hid) 05_WtAuswahl'!$A3=0,\"\",I5*rng_PE)","v":""},{"$f":"IF('(hid) 05_WtAuswahl'!$A3=0,\"\",I5*rng_CO2)","v":""},null,"Kohle"]
[{"$f":"IF(B6=\"\",\"\",A5+1)","v":""},{"$f":"IF('(hid) 05_WtAuswahl'!$A4=0,\"\",'(hid) 05_WtAuswahl'!A4)","v":""},{"$f":"IF('(hid) 05_WtAuswahl'!$A4=0,\"\",'(hid) 05_WtAuswahl'!B4)","v":""},{"$f":"IF('(hid) 05_WtAuswahl'!$A4=0,\"\",'(hid) 05_WtAuswahl'!C4)","v":""},{"$f":"IF('(hid) 05_WtAuswahl'!$A4=0,\"\",\"WT \"&C6&\" --> \"&D6)","v":""},{"$f":"IF(C6=\"\",\"\",VLOOKUP(C6,varHS!$D$1:$M$100,9,FALSE))","v":""},{"$f":"IF(C6=\"\",\"\",VLOOKUP(D6,varCS!$D$1:$M$100,9,FALSE))","v":""},{"$f":"IF('(hid) 05_WtAuswahl'!$A4=0,\"\",'(hid) 05_WtAuswahl'!Y4)","v":""},{"$f":"IF('(hid) 05_WtAuswahl'!$A4=0,\"\",'(hid) 05_WtAuswahl'!W4/1000)","v":""},{"$f":"IF('(hid) 05_WtAuswahl'!$A4=0,\"\",'(hid) 05_WtAuswahl'!D4)","v":""},{"$f":"IF('(hid) 05_WtAuswahl'!$A4=0,\"\",'(hid) 05_WtAuswahl'!E4)","v":""},{"$f":"IF('(hid) 05_WtAuswahl'!$A4=0,\"\",'(hid) 05_WtAuswahl'!F4)","v":""},{"$f":"IF('(hid) 05_WtAuswahl'!$A4=0,\"\",'(hid) 05_WtAuswahl'!G4)","v":""},{"$f":"IF('(hid) 05_WtAuswahl'!$A4=0,\"\",'(hid) 05_WtAuswahl'!Q4)","v":""},{"$f":"IF('(hid) 05_WtAuswahl'!$A4=0,\"\",'(hid) 05_WtAuswahl'!L4)","v":""},{"$f":"IF('(hid) 05_WtAuswahl'!$A4=0,\"\",'(hid) 05_WtAuswahl'!AA4)","v":""},{"$f":"IF('(hid) 05_WtAuswahl'!$A4=0,\"\",'(hid) 05_WtAuswahl'!AB4)","v":""},{"$f":"IF('(hid) 05_WtAuswahl'!$A4=0,\"\",'(hid) 05_WtAuswahl'!AC4)","v":""},{"$f":"IF('(hid) 05_WtAuswahl'!$A4=0,\"\",IF(OR(R6=0,Q6=0),0,R6/Q6))","v":""},{"$f":"IF('(hid) 05_WtAuswahl'!$A4=0,\"\",I6*rng_PE)","v":""},{"$f":"IF('(hid) 05_WtAuswahl'!$A4=0,\"\",I6*rng_CO2)","v":""},null,"Diesel"]
["",{"$f":"IF('(hid) 05_WtAuswahl'!$A5=0,\"\",'(hid) 05_WtAuswahl'!A5)","v":""},{"$f":"IF('(hid) 05_WtAuswahl'!$A5=0,\"\",'(hid) 05_WtAuswahl'!B5)","v":""},{"$f":"IF('(hid) 05_WtAuswahl'!$A5=0,\"\",'(hid) 05_WtAuswahl'!C5)","v":""},{"$f":"IF('(hid) 05_WtAuswahl'!$A5=0,\"\",\"WT \"&C7&\" --> \"&D7)","v":""},{"$f":"IF(C7=\"\",\"\",VLOOKUP(C7,varHS!$D$1:$M$100,9,FALSE))","v":""},{"$f":"IF(C7=\"\",\"\",VLOOKUP(D7,varCS!$D$1:$M$100,9,FALSE))","v":""},{"$f":"IF('(hid) 05_WtAuswahl'!$A5=0,\"\",'(hid) 05_WtAuswahl'!Y5)","v":""},{"$f":"IF('(hid) 05_WtAuswahl'!$A5=0,\"\",'(hid) 05_WtAuswahl'!W5/1000)","v":""},{"$f":"IF('(hid) 05_WtAuswahl'!$A5=0,\"\",'(hid) 05_WtAuswahl'!D5)","v":""},{"$f":"IF('(hid) 05_WtAuswahl'!$A5=0,\"\",'(hid) 05_WtAuswahl'!E5)","v":""},{"$f":"IF('(hid) 05_WtAuswahl'!$A5=0,\"\",'(hid) 05_WtAuswahl'!F5)","v":""},{"$f":"IF('(hid) 05_WtAuswahl'!$A5=0,\"\",'(hid) 05_WtAuswahl'!G5)","v":""},{"$f":"IF('(hid) 05_WtAuswahl'!$A5=0,\"\",'(hid) 05_WtAuswahl'!Q5)","v":""},{"$f":"IF('(hid) 05_WtAuswahl'!$A5=0,\"\",'(hid) 05_WtAuswahl'!L5)","v":""},{"$f":"IF('(hid) 05_WtAuswahl'!$A5=0,\"\",'(hid) 05_WtAuswahl'!AA5)","v":""},{"$f":"IF('(hid) 05_WtAuswahl'!$A5=0,\"\",'(hid) 05_WtAuswahl'!AB5)","v":""},{"$f":"IF('(hid) 05_WtAuswahl'!$A5=0,\"\",'(hid) 05_WtAuswahl'!AC5)","v":""},{"$f":"IF('(hid) 05_WtAuswahl'!$A5=0,\"\",IF(OR(R7=0,Q7=0),0,R7/Q7))","v":""},{"$f":"IF('(hid) 05_WtAuswahl'!$A5=0,\"\",I7*rng_PE)","v":""},{"$f":"IF('(hid) 05_WtAuswahl'!$A5=0,\"\",I7*rng_CO2)","v":""},null,"Heizöl"]
["",{"$f":"IF('(hid) 05_WtAuswahl'!$A6=0,\"\",'(hid) 05_WtAuswahl'!A6)","v":""},{"$f":"IF('(hid) 05_WtAuswahl'!$A6=0,\"\",'(hid) 05_WtAuswahl'!B6)","v":""},{"$f":"IF('(hid) 05_WtAuswahl'!$A6=0,\"\",'(hid) 05_WtAuswahl'!C6)","v":""},{"$f":"IF('(hid) 05_WtAuswahl'!$A6=0,\"\",\"WT \"&C8&\" --> \"&D8)","v":""},{"$f":"IF(C8=\"\",\"\",VLOOKUP(C8,varHS!$D$1:$M$100,9,FALSE))","v":""},{"$f":"IF(C8=\"\",\"\",VLOOKUP(D8,varCS!$D$1:$M$100,9,FALSE))","v":""},{"$f":"IF('(hid) 05_WtAuswahl'!$A6=0,\"\",'(hid) 05_WtAuswahl'!Y6)","v":""},{"$f":"IF('(hid) 05_WtAuswahl'!$A6=0,\"\",'(hid) 05_WtAuswahl'!W6/1000)","v":""},{"$f":"IF('(hid) 05_WtAuswahl'!$A6=0,\"\",'(hid) 05_WtAuswahl'!D6)","v":""},{"$f":"IF('(hid) 05_WtAuswahl'!$A6=0,\"\",'(hid) 05_WtAuswahl'!E6)","v":""},{"$f":"IF('(hid) 05_WtAuswahl'!$A6=0,\"\",'(hid) 05_WtAuswahl'!F6)","v":""},{"$f":"IF('(hid) 05_WtAuswahl'!$A6=0,\"\",'(hid) 05_WtAuswahl'!G6)","v":""},{"$f":"IF('(hid) 05_WtAuswahl'!$A6=0,\"\",'(hid) 05_WtAuswahl'!Q6)","v":""},{"$f":"IF('(hid) 05_WtAuswahl'!$A6=0,\"\",'(hid) 05_WtAuswahl'!L6)","v":""},{"$f":"IF('(hid) 05_WtAuswahl'!$A6=0,\"\",'(hid) 05_WtAuswahl'!AA6)","v":""},{"$f":"IF('(hid) 05_WtAuswahl'!$A6=0,\"\",'(hid) 05_WtAuswahl'!AB6)","v":""},{"$f":"IF('(hid) 05_WtAuswahl'!$A6=0,\"\",'(hid) 05_WtAuswahl'!AC6)","v":""},{"$f":"IF('(hid) 05_WtAuswahl'!$A6=0,\"\",IF(OR(R8=0,Q8=0),0,R8/Q8))","v":""},{"$f":"IF('(hid) 05_WtAuswahl'!$A6=0,\"\",I8*rng_PE)","v":""},{"$f":"IF('(hid) 05_WtAuswahl'!$A6=0,\"\",I8*rng_CO2)","v":""},null,"Flüssiggas"]
["",{"$f":"IF('(hid) 05_WtAuswahl'!$A7=0,\"\",'(hid) 05_WtAuswahl'!A7)","v":""},{"$f":"IF('(hid) 05_WtAuswahl'!$A7=0,\"\",'(hid) 05_WtAuswahl'!B7)","v":""},{"$f":"IF('(hid) 05_WtAuswahl'!$A7=0,\"\",'(hid) 05_WtAuswahl'!C7)","v":""},{"$f":"IF('(hid) 05_WtAuswahl'!$A7=0,\"\",\"WT \"&C9&\" --> \"&D9)","v":""},{"$f":"IF(C9=\"\",\"\",VLOOKUP(C9,varHS!$D$1:$M$100,9,FALSE))","v":""},{"$f":"IF(C9=\"\",\"\",VLOOKUP(D9,varCS!$D$1:$M$100,9,FALSE))","v":""},{"$f":"IF('(hid) 05_WtAuswahl'!$A7=0,\"\",'(hid) 05_WtAuswahl'!Y7)","v":""},{"$f":"IF('(hid) 05_WtAuswahl'!$A7=0,\"\",'(hid) 05_WtAuswahl'!W7/1000)","v":""},{"$f":"IF('(hid) 05_WtAuswahl'!$A7=0,\"\",'(hid) 05_WtAuswahl'!D7)","v":""},{"$f":"IF('(hid) 05_WtAuswahl'!$A7=0,\"\",'(hid) 05_WtAuswahl'!E7)","v":""},{"$f":"IF('(hid) 05_WtAuswahl'!$A7=0,\"\",'(hid) 05_WtAuswahl'!F7)","v":""},{"$f":"IF('(hid) 05_WtAuswahl'!$A7=0,\"\",'(hid) 05_WtAuswahl'!G7)","v":""},{"$f":"IF('(hid) 05_WtAuswahl'!$A7=0,\"\",'(hid) 05_WtAuswahl'!Q7)","v":""},{"$f":"IF('(hid) 05_WtAuswahl'!$A7=0,\"\",'(hid) 05_WtAuswahl'!L7)","v":""},{"$f":"IF('(hid) 05_WtAuswahl'!$A7=0,\"\",'(hid) 05_WtAuswahl'!AA7)","v":""},{"$f":"IF('(hid) 05_WtAuswahl'!$A7=0,\"\",'(hid) 05_WtAuswahl'!AB7)","v":""},{"$f":"IF('(hid) 05_WtAuswahl'!$A7=0,\"\",'(hid) 05_WtAuswahl'!AC7)","v":""},{"$f":"IF('(hid) 05_WtAuswahl'!$A7=0,\"\",IF(OR(R9=0,Q9=0),0,R9/Q9))","v":""},{"$f":"IF('(hid) 05_WtAuswahl'!$A7=0,\"\",I9*rng_PE)","v":""},{"$f":"IF('(hid) 05_WtAuswahl'!$A7=0,\"\",I9*rng_CO2)","v":""},null,"Erdgas"]
["",{"$f":"IF('(hid) 05_WtAuswahl'!$A8=0,\"\",'(hid) 05_WtAuswahl'!A8)","v":""},{"$f":"IF('(hid) 05_WtAuswahl'!$A8=0,\"\",'(hid) 05_WtAuswahl'!B8)","v":""},{"$f":"IF('(hid) 05_WtAuswahl'!$A8=0,\"\",'(hid) 05_WtAuswahl'!C8)","v":""},{"$f":"IF('(hid) 05_WtAuswahl'!$A8=0,\"\",\"WT \"&C10&\" --> \"&D10)","v":""},{"$f":"IF(C10=\"\",\"\",VLOOKUP(C10,varHS!$D$1:$M$100,9,FALSE))","v":""},{"$f":"IF(C10=\"\",\"\",VLOOKUP(D10,varCS!$D$1:$M$100,9,FALSE))","v":""},{"$f":"IF('(hid) 05_WtAuswahl'!$A8=0,\"\",'(hid) 05_WtAuswahl'!Y8)","v":""},{"$f":"IF('(hid) 05_WtAuswahl'!$A8=0,\"\",'(hid) 05_WtAuswahl'!W8/1000)","v":""},{"$f":"IF('(hid) 05_WtAuswahl'!$A8=0,\"\",'(hid) 05_WtAuswahl'!D8)","v":""},{"$f":"IF('(hid) 05_WtAuswahl'!$A8=0,\"\",'(hid) 05_WtAuswahl'!E8)","v":""},{"$f":"IF('(hid) 05_WtAuswahl'!$A8=0,\"\",'(hid) 05_WtAuswahl'!F8)","v":""},{"$f":"IF('(hid) 05_WtAuswahl'!$A8=0,\"\",'(hid) 05_WtAuswahl'!G8)","v":""},{"$f":"IF('(hid) 05_WtAuswahl'!$A8=0,\"\",'(hid) 05_WtAuswahl'!Q8)","v":""},{"$f":"IF('(hid) 05_WtAuswahl'!$A8=0,\"\",'(hid) 05_WtAuswahl'!L8)","v":""},{"$f":"IF('(hid) 05_WtAuswahl'!$A8=0,\"\",'(hid) 05_WtAuswahl'!AA8)","v":""},{"$f":"IF('(hid) 05_WtAuswahl'!$A8=0,\"\",'(hid) 05_WtAuswahl'!AB8)","v":""},{"$f":"IF('(hid) 05_WtAuswahl'!$A8=0,\"\",'(hid) 05_WtAuswahl'!AC8)","v":""},{"$f":"IF('(hid) 05_WtAuswahl'!$A8=0,\"\",IF(OR(R10=0,Q10=0),0,R10/Q10))","v":""},{"$f":"IF('(hid) 05_WtAuswahl'!$A8=0,\"\",I10*rng_PE)","v":""},{"$f":"IF('(hid) 05_WtAuswahl'!$A8=0,\"\",I10*rng_CO2)","v":""},null,"Petrol"]
["",{"$f":"IF('(hid) 05_WtAuswahl'!$A9=0,\"\",'(hid) 05_WtAuswahl'!A9)","v":""},{"$f":"IF('(hid) 05_WtAuswahl'!$A9=0,\"\",'(hid) 05_WtAuswahl'!B9)","v":""},{"$f":"IF('(hid) 05_WtAuswahl'!$A9=0,\"\",'(hid) 05_WtAuswahl'!C9)","v":""},{"$f":"IF('(hid) 05_WtAuswahl'!$A9=0,\"\",\"WT \"&C11&\" --> \"&D11)","v":""},{"$f":"IF(C11=\"\",\"\",VLOOKUP(C11,varHS!$D$1:$M$100,9,FALSE))","v":""},{"$f":"IF(C11=\"\",\"\",VLOOKUP(D11,varCS!$D$1:$M$100,9,FALSE))","v":""},{"$f":"IF('(hid) 05_WtAuswahl'!$A9=0,\"\",'(hid) 05_WtAuswahl'!Y9)","v":""},{"$f":"IF('(hid) 05_WtAuswahl'!$A9=0,\"\",'(hid) 05_WtAuswahl'!W9/1000)","v":""},{"$f":"IF('(hid) 05_WtAuswahl'!$A9=0,\"\",'(hid) 05_WtAuswahl'!D9)","v":""},{"$f":"IF('(hid) 05_WtAuswahl'!$A9=0,\"\",'(hid) 05_WtAuswahl'!E9)","v":""},{"$f":"IF('(hid) 05_WtAuswahl'!$A9=0,\"\",'(hid) 05_WtAuswahl'!F9)","v":""},{"$f":"IF('(hid) 05_WtAuswahl'!$A9=0,\"\",'(hid) 05_WtAuswahl'!G9)","v":""},{"$f":"IF('(hid) 05_WtAuswahl'!$A9=0,\"\",'(hid) 05_WtAuswahl'!Q9)","v":""},{"$f":"IF('(hid) 05_WtAuswahl'!$A9=0,\"\",'(hid) 05_WtAuswahl'!L9)","v":""},{"$f":"IF('(hid) 05_WtAuswahl'!$A9=0,\"\",'(hid) 05_WtAuswahl'!AA9)","v":""},{"$f":"IF('(hid) 05_WtAuswahl'!$A9=0,\"\",'(hid) 05_WtAuswahl'!AB9)","v":""},{"$f":"IF('(hid) 05_WtAuswahl'!$A9=0,\"\",'(hid) 05_WtAuswahl'!AC9)","v":""},{"$f":"IF('(hid) 05_WtAuswahl'!$A9=0,\"\",IF(OR(R11=0,Q11=0),0,R11/Q11))","v":""},{"$f":"IF('(hid) 05_WtAuswahl'!$A9=0,\"\",I11*rng_PE)","v":""},{"$f":"IF('(hid) 05_WtAuswahl'!$A9=0,\"\",I11*rng_CO2)","v":""},null,"Biomass (Hackschnitzel)"]
["",{"$f":"IF('(hid) 05_WtAuswahl'!$A10=0,\"\",'(hid) 05_WtAuswahl'!A10)","v":""},{"$f":"IF('(hid) 05_WtAuswahl'!$A10=0,\"\",'(hid) 05_WtAuswahl'!B10)","v":""},{"$f":"IF('(hid) 05_WtAuswahl'!$A10=0,\"\",'(hid) 05_WtAuswahl'!C10)","v":""},{"$f":"IF('(hid) 05_WtAuswahl'!$A10=0,\"\",\"WT \"&C12&\" --> \"&D12)","v":""},{"$f":"IF(C12=\"\",\"\",VLOOKUP(C12,varHS!$D$1:$M$100,9,FALSE))","v":""},{"$f":"IF(C12=\"\",\"\",VLOOKUP(D12,varCS!$D$1:$M$100,9,FALSE))","v":""},{"$f":"IF('(hid) 05_WtAuswahl'!$A10=0,\"\",'(hid) 05_WtAuswahl'!Y10)","v":""},{"$f":"IF('(hid) 05_WtAuswahl'!$A10=0,\"\",'(hid) 05_WtAuswahl'!W10/1000)","v":""},{"$f":"IF('(hid) 05_WtAuswahl'!$A10=0,\"\",'(hid) 05_WtAuswahl'!D10)","v":""},{"$f":"IF('(hid) 05_WtAuswahl'!$A10=0,\"\",'(hid) 05_WtAuswahl'!E10)","v":""},{"$f":"IF('(hid) 05_WtAuswahl'!$A10=0,\"\",'(hid) 05_WtAuswahl'!F10)","v":""},{"$f":"IF('(hid) 05_WtAuswahl'!$A10=0,\"\",'(hid) 05_WtAuswahl'!G10)","v":""},{"$f":"IF('(hid) 05_WtAuswahl'!$A10=0,\"\",'(hid) 05_WtAuswahl'!Q10)","v":""},{"$f":"IF('(hid) 05_WtAuswahl'!$A10=0,\"\",'(hid) 05_WtAuswahl'!L10)","v":""},{"$f":"IF('(hid) 05_WtAuswahl'!$A10=0,\"\",'(hid) 05_WtAuswahl'!AA10)","v":""},{"$f":"IF('(hid) 05_WtAuswahl'!$A10=0,\"\",'(hid) 05_WtAuswahl'!AB10)","v":""},{"$f":"IF('(hid) 05_WtAuswahl'!$A10=0,\"\",'(hid) 05_WtAuswahl'!AC10)","v":""},{"$f":"IF('(hid) 05_WtAuswahl'!$A10=0,\"\",IF(OR(R12=0,Q12=0),0,R12/Q12))","v":""},{"$f":"IF('(hid) 05_WtAuswahl'!$A10=0,\"\",I12*rng_PE)","v":""},{"$f":"IF('(hid) 05_WtAuswahl'!$A10=0,\"\",I12*rng_CO2)","v":""},null,"Biogas"]
["",{"$f":"IF('(hid) 05_WtAuswahl'!$A11=0,\"\",'(hid) 05_WtAuswahl'!A11)","v":""},{"$f":"IF('(hid) 05_WtAuswahl'!$A11=0,\"\",'(hid) 05_WtAuswahl'!B11)","v":""},{"$f":"IF('(hid) 05_WtAuswahl'!$A11=0,\"\",'(hid) 05_WtAuswahl'!C11)","v":""},{"$f":"IF('(hid) 05_WtAuswahl'!$A11=0,\"\",\"WT \"&C13&\" --> \"&D13)","v":""},{"$f":"IF(C13=\"\",\"\",VLOOKUP(C13,varHS!$D$1:$M$100,9,FALSE))","v":""},{"$f":"IF(C13=\"\",\"\",VLOOKUP(D13,varCS!$D$1:$M$100,9,FALSE))","v":""},{"$f":"IF('(hid) 05_WtAuswahl'!$A11=0,\"\",'(hid) 05_WtAuswahl'!Y11)","v":""},{"$f":"IF('(hid) 05_WtAuswahl'!$A11=0,\"\",'(hid) 05_WtAuswahl'!W11/1000)","v":""},{"$f":"IF('(hid) 05_WtAuswahl'!$A11=0,\"\",'(hid) 05_WtAuswahl'!D11)","v":""},{"$f":"IF('(hid) 05_WtAuswahl'!$A11=0,\"\",'(hid) 05_WtAuswahl'!E11)","v":""},{"$f":"IF('(hid) 05_WtAuswahl'!$A11=0,\"\",'(hid) 05_WtAuswahl'!F11)","v":""},{"$f":"IF('(hid) 05_WtAuswahl'!$A11=0,\"\",'(hid) 05_WtAuswahl'!G11)","v":""},{"$f":"IF('(hid) 05_WtAuswahl'!$A11=0,\"\",'(hid) 05_WtAuswahl'!Q11)","v":""},{"$f":"IF('(hid) 05_WtAuswahl'!$A11=0,\"\",'(hid) 05_WtAuswahl'!L11)","v":""},{"$f":"IF('(hid) 05_WtAuswahl'!$A11=0,\"\",'(hid) 05_WtAuswahl'!AA11)","v":""},{"$f":"IF('(hid) 05_WtAuswahl'!$A11=0,\"\",'(hid) 05_WtAuswahl'!AB11)","v":""},{"$f":"IF('(hid) 05_WtAuswahl'!$A11=0,\"\",'(hid) 05_WtAuswahl'!AC11)","v":""},{"$f":"IF('(hid) 05_WtAuswahl'!$A11=0,\"\",IF(OR(R13=0,Q13=0),0,R13/Q13))","v":""},{"$f":"IF('(hid) 05_WtAuswahl'!$A11=0,\"\",I13*rng_PE)","v":""},{"$f":"IF('(hid) 05_WtAuswahl'!$A11=0,\"\",I13*rng_CO2)","v":""},null,"Fernwärme (bei 70 % fossil)"]
["",{"$f":"IF('(hid) 05_WtAuswahl'!$A12=0,\"\",'(hid) 05_WtAuswahl'!A12)","v":""},{"$f":"IF('(hid) 05_WtAuswahl'!$A12=0,\"\",'(hid) 05_WtAuswahl'!B12)","v":""},{"$f":"IF('(hid) 05_WtAuswahl'!$A12=0,\"\",'(hid) 05_WtAuswahl'!C12)","v":""},{"$f":"IF('(hid) 05_WtAuswahl'!$A12=0,\"\",\"WT \"&C14&\" --> \"&D14)","v":""},{"$f":"IF(C14=\"\",\"\",VLOOKUP(C14,varHS!$D$1:$M$100,9,FALSE))","v":""},{"$f":"IF(C14=\"\",\"\",VLOOKUP(D14,varCS!$D$1:$M$100,9,FALSE))","v":""},{"$f":"IF('(hid) 05_WtAuswahl'!$A12=0,\"\",'(hid) 05_WtAuswahl'!Y12)","v":""},{"$f":"IF('(hid) 05_WtAuswahl'!$A12=0,\"\",'(hid) 05_WtAuswahl'!W12/1000)","v":""},{"$f":"IF('(hid) 05_WtAuswahl'!$A12=0,\"\",'(hid) 05_WtAuswahl'!D12)","v":""},{"$f":"IF('(hid) 05_WtAuswahl'!$A12=0,\"\",'(hid) 05_WtAuswahl'!E12)","v":""},{"$f":"IF('(hid) 05_WtAuswahl'!$A12=0,\"\",'(hid) 05_WtAuswahl'!F12)","v":""},{"$f":"IF('(hid) 05_WtAuswahl'!$A12=0,\"\",'(hid) 05_WtAuswahl'!G12)","v":""},{"$f":"IF('(hid) 05_WtAuswahl'!$A12=0,\"\",'(hid) 05_WtAuswahl'!Q12)","v":""},{"$f":"IF('(hid) 05_WtAuswahl'!$A12=0,\"\",'(hid) 05_WtAuswahl'!L12)","v":""},{"$f":"IF('(hid) 05_WtAuswahl'!$A12=0,\"\",'(hid) 05_WtAuswahl'!AA12)","v":""},{"$f":"IF('(hid) 05_WtAuswahl'!$A12=0,\"\",'(hid) 05_WtAuswahl'!AB12)","v":""},{"$f":"IF('(hid) 05_WtAuswahl'!$A12=0,\"\",'(hid) 05_WtAuswahl'!AC12)","v":""},{"$f":"IF('(hid) 05_WtAuswahl'!$A12=0,\"\",IF(OR(R14=0,Q14=0),0,R14/Q14))","v":""},{"$f":"IF('(hid) 05_WtAuswahl'!$A12=0,\"\",I14*rng_PE)","v":""},{"$f":"IF('(hid) 05_WtAuswahl'!$A12=0,\"\",I14*rng_CO2)","v":""},null,"Strom"]
[null,null,null,null,null,null,null,"SUMME",{"$f":"IF(SUM(I5:I14)=0,\"\",SUM(I5:I14))","v":""},null,null,null,null,null,null,"SUMME",{"$f":"IF(SUM(Q5:Q14)=0,\"\",SUM(Q5:Q14))","v":""},{"$f":"IF(SUM(R5:R14)=0,\"\",SUM(R5:R14))","v":""},"SUMME",{"$f":"IF(SUM(T5:T14)=0,\"\",SUM(T5:T14))","v":""},""]
[null,null,"Wählen Sie einen Wärmetauscher aus um ihn weiter zu bearbeiten"]
[]
[null,null,"Ökonomische Bewertung ",null,null,null,null,null,null,null,null,null,"Energie- und CO2-Einsparungen"]

{"sheet":"Annex CP-Werte","index":5,"n_rows":165,"n_cols":2,"rows_kept":165,"cut":false,"hidden":false,"merged":[]}
["Bezeichnung","cp [kJ/kg*K]"]
["Wasser_fluessig",4.1859999999999999]
["Eis",1.93]
["Aepfel",3.8490000000000002]
["Aepfel_gefroren",2.0920000000000001]
["Ammoniak_fluessig(20°C_1bar)",2.1640000000000001]
["Ammoniak_gasfoermig",2.06]
["Apfelmus",3.73]
["Apfelsaft",3.85]
["Bananen",3.347]
["Bananen_gefroren",1.7569999999999999]
["Beeren_frisch",3.7240000000000002]
["Beeren_frisch_gefroren",1.925]
["Bier",3.766]
["Bier_gefroren",1.883]
["Birnen",3.766]
["Birnen_gefroren",2.008]
["Bohnen",3.8490000000000002]
["Bohnen_gefroren",1.966]
["Bohnen_getrocknet",1.2549999999999999]
["Butter fest",1.4237855946398661]
["Butter flüssig",2.5125628140703515]
["Eidotter",2.81]
["Eier",3.18]
["Eier_gefroren",1.6739999999999999]
["Eiklar",3.85]
["Einmachgemüse",3.85]
["Eiscreme",3.2639999999999998]
["Eiscreme_gefroren",1.883]
["Erbsen_getrocknet",1.1719999999999999]
["Erbsen_getrocknet_gefroren",0.92]
["Erbsen_gruen",3.347]
["Erbsen_gruen_gefroren",1.7569999999999999]
["Erdbeeren",3.8490000000000002]
["Erdbeeren_gefroren",1.966]
["Fisch_fett",2.8450000000000002]
["Fisch_fett_gefroren",1.59]
["Fisch_frisch",3.431]
["Fisch_frisch_gefroren",1.7989999999999999]
["Fisch_geraeuchert",3.18]
["Fisch_getrocknet",2.343]
["Fisch_getrocknet_gefroren",1.423]
["Fleisch_gesalzen",2.5939999999999999]
["Fleisch_gesalzen_gefroren",1.506]
["Früchte",3.7]
["Fruchtzubereitung (Früchte & Zucker)",2.2000000000000002]
["Gefluegel",3.347]
["Gefluegel_gefroren",1.7989999999999999]
["Glyzerin(20°C)",2.4279999999999999]
["Grapefruit",3.8490000000000002]
["Grapefruit_gefroren",2.008]
["Gurke",4.1029999999999998]
["Honig",1.47]
["Honig",1.464]
["Honig_gefroren",1.0880000000000001]
["Kalb",2.9710000000000001]
["Kalb_gefroren",1.6319999999999999]
["Karotten",3.64]
["Karotten_gefroren",1.883]
["Kartoffeln",3.222]
["Kartoffeln_gefroren",1.6739999999999999]
["Käse fest",1.4656616415410384]
["Käse flüssig",2.6800670016750416]
["Kirschen",3.64]
["Kirschen_gefroren",1.925]
["Kohl",3.891]
["Kohl_gefroren",1.966]
["Kuerbis",3.8490000000000002]
["Lactose_alpha(0°C)",0.95799999999999996]
["Lactose_beta(0°C)",1.2090000000000001]
["Leinoel",1.845]
["Leinoel_fluessig",1.88]
["Luft",1.012]
["Magermilchkonzentrat (20%TS)",3.7549999999999999]
["Magermilchkonzentrat (40%TS)",2.964]
["Mais_getrocknet",1.1719999999999999]
["Mais_getrocknet__gefroren",0.96199999999999997]
["Margarine",3.347]
["Mehl",1.339]
["Mehl_gefroren",1.004]
["Melonen",3.8490000000000002]
["Melonen_gefroren",1.966]
["Milch",3.8944723618090453]
["Milch entrahmt",3.7970000000000002]
["Molke",4.0940000000000003]
["Molkekonzentrat (35%TS)",3.8]
["Molkekonzentrat (58%TS)",3]
["Molkepulver",1.256]
["Oel",1.6739999999999999]
["Oel_gefroren",1.464]
["Olivenoel(60°C)",1.97]
["Orangen",3.8490000000000002]
["Orangen_gefroren",2.0920000000000001]
["Orangensaft_frisch",3.89]
["Palmfett",2.09]
["Pfirsiche",3.8490000000000002]
["Pfirsiche_gefroren",2.008]
["Pflanzenfett",1.464]
["Pflaumen_frisch",3.4729999999999999]
["Pflaumen_gefroren",1.841]
["Pilze",3.89]
["Pilze_gefroren",1.97]
["Preiselbeeren",3.8069999999999999]
["Preiselbeeren_gefroren",1.966]
["Rahm (25-30%Fett)",2.8170000000000002]
["Rahm (45%Fett)",2.7879999999999998]
["Rind_fett",2.5099999999999998]
["Rind_fett_gefroren",1.464]
["Rind_getrocknet",1.423]
["Rind_getrocknet_gefroren",1.004]
["Rind_mager",3.222]
["Rind_mager_gefroren",1.7150000000000001]
["Rohmilch",3.7549999999999999]
["Runkelrueben",3.891]
["Salzhering",2.9710000000000001]
["Sauerkraut",3.8069999999999999]
["Sauerkraut_gefroren",1.966]
["Schinken",2.3010000000000002]
["Schinken_gefroren",1.883]
["Schmalz",2.2589999999999999]
["Schmalz_gefroren",1.2969999999999999]
["Schokolade",3.18]
["Schokolade_gefroren",3.1379999999999999]
["Schwein_fett",2.1339999999999999]
["Schwein_fett_gefroren",1.339]
["Schwein_mager",2.5099999999999998]
["Schwein_mager_gefroren",1.548]
["Schweinefleisch",2.14]
["Sellerie",3.8069999999999999]
["Sellerie_gefroren",1.883]
["Sirup",1.47]
["Sonnenblumenoel",1.883]
["Spargel",3.891]
["Spargel_gefroren",1.925]
["Speck",2.2999999999999998]
["Speck_gefroren",1.3]
["Speiseeis",3.2639999999999998]
["Speiseeis_gefroren",1.883]
["Speisezwiebeln",3.8069999999999999]
["Speisezwiebeln_gefroren",2.0499999999999998]
["Spinat",3.8]
["Stachelbeeren",3.8490000000000002]
["Stachelbeeren_gefroren",1.966]
["Teig",1.88]
["Tomaten",3.891]
["Tomaten_gefroren",1.925]
["Topfen",3.91]
["Trauben",3.8490000000000002]
["Trauben_gefroren",2.1760000000000002]
["Trockenfruechte",1.7569999999999999]
["Trockenfruechte_gefroren",1.1299999999999999]
["Vollkornbrot",2.85]
["Walnuesse",1.05]
["Walnuesse_gefroren",0.92]
["Wasser",4.1859999999999999]
["Wein",3.766]
["Weintrauben",3.86]
["Weintrauben_gefroren",1.88]
["Weissbrot",2.72]
["Weizenmehl",1.8]
["Wild",3.2639999999999998]
["Wild_gefroren",1.7150000000000001]
["Zitronen",3.8490000000000002]
["Zitronen_gefroren",2.0499999999999998]
["Zucker_fein(0°C)",1.25]

{"sheet":"(hid) 03_WtRawList","index":6,"n_rows":502,"n_cols":31,"rows_kept":502,"cut":false,"hidden":true,"merged":[]}
["WT ID","HS ID","CS ID","T HS ein","T CS ein","T HS aus","T CS aus","mcp HS","mcp CS","Q hx HS","Q hx CS","Duration HX","Duration ST","crit PO","crit EN","crit EX","crit TOT","dT",null,"WT ID (2x)",null,null,"E HX","E ST","Q HX","Q ST",null,"checks"]
[1,2,3,4,5,6,7,8,9,10,11,12,13,14,15,16,17,18,19,20,21,22,23,24,25,26,null,"qhx hs","qhx cs",null,"share hx/st"]
[0,0,0,0,0,0,0,0,0,0,0,0,0,0,0,0,0,0,0,0,0,0,0,0,0,0,0,0,0,{"$f":"AC3-Y3","v":0},{"$f":"W3/(W3+X3)","v":{"$error":"#DIV/0!"}}]
[0,0,0,0,0,0,0,0,0,0,0,0,0,0,0,0,0,0,0,0,0,0,0,0,0,0,0,0,0,{"$f":"AC4-Y4","v":0},{"$f":"W4/(W4+X4)","v":{"$error":"#DIV/0!"}}]
[0,0,0,0,0,0,0,0,0,0,0,0,0,0,0,0,0,0,0,0,0,0,0,0,0,0,0,0,0,0,{"$error":"#DIV/0!"}]
[0,0,0,0,0,0,0,0,0,0,0,0,0,0,0,0,0,0,0,0,0,0,0,0,0,0,0,0,0,0,{"$error":"#DIV/0!"}]
[0,0,0,0,0,0,0,0,0,0,0,0,0,0,0,0,0,0,0,0,0,0,0,0,0,0,0,0,0,0,{"$error":"#DIV/0!"}]
[0,0,0,0,0,0,0,0,0,0,0,0,0,0,0,0,0,0,0,0,0,0,0,0,0,0,0,0,0,0,{"$error":"#DIV/0!"}]
[0,0,0,0,0,0,0,0,0,0,0,0,0,0,0,0,0,0,0,0,0,0,0,0,0,0,0,0,0,0,{"$error":"#DIV/0!"}]
[0,0,0,0,0,0,0,0,0,0,0,0,0,0,0,0,0,0,0,0,0,0,0,0,0,0,0,0,0,0,{"$error":"#DIV/0!"}]
[0,0,0,0,0,0,0,0,0,0,0,0,0,0,0,0,0,0,0,0,0,0,0,0,0,0,0,0,0,0,{"$error":"#DIV/0!"}]
[0,0,0,0,0,0,0,0,0,0,0,0,0,0,0,0,0,0,0,0,0,0,0,0,0,0,0,0,0,0,{"$error":"#DIV/0!"}]
[0,0,0,0,0,0,0,0,0,0,0,0,0,0,0,0,0,0,0,0,0,0,0,0,0,0,0,0,0,0,{"$error":"#DIV/0!"}]
[0,0,0,0,0,0,0,0,0,0,0,0,0,0,0,0,0,0,0,0,0,0,0,0,0,0,0,0,0,0,{"$error":"#DIV/0!"}]
[0,0,0,0,0,0,0,0,0,0,0,0,0,0,0,0,0,0,0,0,0,0,0,0,0,0,0,0,0,0,{"$error":"#DIV/0!"}]
[0,0,0,0,0,0,0,0,0,0,0,0,0,0,0,0,0,0,0,0,0,0,0,0,0,0,0,0,0,0,{"$error":"#DIV/0!"}]
[0,0,0,0,0,0,0,0,0,0,0,0,0,0,0,0,0,0,0,0,0,0,0,0,0,0,0,0,0,0,{"$error":"#DIV/0!"}]
[0,0,0,0,0,0,0,0,0,0,0,0,0,0,0,0,0,0,0,0,0,0,0,0,0,0,0,0,0,0,{"$error":"#DIV/0!"}]
[0,0,0,0,0,0,0,0,0,0,0,0,0,0,0,0,0,0,0,0,0,0,0,0,0,0,0,0,0,0,{"$error":"#DIV/0!"}]
[0,0,0,0,0,0,0,0,0,0,0,0,0,0,0,0,0,0,0,0,0,0,0,0,0,0,0,0,0,0,{"$error":"#DIV/0!"}]
[0,0,0,0,0,0,0,0,0,0,0,0,0,0,0,0,0,0,0,0,0,0,0,0,0,0,0,0,0,0,{"$error":"#DIV/0!"}]
[0,0,0,0,0,0,0,0,0,0,0,0,0,0,0,0,0,0,0,0,0,0,0,0,0,0,0,0,0,0,{"$error":"#DIV/0!"}]
[0,0,0,0,0,0,0,0,0,0,0,0,0,0,0,0,0,0,0,0,0,0,0,0,0,0,0,0,0,0,{"$error":"#DIV/0!"}]
[0,0,0,0,0,0,0,0,0,0,0,0,0,0,0,0,0,0,0,0,0,0,0,0,0,0,0,0,0,0,{"$error":"#DIV/0!"}]
[0,0,0,0,0,0,0,0,0,0,0,0,0,0,0,0,0,0,0,0,0,0,0,0,0,0,0,0,0,0,{"$error":"#DIV/0!"}]
[0,0,0,0,0,0,0,0,0,0,0,0,0,0,0,0,0,0,0,0,0,0,0,0,0,0,0,0,0,0,{"$error":"#DIV/0!"}]
[0,0,0,0,0,0,0,0,0,0,0,0,0,0,0,0,0,0,0,0,0,0,0,0,0,0,0,0,0,0,{"$error":"#DIV/0!"}]
[0,0,0,0,0,0,0,0,0,0,0,0,0,0,0,0,0,0,0,0,0,0,0,0,0,0,0,0,0,0,{"$error":"#DIV/0!"}]
[0,0,0,0,0,0,0,0,0,0,0,0,0,0,0,0,0,0,0,0,0,0,0,0,0,0,0,0,0,0,{"$error":"#DIV/0!"}]
[0,0,0,0,0,0,0,0,0,0,0,0,0,0,0,0,0,0,0,0,0,0,0,0,0,0,0,0,0,0,{"$error":"#DIV/0!"}]
[0,0,0,0,0,0,0,0,0,0,0,0,0,0,0,0,0,0,0,0,0,0,0,0,0,0,0,0,0,0,{"$error":"#DIV/0!"}]
[0,0,0,0,0,0,0,0,0,0,0,0,0,0,0,0,0,0,0,0,0,0,0,0,0,0,0,0,0,0,{"$error":"#DIV/0!"}]
[0,0,0,0,0,0,0,0,0,0,0,0,0,0,0,0,0,0,0,0,0,0,0,0,0,0,0,0,0]
[0,0,0,0,0,0,0,0,0,0,0,0,0,0,0,0,0,0,0,0,0,0,0,0,0,0,0,0,0]
[0,0,0,0,0,0,0,0,0,0,0,0,0,0,0,0,0,0,0,0,0,0,0,0,0,0,0,0,0]
[0,0,0,0,0,0,0,0,0,0,0,0,0,0,0,0,0,0,0,0,0,0,0,0,0,0,0,0,0]
[0,0,0,0,0,0,0,0,0,0,0,0,0,0,0,0,0,0,0,0,0,0,0,0,0,0,0,0,0]
[0,0,0,0,0,0,0,0,0,0,0,0,0,0,0,0,0,0,0,0,0,0,0,0,0,0,0,0,0]
[0,0,0,0,0,0,0,0,0,0,0,0,0,0,0,0,0,0,0,0,0,0,0,0,0,0,0,0,0]
[0,0,0,0,0,0,0,0,0,0,0,0,0,0,0,0,0,0,0,0,0,0,0,0,0,0,0,0,0]
[0,0,0,0,0,0,0,0,0,0,0,0,0,0,0,0,0,0,0,0,0,0,0,0,0,0,0,0,0]
[0,0,0,0,0,0,0,0,0,0,0,0,0,0,0,0,0,0,0,0,0,0,0,0,0,0,0,0,0]
[0,0,0,0,0,0,0,0,0,0,0,0,0,0,0,0,0,0,0,0,0,0,0,0,0,0,0,0,0]
[0,0,0,0,0,0,0,0,0,0,0,0,0,0,0,0,0,0,0,0,0,0,0,0,0,0,0,0,0]
[0,0,0,0,0,0,0,0,0,0,0,0,0,0,0,0,0,0,0,0,0,0,0,0,0,0,0,0,0]
[0,0,0,0,0,0,0,0,0,0,0,0,0,0,0,0,0,0,0,0,0,0,0,0,0,0,0,0,0]
[0,0,0,0,0,0,0,0,0,0,0,0,0,0,0,0,0,0,0,0,0,0,0,0,0,0,0,0,0]
[0,0,0,0,0,0,0,0,0,0,0,0,0,0,0,0,0,0,0,0,0,0,0,0,0,0,0,0,0]
[0,0,0,0,0,0,0,0,0,0,0,0,0,0,0,0,0,0,0,0,0,0,0,0,0,0,0,0,0]
[0,0,0,0,0,0,0,0,0,0,0,0,0,0,0,0,0,0,0,0,0,0,0,0,0,0,0,0,0]
[0,0,0,0,0,0,0,0,0,0,0,0,0,0,0,0,0,0,0,0,0,0,0,0,0,0,0,0,0]
[0,0,0,0,0,0,0,0,0,0,0,0,0,0,0,0,0,0,0,0,0,0,0,0,0,0,0,0,0]
[0,0,0,0,0,0,0,0,0,0,0,0,0,0,0,0,0,0,0,0,0,0,0,0,0,0,0,0,0]
[0,0,0,0,0,0,0,0,0,0,0,0,0,0,0,0,0,0,0,0,0,0,0,0,0,0,0,0,0]
[0,0,0,0,0,0,0,0,0,0,0,0,0,0,0,0,0,0,0,0,0,0,0,0,0,0,0,0,0]
[0,0,0,0,0,0,0,0,0,0,0,0,0,0,0,0,0,0,0,0,0,0,0,0,0,0,0,0,0]
[0,0,0,0,0,0,0,0,0,0,0,0,0,0,0,0,0,0,0,0,0,0,0,0,0,0,0,0,0]
[0,0,0,0,0,0,0,0,0,0,0,0,0,0,0,0,0,0,0,0,0,0,0,0,0,0,0,0,0]
[0,0,0,0,0,0,0,0,0,0,0,0,0,0,0,0,0,0,0,0,0,0,0,0,0,0,0,0,0]
[0,0,0,0,0,0,0,0,0,0,0,0,0,0,0,0,0,0,0,0,0,0,0,0,0,0,0,0,0]
[0,0,0,0,0,0,0,0,0,0,0,0,0,0,0,0,0,0,0,0,0,0,0,0,0,0,0,0,0]
[0,0,0,0,0,0,0,0,0,0,0,0,0,0,0,0,0,0,0,0,0,0,0,0,0,0,0,0,0]
[0,0,0,0,0,0,0,0,0,0,0,0,0,0,0,0,0,0,0,0,0,0,0,0,0,0,0,0,0]
[0,0,0,0,0,0,0,0,0,0,0,0,0,0,0,0,0,0,0,0,0,0,0,0,0,0,0,0,0]
[0,0,0,0,0,0,0,0,0,0,0,0,0,0,0,0,0,0,0,0,0,0,0,0,0,0,0,0,0]
[0,0,0,0,0,0,0,0,0,0,0,0,0,0,0,0,0,0,0,0,0,0,0,0,0,0,0,0,0]
[0,0,0,0,0,0,0,0,0,0,0,0,0,0,0,0,0,0,0,0,0,0,0,0,0,0,0,0,0]
[0,0,0,0,0,0,0,0,0,0,0,0,0,0,0,0,0,0,0,0,0,0,0,0,0,0,0,0,0]
[0,0,0,0,0,0,0,0,0,0,0,0,0,0,0,0,0,0,0,0,0,0,0,0,0,0,0,0,0]
[0,0,0,0,0,0,0,0,0,0,0,0,0,0,0,0,0,0,0,0,0,0,0,0,0,0,0,0,0]
[0,0,0,0,0,0,0,0,0,0,0,0,0,0,0,0,0,0,0,0,0,0,0,0,0,0,0,0,0]
[0,0,0,0,0,0,0,0,0,0,0,0,0,0,0,0,0,0,0,0,0,0,0,0,0,0,0,0,0]
[0,0,0,0,0,0,0,0,0,0,0,0,0,0,0,0,0,0,0,0,0,0,0,0,0,0,0,0,0]
[0,0,0,0,0,0,0,0,0,0,0,0,0,0,0,0,0,0,0,0,0,0,0,0,0,0,0,0,0]
[0,0,0,0,0,0,0,0,0,0,0,0,0,0,0,0,0,0,0,0,0,0,0,0,0,0,0,0,0]
[0,0,0,0,0,0,0,0,0,0,0,0,0,0,0,0,0,0,0,0,0,0,0,0,0,0,0,0,0]
[0,0,0,0,0,0,0,0,0,0,0,0,0,0,0,0,0,0,0,0,0,0,0,0,0,0,0,0,0]
[0,0,0,0,0,0,0,0,0,0,0,0,0,0,0,0,0,0,0,0,0,0,0,0,0,0,0,0,0]
[0,0,0,0,0,0,0,0,0,0,0,0,0,0,0,0,0,0,0,0,0,0,0,0,0,0,0,0,0]
[0,0,0,0,0,0,0,0,0,0,0,0,0,0,0,0,0,0,0,0,0,0,0,0,0,0,0,0,0]
[0,0,0,0,0,0,0,0,0,0,0,0,0,0,0,0,0,0,0,0,0,0,0,0,0,0,0,0,0]
[0,0,0,0,0,0,0,0,0,0,0,0,0,0,0,0,0,0,0,0,0,0,0,0,0,0,0,0,0]
[0,0,0,0,0,0,0,0,0,0,0,0,0,0,0,0,0,0,0,0,0,0,0,0,0,0,0,0,0]
[0,0,0,0,0,0,0,0,0,0,0,0,0,0,0,0,0,0,0,0,0,0,0,0,0,0,0,0,0]
[0,0,0,0,0,0,0,0,0,0,0,0,0,0,0,0,0,0,0,0,0,0,0,0,0,0,0,0,0]
[0,0,0,0,0,0,0,0,0,0,0,0,0,0,0,0,0,0,0,0,0,0,0,0,0,0,0,0,0]
[0,0,0,0,0,0,0,0,0,0,0,0,0,0,0,0,0,0,0,0,0,0,0,0,0,0,0,0,0]
[0,0,0,0,0,0,0,0,0,0,0,0,0,0,0,0,0,0,0,0,0,0,0,0,0,0,0,0,0]
[0,0,0,0,0,0,0,0,0,0,0,0,0,0,0,0,0,0,0,0,0,0,0,0,0,0,0,0,0]
[0,0,0,0,0,0,0,0,0,0,0,0,0,0,0,0,0,0,0,0,0,0,0,0,0,0,0,0,0]
[0,0,0,0,0,0,0,0,0,0,0,0,0,0,0,0,0,0,0,0,0,0,0,0,0,0,0,0,0]
[0,0,0,0,0,0,0,0,0,0,0,0,0,0,0,0,0,0,0,0,0,0,0,0,0,0,0,0,0]
[0,0,0,0,0,0,0,0,0,0,0,0,0,0,0,0,0,0,0,0,0,0,0,0,0,0,0,0,0]
[0,0,0,0,0,0,0,0,0,0,0,0,0,0,0,0,0,0,0,0,0,0,0,0,0,0,0,0,0]
[0,0,0,0,0,0,0,0,0,0,0,0,0,0,0,0,0,0,0,0,0,0,0,0,0,0,0,0,0]
[0,0,0,0,0,0,0,0,0,0,0,0,0,0,0,0,0,0,0,0,0,0,0,0,0,0,0,0,0]
[0,0,0,0,0,0,0,0,0,0,0,0,0,0,0,0,0,0,0,0,0,0,0,0,0,0,0,0,0]
[0,0,0,0,0,0,0,0,0,0,0,0,0,0,0,0,0,0,0,0,0,0,0,0,0,0,0,0,0]
[0,0,0,0,0,0,0,0,0,0,0,0,0,0,0,0,0,0,0,0,0,0,0,0,0,0,0,0,0]
[0,0,0,0,0,0,0,0,0,0,0,0,0,0,0,0,0,0,0,0,0,0,0,0,0,0,0,0,0]
[0,0,0,0,0,0,0,0,0,0,0,0,0,0,0,0,0,0,0,0,0,0,0,0,0,0,0,0,0]
[0,0,0,0,0,0,0,0,0,0,0,0,0,0,0,0,0,0,0,0,0,0,0,0,0,0,0,0,0]
[0,0,0,0,0,0,0,0,0,0,0,0,0,0,0,0,0,0,0,0,0,0,0,0,0,0,0,0,0]
[0,0,0,0,0,0,0,0,0,0,0,0,0,0,0,0,0,0,0,0,0,0,0,0,0,0,0,0,0]
[0,0,0,0,0,0,0,0,0,0,0,0,0,0,0,0,0,0,0,0,0,0,0,0,0,0,0,0,0]
[0,0,0,0,0,0,0,0,0,0,0,0,0,0,0,0,0,0,0,0,0,0,0,0,0,0,0,0,0]
[0,0,0,0,0,0,0,0,0,0,0,0,0,0,0,0,0,0,0,0,0,0,0,0,0,0,0,0,0]
[0,0,0,0,0,0,0,0,0,0,0,0,0,0,0,0,0,0,0,0,0,0,0,0,0,0,0,0,0]
[0,0,0,0,0,0,0,0,0,0,0,0,0,0,0,0,0,0,0,0,0,0,0,0,0,0,0,0,0]
[0,0,0,0,0,0,0,0,0,0,0,0,0,0,0,0,0,0,0,0,0,0,0,0,0,0,0,0,0]
[0,0,0,0,0,0,0,0,0,0,0,0,0,0,0,0,0,0,0,0,0,0,0,0,0,0,0,0,0]
[0,0,0,0,0,0,0,0,0,0,0,0,0,0,0,0,0,0,0,0,0,0,0,0,0,0,0,0,0]
[0,0,0,0,0,0,0,0,0,0,0,0,0,0,0,0,0,0,0,0,0,0,0,0,0,0,0,0,0]
[0,0,0,0,0,0,0,0,0,0,0,0,0,0,0,0,0,0,0,0,0,0,0,0,0,0,0,0,0]
[0,0,0,0,0,0,0,0,0,0,0,0,0,0,0,0,0,0,0,0,0,0,0,0,0,0,0,0,0]
[0,0,0,0,0,0,0,0,0,0,0,0,0,0,0,0,0,0,0,0,0,0,0,0,0,0,0,0,0]
[0,0,0,0,0,0,0,0,0,0,0,0,0,0,0,0,0,0,0,0,0,0,0,0,0,0,0,0,0]
[0,0,0,0,0,0,0,0,0,0,0,0,0,0,0,0,0,0,0,0,0,0,0,0,0,0,0,0,0]
[0,0,0,0,0,0,0,0,0,0,0,0,0,0,0,0,0,0,0,0,0,0,0,0,0,0,0,0,0]
[0,0,0,0,0,0,0,0,0,0,0,0,0,0,0,0,0,0,0,0,0,0,0,0,0,0,0,0,0]
[0,0,0,0,0,0,0,0,0,0,0,0,0,0,0,0,0,0,0,0,0,0,0,0,0,0,0,0,0]
[0,0,0,0,0,0,0,0,0,0,0,0,0,0,0,0,0,0,0,0,0,0,0,0,0,0,0,0,0]
[0,0,0,0,0,0,0,0,0,0,0,0,0,0,0,0,0,0,0,0,0,0,0,0,0,0,0,0,0]
[0,0,0,0,0,0,0,0,0,0,0,0,0,0,0,0,0,0,0,0,0,0,0,0,0,0,0,0,0]
[0,0,0,0,0,0,0,0,0,0,0,0,0,0,0,0,0,0,0,0,0,0,0,0,0,0,0,0,0]
[0,0,0,0,0,0,0,0,0,0,0,0,0,0,0,0,0,0,0,0,0,0,0,0,0,0,0,0,0]
[0,0,0,0,0,0,0,0,0,0,0,0,0,0,0,0,0,0,0,0,0,0,0,0,0,0,0,0,0]
[0,0,0,0,0,0,0,0,0,0,0,0,0,0,0,0,0,0,0,0,0,0,0,0,0,0,0,0,0]
[0,0,0,0,0,0,0,0,0,0,0,0,0,0,0,0,0,0,0,0,0,0,0,0,0,0,0,0,0]
[0,0,0,0,0,0,0,0,0,0,0,0,0,0,0,0,0,0,0,0,0,0,0,0,0,0,0,0,0]
[0,0,0,0,0,0,0,0,0,0,0,0,0,0,0,0,0,0,0,0,0,0,0,0,0,0,0,0,0]
[0,0,0,0,0,0,0,0,0,0,0,0,0,0,0,0,0,0,0,0,0,0,0,0,0,0,0,0,0]
[0,0,0,0,0,0,0,0,0,0,0,0,0,0,0,0,0,0,0,0,0,0,0,0,0,0,0,0,0]
[0,0,0,0,0,0,0,0,0,0,0,0,0,0,0,0,0,0,0,0,0,0,0,0,0,0,0,0,0]
[0,0,0,0,0,0,0,0,0,0,0,0,0,0,0,0,0,0,0,0,0,0,0,0,0,0,0,0,0]
[0,0,0,0,0,0,0,0,0,0,0,0,0,0,0,0,0,0,0,0,0,0,0,0,0,0,0,0,0]
[0,0,0,0,0,0,0,0,0,0,0,0,0,0,0,0,0,0,0,0,0,0,0,0,0,0,0,0,0]
[0,0,0,0,0,0,0,0,0,0,0,0,0,0,0,0,0,0,0,0,0,0,0,0,0,0,0,0,0]
[0,0,0,0,0,0,0,0,0,0,0,0,0,0,0,0,0,0,0,0,0,0,0,0,0,0,0,0,0]
[0,0,0,0,0,0,0,0,0,0,0,0,0,0,0,0,0,0,0,0,0,0,0,0,0,0,0,0,0]
[0,0,0,0,0,0,0,0,0,0,0,0,0,0,0,0,0,0,0,0,0,0,0,0,0,0,0,0,0]
[0,0,0,0,0,0,0,0,0,0,0,0,0,0,0,0,0,0,0,0,0,0,0,0,0,0,0,0,0]
[0,0,0,0,0,0,0,0,0,0,0,0,0,0,0,0,0,0,0,0,0,0,0,0,0,0,0,0,0]
[0,0,0,0,0,0,0,0,0,0,0,0,0,0,0,0,0,0,0,0,0,0,0,0,0,0,0,0,0]
[0,0,0,0,0,0,0,0,0,0,0,0,0,0,0,0,0,0,0,0,0,0,0,0,0,0,0,0,0]
[0,0,0,0,0,0,0,0,0,0,0,0,0,0,0,0,0,0,0,0,0,0,0,0,0,0,0,0,0]
[0,0,0,0,0,0,0,0,0,0,0,0,0,0,0,0,0,0,0,0,0,0,0,0,0,0,0,0,0]
[0,0,0,0,0,0,0,0,0,0,0,0,0,0,0,0,0,0,0,0,0,0,0,0,0,0,0,0,0]
[0,0,0,0,0,0,0,0,0,0,0,0,0,0,0,0,0,0,0,0,0,0,0,0,0,0,0,0,0]
[0,0,0,0,0,0,0,0,0,0,0,0,0,0,0,0,0,0,0,0,0,0,0,0,0,0,0,0,0]
[0,0,0,0,0,0,0,0,0,0,0,0,0,0,0,0,0,0,0,0,0,0,0,0,0,0,0,0,0]
[0,0,0,0,0,0,0,0,0,0,0,0,0,0,0,0,0,0,0,0,0,0,0,0,0,0,0,0,0]
[0,0,0,0,0,0,0,0,0,0,0,0,0,0,0,0,0,0,0,0,0,0,0,0,0,0,0,0,0]
[0,0,0,0,0,0,0,0,0,0,0,0,0,0,0,0,0,0,0,0,0,0,0,0,0,0,0,0,0]
[0,0,0,0,0,0,0,0,0,0,0,0,0,0,0,0,0,0,0,0,0,0,0,0,0,0,0,0,0]
[0,0,0,0,0,0,0,0,0,0,0,0,0,0,0,0,0,0,0,0,0,0,0,0,0,0,0,0,0]
[0,0,0,0,0,0,0,0,0,0,0,0,0,0,0,0,0,0,0,0,0,0,0,0,0,0,0,0,0]
[0,0,0,0,0,0,0,0,0,0,0,0,0,0,0,0,0,0,0,0,0,0,0,0,0,0,0,0,0]
[0,0,0,0,0,0,0,0,0,0,0,0,0,0,0,0,0,0,0,0,0,0,0,0,0,0,0,0,0]
[0,0,0,0,0,0,0,0,0,0,0,0,0,0,0,0,0,0,0,0,0,0,0,0,0,0,0,0,0]
[0,0,0,0,0,0,0,0,0,0,0,0,0,0,0,0,0,0,0,0,0,0,0,0,0,0,0,0,0]
[0,0,0,0,0,0,0,0,0,0,0,0,0,0,0,0,0,0,0,0,0,0,0,0,0,0,0,0,0]
[0,0,0,0,0,0,0,0,0,0,0,0,0,0,0,0,0,0,0,0,0,0,0,0,0,0,0,0,0]
[0,0,0,0,0,0,0,0,0,0,0,0,0,0,0,0,0,0,0,0,0,0,0,0,0,0,0,0,0]
[0,0,0,0,0,0,0,0,0,0,0,0,0,0,0,0,0,0,0,0,0,0,0,0,0,0,0,0,0]
[0,0,0,0,0,0,0,0,0,0,0,0,0,0,0,0,0,0,0,0,0,0,0,0,0,0,0,0,0]
[0,0,0,0,0,0,0,0,0,0,0,0,0,0,0,0,0,0,0,0,0,0,0,0,0,0,0,0,0]
[0,0,0,0,0,0,0,0,0,0,0,0,0,0,0,0,0,0,0,0,0,0,0,0,0,0,0,0,0]
[0,0,0,0,0,0,0,0,0,0,0,0,0,0,0,0,0,0,0,0,0,0,0,0,0,0,0,0,0]
[0,0,0,0,0,0,0,0,0,0,0,0,0,0,0,0,0,0,0,0,0,0,0,0,0,0,0,0,0]
[0,0,0,0,0,0,0,0,0,0,0,0,0,0,0,0,0,0,0,0,0,0,0,0,0,0,0,0,0]
[0,0,0,0,0,0,0,0,0,0,0,0,0,0,0,0,0,0,0,0,0,0,0,0,0,0,0,0,0]
[0,0,0,0,0,0,0,0,0,0,0,0,0,0,0,0,0,0,0,0,0,0,0,0,0,0,0,0,0]
[0,0,0,0,0,0,0,0,0,0,0,0,0,0,0,0,0,0,0,0,0,0,0,0,0,0,0,0,0]
[0,0,0,0,0,0,0,0,0,0,0,0,0,0,0,0,0,0,0,0,0,0,0,0,0,0,0,0,0]
[0,0,0,0,0,0,0,0,0,0,0,0,0,0,0,0,0,0,0,0,0,0,0,0,0,0,0,0,0]
[0,0,0,0,0,0,0,0,0,0,0,0,0,0,0,0,0,0,0,0,0,0,0,0,0,0,0,0,0]
[0,0,0,0,0,0,0,0,0,0,0,0,0,0,0,0,0,0,0,0,0,0,0,0,0,0,0,0,0]
[0,0,0,0,0,0,0,0,0,0,0,0,0,0,0,0,0,0,0,0,0,0,0,0,0,0,0,0,0]
[0,0,0,0,0,0,0,0,0,0,0,0,0,0,0,0,0,0,0,0,0,0,0,0,0,0,0,0,0]
[0,0,0,0,0,0,0,0,0,0,0,0,0,0,0,0,0,0,0,0,0,0,0,0,0,0,0,0,0]
[0,0,0,0,0,0,0,0,0,0,0,0,0,0,0,0,0,0,0,0,0,0,0,0,0,0,0,0,0]
[0,0,0,0,0,0,0,0,0,0,0,0,0,0,0,0,0,0,0,0,0,0,0,0,0,0,0,0,0]
[0,0,0,0,0,0,0,0,0,0,0,0,0,0,0,0,0,0,0,0,0,0,0,0,0,0,0,0,0]
[0,0,0,0,0,0,0,0,0,0,0,0,0,0,0,0,0,0,0,0,0,0,0,0,0,0,0,0,0]
[0,0,0,0,0,0,0,0,0,0,0,0,0,0,0,0,0,0,0,0,0,0,0,0,0,0,0,0,0]
[0,0,0,0,0,0,0,0,0,0,0,0,0,0,0,0,0,0,0,0,0,0,0,0,0,0,0,0,0]
[0,0,0,0,0,0,0,0,0,0,0,0,0,0,0,0,0,0,0,0,0,0,0,0,0,0,0,0,0]
[0,0,0,0,0,0,0,0,0,0,0,0,0,0,0,0,0,0,0,0,0,0,0,0,0,0,0,0,0]
[0,0,0,0,0,0,0,0,0,0,0,0,0,0,0,0,0,0,0,0,0,0,0,0,0,0,0,0,0]
[0,0,0,0,0,0,0,0,0,0,0,0,0,0,0,0,0,0,0,0,0,0,0,0,0,0,0,0,0]
[0,0,0,0,0,0,0,0,0,0,0,0,0,0,0,0,0,0,0,0,0,0,0,0,0,0,0,0,0]
[0,0,0,0,0,0,0,0,0,0,0,0,0,0,0,0,0,0,0,0,0,0,0,0,0,0,0,0,0]
[0,0,0,0,0,0,0,0,0,0,0,0,0,0,0,0,0,0,0,0,0,0,0,0,0,0,0,0,0]
[0,0,0,0,0,0,0,0,0,0,0,0,0,0,0,0,0,0,0,0,0,0,0,0,0,0,0,0,0]
[0,0,0,0,0,0,0,0,0,0,0,0,0,0,0,0,0,0,0,0,0,0,0,0,0,0,0,0,0]
[0,0,0,0,0,0,0,0,0,0,0,0,0,0,0,0,0,0,0,0,0,0,0,0,0,0,0,0,0]
[0,0,0,0,0,0,0,0,0,0,0,0,0,0,0,0,0,0,0,0,0,0,0,0,0,0,0,0,0]
[0,0,0,0,0,0,0,0,0,0,0,0,0,0,0,0,0,0,0,0,0,0,0,0,0,0,0,0,0]
[0,0,0,0,0,0,0,0,0,0,0,0,0,0,0,0,0,0,0,0,0,0,0,0,0,0,0,0,0]
[0,0,0,0,0,0,0,0,0,0,0,0,0,0,0,0,0,0,0,0,0,0,0,0,0,0,0,0,0]
[0,0,0,0,0,0,0,0,0,0,0,0,0,0,0,0,0,0,0,0,0,0,0,0,0,0,0,0,0]
[0,0,0,0,0,0,0,0,0,0,0,0,0,0,0,0,0,0,0,0,0,0,0,0,0,0,0,0,0]
[0,0,0,0,0,0,0,0,0,0,0,0,0,0,0,0,0,0,0,0,0,0,0,0,0,0,0,0,0]
[0,0,0,0,0,0,0,0,0,0,0,0,0,0,0,0,0,0,0,0,0,0,0,0,0,0,0,0,0]
[0,0,0,0,0,0,0,0,0,0,0,0,0,0,0,0,0,0,0,0,0,0,0,0,0,0,0,0,0]
[0,0,0,0,0,0,0,0,0,0,0,0,0,0,0,0,0,0,0,0,0,0,0,0,0,0,0,0,0]
[0,0,0,0,0,0,0,0,0,0,0,0,0,0,0,0,0,0,0,0,0,0,0,0,0,0,0,0,0]
[0,0,0,0,0,0,0,0,0,0,0,0,0,0,0,0,0,0,0,0,0,0,0,0,0,0,0,0,0]
[0,0,0,0,0,0,0,0,0,0,0,0,0,0,0,0,0,0,0,0,0,0,0,0,0,0,0,0,0]
[0,0,0,0,0,0,0,0,0,0,0,0,0,0,0,0,0,0,0,0,0,0,0,0,0,0,0,0,0]
[0,0,0,0,0,0,0,0,0,0,0,0,0,0,0,0,0,0,0,0,0,0,0,0,0,0,0,0,0]
[0,0,0,0,0,0,0,0,0,0,0,0,0,0,0,0,0,0,0,0,0,0,0,0,0,0,0,0,0]
[0,0,0,0,0,0,0,0,0,0,0,0,0,0,0,0,0,0,0,0,0,0,0,0,0,0,0,0,0]
[0,0,0,0,0,0,0,0,0,0,0,0,0,0,0,0,0,0,0,0,0,0,0,0,0,0,0,0,0]
[0,0,0,0,0,0,0,0,0,0,0,0,0,0,0,0,0,0,0,0,0,0,0,0,0,0,0,0,0]
[0,0,0,0,0,0,0,0,0,0,0,0,0,0,0,0,0,0,0,0,0,0,0,0,0,0,0,0,0]
[0,0,0,0,0,0,0,0,0,0,0,0,0,0,0,0,0,0,0,0,0,0,0,0,0,0,0,0,0]
[0,0,0,0,0,0,0,0,0,0,0,0,0,0,0,0,0,0,0,0,0,0,0,0,0,0,0,0,0]
[0,0,0,0,0,0,0,0,0,0,0,0,0,0,0,0,0,0,0,0,0,0,0,0,0,0,0,0,0]
[0,0,0,0,0,0,0,0,0,0,0,0,0,0,0,0,0,0,0,0,0,0,0,0,0,0,0,0,0]
[0,0,0,0,0,0,0,0,0,0,0,0,0,0,0,0,0,0,0,0,0,0,0,0,0,0,0,0,0]
[0,0,0,0,0,0,0,0,0,0,0,0,0,0,0,0,0,0,0,0,0,0,0,0,0,0,0,0,0]
[0,0,0,0,0,0,0,0,0,0,0,0,0,0,0,0,0,0,0,0,0,0,0,0,0,0,0,0,0]
[0,0,0,0,0,0,0,0,0,0,0,0,0,0,0,0,0,0,0,0,0,0,0,0,0,0,0,0,0]
[0,0,0,0,0,0,0,0,0,0,0,0,0,0,0,0,0,0,0,0,0,0,0,0,0,0,0,0,0]
[0,0,0,0,0,0,0,0,0,0,0,0,0,0,0,0,0,0,0,0,0,0,0,0,0,0,0,0,0]
[0,0,0,0,0,0,0,0,0,0,0,0,0,0,0,0,0,0,0,0,0,0,0,0,0,0,0,0,0]
[0,0,0,0,0,0,0,0,0,0,0,0,0,0,0,0,0,0,0,0,0,0,0,0,0,0,0,0,0]
[0,0,0,0,0,0,0,0,0,0,0,0,0,0,0,0,0,0,0,0,0,0,0,0,0,0,0,0,0]
[0,0,0,0,0,0,0,0,0,0,0,0,0,0,0,0,0,0,0,0,0,0,0,0,0,0,0,0,0]
[0,0,0,0,0,0,0,0,0,0,0,0,0,0,0,0,0,0,0,0,0,0,0,0,0,0,0,0,0]
[0,0,0,0,0,0,0,0,0,0,0,0,0,0,0,0,0,0,0,0,0,0,0,0,0,0,0,0,0]
[0,0,0,0,0,0,0,0,0,0,0,0,0,0,0,0,0,0,0,0,0,0,0,0,0,0,0,0,0]
[0,0,0,0,0,0,0,0,0,0,0,0,0,0,0,0,0,0,0,0,0,0,0,0,0,0,0,0,0]
[0,0,0,0,0,0,0,0,0,0,0,0,0,0,0,0,0,0,0,0,0,0,0,0,0,0,0,0,0]
[0,0,0,0,0,0,0,0,0,0,0,0,0,0,0,0,0,0,0,0,0,0,0,0,0,0,0,0,0]
[0,0,0,0,0,0,0,0,0,0,0,0,0,0,0,0,0,0,0,0,0,0,0,0,0,0,0,0,0]
[0,0,0,0,0,0,0,0,0,0,0,0,0,0,0,0,0,0,0,0,0,0,0,0,0,0,0,0,0]
[0,0,0,0,0,0,0,0,0,0,0,0,0,0,0,0,0,0,0,0,0,0,0,0,0,0,0,0,0]
[0,0,0,0,0,0,0,0,0,0,0,0,0,0,0,0,0,0,0,0,0,0,0,0,0,0,0,0,0]
[0,0,0,0,0,0,0,0,0,0,0,0,0,0,0,0,0,0,0,0,0,0,0,0,0,0,0,0,0]
[0,0,0,0,0,0,0,0,0,0,0,0,0,0,0,0,0,0,0,0,0,0,0,0,0,0,0,0,0]
[0,0,0,0,0,0,0,0,0,0,0,0,0,0,0,0,0,0,0,0,0,0,0,0,0,0,0,0,0]
[0,0,0,0,0,0,0,0,0,0,0,0,0,0,0,0,0,0,0,0,0,0,0,0,0,0,0,0,0]
[0,0,0,0,0,0,0,0,0,0,0,0,0,0,0,0,0,0,0,0,0,0,0,0,0,0,0,0,0]
[0,0,0,0,0,0,0,0,0,0,0,0,0,0,0,0,0,0,0,0,0,0,0,0,0,0,0,0,0]
[0,0,0,0,0,0,0,0,0,0,0,0,0,0,0,0,0,0,0,0,0,0,0,0,0,0,0,0,0]
[0,0,0,0,0,0,0,0,0,0,0,0,0,0,0,0,0,0,0,0,0,0,0,0,0,0,0,0,0]
[0,0,0,0,0,0,0,0,0,0,0,0,0,0,0,0,0,0,0,0,0,0,0,0,0,0,0,0,0]
[0,0,0,0,0,0,0,0,0,0,0,0,0,0,0,0,0,0,0,0,0,0,0,0,0,0,0,0,0]
[0,0,0,0,0,0,0,0,0,0,0,0,0,0,0,0,0,0,0,0,0,0,0,0,0,0,0,0,0]
[0,0,0,0,0,0,0,0,0,0,0,0,0,0,0,0,0,0,0,0,0,0,0,0,0,0,0,0,0]
[0,0,0,0,0,0,0,0,0,0,0,0,0,0,0,0,0,0,0,0,0,0,0,0,0,0,0,0,0]
[0,0,0,0,0,0,0,0,0,0,0,0,0,0,0,0,0,0,0,0,0,0,0,0,0,0,0,0,0]
[0,0,0,0,0,0,0,0,0,0,0,0,0,0,0,0,0,0,0,0,0,0,0,0,0,0,0,0,0]
[0,0,0,0,0,0,0,0,0,0,0,0,0,0,0,0,0,0,0,0,0,0,0,0,0,0,0,0,0]
[0,0,0,0,0,0,0,0,0,0,0,0,0,0,0,0,0,0,0,0,0,0,0,0,0,0,0,0,0]
[0,0,0,0,0,0,0,0,0,0,0,0,0,0,0,0,0,0,0,0,0,0,0,0,0,0,0,0,0]
[0,0,0,0,0,0,0,0,0,0,0,0,0,0,0,0,0,0,0,0,0,0,0,0,0,0,0,0,0]
[0,0,0,0,0,0,0,0,0,0,0,0,0,0,0,0,0,0,0,0,0,0,0,0,0,0,0,0,0]
[0,0,0,0,0,0,0,0,0,0,0,0,0,0,0,0,0,0,0,0,0,0,0,0,0,0,0,0,0]
[0,0,0,0,0,0,0,0,0,0,0,0,0,0,0,0,0,0,0,0,0,0,0,0,0,0,0,0,0]
[0,0,0,0,0,0,0,0,0,0,0,0,0,0,0,0,0,0,0,0,0,0,0,0,0,0,0,0,0]
[0,0,0,0,0,0,0,0,0,0,0,0,0,0,0,0,0,0,0,0,0,0,0,0,0,0,0,0,0]
[0,0,0,0,0,0,0,0,0,0,0,0,0,0,0,0,0,0,0,0,0,0,0,0,0,0,0,0,0]
[0,0,0,0,0,0,0,0,0,0,0,0,0,0,0,0,0,0,0,0,0,0,0,0,0,0,0,0,0]
[0,0,0,0,0,0,0,0,0,0,0,0,0,0,0,0,0,0,0,0,0,0,0,0,0,0,0,0,0]
[0,0,0,0,0,0,0,0,0,0,0,0,0,0,0,0,0,0,0,0,0,0,0,0,0,0,0,0,0]
[0,0,0,0,0,0,0,0,0,0,0,0,0,0,0,0,0,0,0,0,0,0,0,0,0,0,0,0,0]
[0,0,0,0,0,0,0,0,0,0,0,0,0,0,0,0,0,0,0,0,0,0,0,0,0,0,0,0,0]
[0,0,0,0,0,0,0,0,0,0,0,0,0,0,0,0,0,0,0,0,0,0,0,0,0,0,0,0,0]
[0,0,0,0,0,0,0,0,0,0,0,0,0,0,0,0,0,0,0,0,0,0,0,0,0,0,0,0,0]
[0,0,0,0,0,0,0,0,0,0,0,0,0,0,0,0,0,0,0,0,0,0,0,0,0,0,0,0,0]
[0,0,0,0,0,0,0,0,0,0,0,0,0,0,0,0,0,0,0,0,0,0,0,0,0,0,0,0,0]
[0,0,0,0,0,0,0,0,0,0,0,0,0,0,0,0,0,0,0,0,0,0,0,0,0,0,0,0,0]
[0,0,0,0,0,0,0,0,0,0,0,0,0,0,0,0,0,0,0,0,0,0,0,0,0,0,0,0,0]
[0,0,0,0,0,0,0,0,0,0,0,0,0,0,0,0,0,0,0,0,0,0,0,0,0,0,0,0,0]
[0,0,0,0,0,0,0,0,0,0,0,0,0,0,0,0,0,0,0,0,0,0,0,0,0,0,0,0,0]
[0,0,0,0,0,0,0,0,0,0,0,0,0,0,0,0,0,0,0,0,0,0,0,0,0,0,0,0,0]
[0,0,0,0,0,0,0,0,0,0,0,0,0,0,0,0,0,0,0,0,0,0,0,0,0,0,0,0,0]
[0,0,0,0,0,0,0,0,0,0,0,0,0,0,0,0,0,0,0,0,0,0,0,0,0,0,0,0,0]
[0,0,0,0,0,0,0,0,0,0,0,0,0,0,0,0,0,0,0,0,0,0,0,0,0,0,0,0,0]
[0,0,0,0,0,0,0,0,0,0,0,0,0,0,0,0,0,0,0,0,0,0,0,0,0,0,0,0,0]
[0,0,0,0,0,0,0,0,0,0,0,0,0,0,0,0,0,0,0,0,0,0,0,0,0,0,0,0,0]
[0,0,0,0,0,0,0,0,0,0,0,0,0,0,0,0,0,0,0,0,0,0,0,0,0,0,0,0,0]
[0,0,0,0,0,0,0,0,0,0,0,0,0,0,0,0,0,0,0,0,0,0,0,0,0,0,0,0,0]
[0,0,0,0,0,0,0,0,0,0,0,0,0,0,0,0,0,0,0,0,0,0,0,0,0,0,0,0,0]
[0,0,0,0,0,0,0,0,0,0,0,0,0,0,0,0,0,0,0,0,0,0,0,0,0,0,0,0,0]
[0,0,0,0,0,0,0,0,0,0,0,0,0,0,0,0,0,0,0,0,0,0,0,0,0,0,0,0,0]
[0,0,0,0,0,0,0,0,0,0,0,0,0,0,0,0,0,0,0,0,0,0,0,0,0,0,0,0,0]
[0,0,0,0,0,0,0,0,0,0,0,0,0,0,0,0,0,0,0,0,0,0,0,0,0,0,0,0,0]
[0,0,0,0,0,0,0,0,0,0,0,0,0,0,0,0,0,0,0,0,0,0,0,0,0,0,0,0,0]
[0,0,0,0,0,0,0,0,0,0,0,0,0,0,0,0,0,0,0,0,0,0,0,0,0,0,0,0,0]
[0,0,0,0,0,0,0,0,0,0,0,0,0,0,0,0,0,0,0,0,0,0,0,0,0,0,0,0,0]
[0,0,0,0,0,0,0,0,0,0,0,0,0,0,0,0,0,0,0,0,0,0,0,0,0,0,0,0,0]
[0,0,0,0,0,0,0,0,0,0,0,0,0,0,0,0,0,0,0,0,0,0,0,0,0,0,0,0,0]
[0,0,0,0,0,0,0,0,0,0,0,0,0,0,0,0,0,0,0,0,0,0,0,0,0,0,0,0,0]
[0,0,0,0,0,0,0,0,0,0,0,0,0,0,0,0,0,0,0,0,0,0,0,0,0,0,0,0,0]
[0,0,0,0,0,0,0,0,0,0,0,0,0,0,0,0,0,0,0,0,0,0,0,0,0,0,0,0,0]
[0,0,0,0,0,0,0,0,0,0,0,0,0,0,0,0,0,0,0,0,0,0,0,0,0,0,0,0,0]
[0,0,0,0,0,0,0,0,0,0,0,0,0,0,0,0,0,0,0,0,0,0,0,0,0,0,0,0,0]
[0,0,0,0,0,0,0,0,0,0,0,0,0,0,0,0,0,0,0,0,0,0,0,0,0,0,0,0,0]
[0,0,0,0,0,0,0,0,0,0,0,0,0,0,0,0,0,0,0,0,0,0,0,0,0,0,0,0,0]
[0,0,0,0,0,0,0,0,0,0,0,0,0,0,0,0,0,0,0,0,0,0,0,0,0,0,0,0,0]
[0,0,0,0,0,0,0,0,0,0,0,0,0,0,0,0,0,0,0,0,0,0,0,0,0,0,0,0,0]
[0,0,0,0,0,0,0,0,0,0,0,0,0,0,0,0,0,0,0,0,0,0,0,0,0,0,0,0,0]
[0,0,0,0,0,0,0,0,0,0,0,0,0,0,0,0,0,0,0,0,0,0,0,0,0,0,0,0,0]
[0,0,0,0,0,0,0,0,0,0,0,0,0,0,0,0,0,0,0,0,0,0,0,0,0,0,0,0,0]
[0,0,0,0,0,0,0,0,0,0,0,0,0,0,0,0,0,0,0,0,0,0,0,0,0,0,0,0,0]
[0,0,0,0,0,0,0,0,0,0,0,0,0,0,0,0,0,0,0,0,0,0,0,0,0,0,0,0,0]
[0,0,0,0,0,0,0,0,0,0,0,0,0,0,0,0,0,0,0,0,0,0,0,0,0,0,0,0,0]
[0,0,0,0,0,0,0,0,0,0,0,0,0,0,0,0,0,0,0,0,0,0,0,0,0,0,0,0,0]
[0,0,0,0,0,0,0,0,0,0,0,0,0,0,0,0,0,0,0,0,0,0,0,0,0,0,0,0,0]
[0,0,0,0,0,0,0,0,0,0,0,0,0,0,0,0,0,0,0,0,0,0,0,0,0,0,0,0,0]
[0,0,0,0,0,0,0,0,0,0,0,0,0,0,0,0,0,0,0,0,0,0,0,0,0,0,0,0,0]
[0,0,0,0,0,0,0,0,0,0,0,0,0,0,0,0,0,0,0,0,0,0,0,0,0,0,0,0,0]
[0,0,0,0,0,0,0,0,0,0,0,0,0,0,0,0,0,0,0,0,0,0,0,0,0,0,0,0,0]
[0,0,0,0,0,0,0,0,0,0,0,0,0,0,0,0,0,0,0,0,0,0,0,0,0,0,0,0,0]
[0,0,0,0,0,0,0,0,0,0,0,0,0,0,0,0,0,0,0,0,0,0,0,0,0,0,0,0,0]
[0,0,0,0,0,0,0,0,0,0,0,0,0,0,0,0,0,0,0,0,0,0,0,0,0,0,0,0,0]
[0,0,0,0,0,0,0,0,0,0,0,0,0,0,0,0,0,0,0,0,0,0,0,0,0,0,0,0,0]
[0,0,0,0,0,0,0,0,0,0,0,0,0,0,0,0,0,0,0,0,0,0,0,0,0,0,0,0,0]
[0,0,0,0,0,0,0,0,0,0,0,0,0,0,0,0,0,0,0,0,0,0,0,0,0,0,0,0,0]
[0,0,0,0,0,0,0,0,0,0,0,0,0,0,0,0,0,0,0,0,0,0,0,0,0,0,0,0,0]
[0,0,0,0,0,0,0,0,0,0,0,0,0,0,0,0,0,0,0,0,0,0,0,0,0,0,0,0,0]
[0,0,0,0,0,0,0,0,0,0,0,0,0,0,0,0,0,0,0,0,0,0,0,0,0,0,0,0,0]
[0,0,0,0,0,0,0,0,0,0,0,0,0,0,0,0,0,0,0,0,0,0,0,0,0,0,0,0,0]
[0,0,0,0,0,0,0,0,0,0,0,0,0,0,0,0,0,0,0,0,0,0,0,0,0,0,0,0,0]
[0,0,0,0,0,0,0,0,0,0,0,0,0,0,0,0,0,0,0,0,0,0,0,0,0,0,0,0,0]
[0,0,0,0,0,0,0,0,0,0,0,0,0,0,0,0,0,0,0,0,0,0,0,0,0,0,0,0,0]
[0,0,0,0,0,0,0,0,0,0,0,0,0,0,0,0,0,0,0,0,0,0,0,0,0,0,0,0,0]
[0,0,0,0,0,0,0,0,0,0,0,0,0,0,0,0,0,0,0,0,0,0,0,0,0,0,0,0,0]
[0,0,0,0,0,0,0,0,0,0,0,0,0,0,0,0,0,0,0,0,0,0,0,0,0,0,0,0,0]
[0,0,0,0,0,0,0,0,0,0,0,0,0,0,0,0,0,0,0,0,0,0,0,0,0,0,0,0,0]
[0,0,0,0,0,0,0,0,0,0,0,0,0,0,0,0,0,0,0,0,0,0,0,0,0,0,0,0,0]
[0,0,0,0,0,0,0,0,0,0,0,0,0,0,0,0,0,0,0,0,0,0,0,0,0,0,0,0,0]
[0,0,0,0,0,0,0,0,0,0,0,0,0,0,0,0,0,0,0,0,0,0,0,0,0,0,0,0,0]
[0,0,0,0,0,0,0,0,0,0,0,0,0,0,0,0,0,0,0,0,0,0,0,0,0,0,0,0,0]
[0,0,0,0,0,0,0,0,0,0,0,0,0,0,0,0,0,0,0,0,0,0,0,0,0,0,0,0,0]
[0,0,0,0,0,0,0,0,0,0,0,0,0,0,0,0,0,0,0,0,0,0,0,0,0,0,0,0,0]
[0,0,0,0,0,0,0,0,0,0,0,0,0,0,0,0,0,0,0,0,0,0,0,0,0,0,0,0,0]
[0,0,0,0,0,0,0,0,0,0,0,0,0,0,0,0,0,0,0,0,0,0,0,0,0,0,0,0,0]
[0,0,0,0,0,0,0,0,0,0,0,0,0,0,0,0,0,0,0,0,0,0,0,0,0,0,0,0,0]
[0,0,0,0,0,0,0,0,0,0,0,0,0,0,0,0,0,0,0,0,0,0,0,0,0,0,0,0,0]
[0,0,0,0,0,0,0,0,0,0,0,0,0,0,0,0,0,0,0,0,0,0,0,0,0,0,0,0,0]
[0,0,0,0,0,0,0,0,0,0,0,0,0,0,0,0,0,0,0,0,0,0,0,0,0,0,0,0,0]
[0,0,0,0,0,0,0,0,0,0,0,0,0,0,0,0,0,0,0,0,0,0,0,0,0,0,0,0,0]
[0,0,0,0,0,0,0,0,0,0,0,0,0,0,0,0,0,0,0,0,0,0,0,0,0,0,0,0,0]
[0,0,0,0,0,0,0,0,0,0,0,0,0,0,0,0,0,0,0,0,0,0,0,0,0,0,0,0,0]
[0,0,0,0,0,0,0,0,0,0,0,0,0,0,0,0,0,0,0,0,0,0,0,0,0,0,0,0,0]
[0,0,0,0,0,0,0,0,0,0,0,0,0,0,0,0,0,0,0,0,0,0,0,0,0,0,0,0,0]
[0,0,0,0,0,0,0,0,0,0,0,0,0,0,0,0,0,0,0,0,0,0,0,0,0,0,0,0,0]
[0,0,0,0,0,0,0,0,0,0,0,0,0,0,0,0,0,0,0,0,0,0,0,0,0,0,0,0,0]
[0,0,0,0,0,0,0,0,0,0,0,0,0,0,0,0,0,0,0,0,0,0,0,0,0,0,0,0,0]
[0,0,0,0,0,0,0,0,0,0,0,0,0,0,0,0,0,0,0,0,0,0,0,0,0,0,0,0,0]
[0,0,0,0,0,0,0,0,0,0,0,0,0,0,0,0,0,0,0,0,0,0,0,0,0,0,0,0,0]
[0,0,0,0,0,0,0,0,0,0,0,0,0,0,0,0,0,0,0,0,0,0,0,0,0,0,0,0,0]
[0,0,0,0,0,0,0,0,0,0,0,0,0,0,0,0,0,0,0,0,0,0,0,0,0,0,0,0,0]
[0,0,0,0,0,0,0,0,0,0,0,0,0,0,0,0,0,0,0,0,0,0,0,0,0,0,0,0,0]
[0,0,0,0,0,0,0,0,0,0,0,0,0,0,0,0,0,0,0,0,0,0,0,0,0,0,0,0,0]
[0,0,0,0,0,0,0,0,0,0,0,0,0,0,0,0,0,0,0,0,0,0,0,0,0,0,0,0,0]
[0,0,0,0,0,0,0,0,0,0,0,0,0,0,0,0,0,0,0,0,0,0,0,0,0,0,0,0,0]
[0,0,0,0,0,0,0,0,0,0,0,0,0,0,0,0,0,0,0,0,0,0,0,0,0,0,0,0,0]
[0,0,0,0,0,0,0,0,0,0,0,0,0,0,0,0,0,0,0,0,0,0,0,0,0,0,0,0,0]
[0,0,0,0,0,0,0,0,0,0,0,0,0,0,0,0,0,0,0,0,0,0,0,0,0,0,0,0,0]
[0,0,0,0,0,0,0,0,0,0,0,0,0,0,0,0,0,0,0,0,0,0,0,0,0,0,0,0,0]
[0,0,0,0,0,0,0,0,0,0,0,0,0,0,0,0,0,0,0,0,0,0,0,0,0,0,0,0,0]
[0,0,0,0,0,0,0,0,0,0,0,0,0,0,0,0,0,0,0,0,0,0,0,0,0,0,0,0,0]
[0,0,0,0,0,0,0,0,0,0,0,0,0,0,0,0,0,0,0,0,0,0,0,0,0,0,0,0,0]
[0,0,0,0,0,0,0,0,0,0,0,0,0,0,0,0,0,0,0,0,0,0,0,0,0,0,0,0,0]
[0,0,0,0,0,0,0,0,0,0,0,0,0,0,0,0,0,0,0,0,0,0,0,0,0,0,0,0,0]
[0,0,0,0,0,0,0,0,0,0,0,0,0,0,0,0,0,0,0,0,0,0,0,0,0,0,0,0,0]
[0,0,0,0,0,0,0,0,0,0,0,0,0,0,0,0,0,0,0,0,0,0,0,0,0,0,0,0,0]
[0,0,0,0,0,0,0,0,0,0,0,0,0,0,0,0,0,0,0,0,0,0,0,0,0,0,0,0,0]
[0,0,0,0,0,0,0,0,0,0,0,0,0,0,0,0,0,0,0,0,0,0,0,0,0,0,0,0,0]
[0,0,0,0,0,0,0,0,0,0,0,0,0,0,0,0,0,0,0,0,0,0,0,0,0,0,0,0,0]
[0,0,0,0,0,0,0,0,0,0,0,0,0,0,0,0,0,0,0,0,0,0,0,0,0,0,0,0,0]
[0,0,0,0,0,0,0,0,0,0,0,0,0,0,0,0,0,0,0,0,0,0,0,0,0,0,0,0,0]
[0,0,0,0,0,0,0,0,0,0,0,0,0,0,0,0,0,0,0,0,0,0,0,0,0,0,0,0,0]
[0,0,0,0,0,0,0,0,0,0,0,0,0,0,0,0,0,0,0,0,0,0,0,0,0,0,0,0,0]
[0,0,0,0,0,0,0,0,0,0,0,0,0,0,0,0,0,0,0,0,0,0,0,0,0,0,0,0,0]
[0,0,0,0,0,0,0,0,0,0,0,0,0,0,0,0,0,0,0,0,0,0,0,0,0,0,0,0,0]
[0,0,0,0,0,0,0,0,0,0,0,0,0,0,0,0,0,0,0,0,0,0,0,0,0,0,0,0,0]
[0,0,0,0,0,0,0,0,0,0,0,0,0,0,0,0,0,0,0,0,0,0,0,0,0,0,0,0,0]
[0,0,0,0,0,0,0,0,0,0,0,0,0,0,0,0,0,0,0,0,0,0,0,0,0,0,0,0,0]
[0,0,0,0,0,0,0,0,0,0,0,0,0,0,0,0,0,0,0,0,0,0,0,0,0,0,0,0,0]
[0,0,0,0,0,0,0,0,0,0,0,0,0,0,0,0,0,0,0,0,0,0,0,0,0,0,0,0,0]
[0,0,0,0,0,0,0,0,0,0,0,0,0,0,0,0,0,0,0,0,0,0,0,0,0,0,0,0,0]
[0,0,0,0,0,0,0,0,0,0,0,0,0,0,0,0,0,0,0,0,0,0,0,0,0,0,0,0,0]
[0,0,0,0,0,0,0,0,0,0,0,0,0,0,0,0,0,0,0,0,0,0,0,0,0,0,0,0,0]
[0,0,0,0,0,0,0,0,0,0,0,0,0,0,0,0,0,0,0,0,0,0,0,0,0,0,0,0,0]
[0,0,0,0,0,0,0,0,0,0,0,0,0,0,0,0,0,0,0,0,0,0,0,0,0,0,0,0,0]
[0,0,0,0,0,0,0,0,0,0,0,0,0,0,0,0,0,0,0,0,0,0,0,0,0,0,0,0,0]
[0,0,0,0,0,0,0,0,0,0,0,0,0,0,0,0,0,0,0,0,0,0,0,0,0,0,0,0,0]
[0,0,0,0,0,0,0,0,0,0,0,0,0,0,0,0,0,0,0,0,0,0,0,0,0,0,0,0,0]
[0,0,0,0,0,0,0,0,0,0,0,0,0,0,0,0,0,0,0,0,0,0,0,0,0,0,0,0,0]
[0,0,0,0,0,0,0,0,0,0,0,0,0,0,0,0,0,0,0,0,0,0,0,0,0,0,0,0,0]
[0,0,0,0,0,0,0,0,0,0,0,0,0,0,0,0,0,0,0,0,0,0,0,0,0,0,0,0,0]
[0,0,0,0,0,0,0,0,0,0,0,0,0,0,0,0,0,0,0,0,0,0,0,0,0,0,0,0,0]
[0,0,0,0,0,0,0,0,0,0,0,0,0,0,0,0,0,0,0,0,0,0,0,0,0,0,0,0,0]
[0,0,0,0,0,0,0,0,0,0,0,0,0,0,0,0,0,0,0,0,0,0,0,0,0,0,0,0,0]
[0,0,0,0,0,0,0,0,0,0,0,0,0,0,0,0,0,0,0,0,0,0,0,0,0,0,0,0,0]
[0,0,0,0,0,0,0,0,0,0,0,0,0,0,0,0,0,0,0,0,0,0,0,0,0,0,0,0,0]
[0,0,0,0,0,0,0,0,0,0,0,0,0,0,0,0,0,0,0,0,0,0,0,0,0,0,0,0,0]
[0,0,0,0,0,0,0,0,0,0,0,0,0,0,0,0,0,0,0,0,0,0,0,0,0,0,0,0,0]
[0,0,0,0,0,0,0,0,0,0,0,0,0,0,0,0,0,0,0,0,0,0,0,0,0,0,0,0,0]
[0,0,0,0,0,0,0,0,0,0,0,0,0,0,0,0,0,0,0,0,0,0,0,0,0,0,0,0,0]
[0,0,0,0,0,0,0,0,0,0,0,0,0,0,0,0,0,0,0,0,0,0,0,0,0,0,0,0,0]
[0,0,0,0,0,0,0,0,0,0,0,0,0,0,0,0,0,0,0,0,0,0,0,0,0,0,0,0,0]
[0,0,0,0,0,0,0,0,0,0,0,0,0,0,0,0,0,0,0,0,0,0,0,0,0,0,0,0,0]
[0,0,0,0,0,0,0,0,0,0,0,0,0,0,0,0,0,0,0,0,0,0,0,0,0,0,0,0,0]
[0,0,0,0,0,0,0,0,0,0,0,0,0,0,0,0,0,0,0,0,0,0,0,0,0,0,0,0,0]
[0,0,0,0,0,0,0,0,0,0,0,0,0,0,0,0,0,0,0,0,0,0,0,0,0,0,0,0,0]
[0,0,0,0,0,0,0,0,0,0,0,0,0,0,0,0,0,0,0,0,0,0,0,0,0,0,0,0,0]
[0,0,0,0,0,0,0,0,0,0,0,0,0,0,0,0,0,0,0,0,0,0,0,0,0,0,0,0,0]
[0,0,0,0,0,0,0,0,0,0,0,0,0,0,0,0,0,0,0,0,0,0,0,0,0,0,0,0,0]
[0,0,0,0,0,0,0,0,0,0,0,0,0,0,0,0,0,0,0,0,0,0,0,0,0,0,0,0,0]
[0,0,0,0,0,0,0,0,0,0,0,0,0,0,0,0,0,0,0,0,0,0,0,0,0,0,0,0,0]
[0,0,0,0,0,0,0,0,0,0,0,0,0,0,0,0,0,0,0,0,0,0,0,0,0,0,0,0,0]
[0,0,0,0,0,0,0,0,0,0,0,0,0,0,0,0,0,0,0,0,0,0,0,0,0,0,0,0,0]
[0,0,0,0,0,0,0,0,0,0,0,0,0,0,0,0,0,0,0,0,0,0,0,0,0,0,0,0,0]
[0,0,0,0,0,0,0,0,0,0,0,0,0,0,0,0,0,0,0,0,0,0,0,0,0,0,0,0,0]
[0,0,0,0,0,0,0,0,0,0,0,0,0,0,0,0,0,0,0,0,0,0,0,0,0,0,0,0,0]
[0,0,0,0,0,0,0,0,0,0,0,0,0,0,0,0,0,0,0,0,0,0,0,0,0,0,0,0,0]
[0,0,0,0,0,0,0,0,0,0,0,0,0,0,0,0,0,0,0,0,0,0,0,0,0,0,0,0,0]
[0,0,0,0,0,0,0,0,0,0,0,0,0,0,0,0,0,0,0,0,0,0,0,0,0,0,0,0,0]
[0,0,0,0,0,0,0,0,0,0,0,0,0,0,0,0,0,0,0,0,0,0,0,0,0,0,0,0,0]
[0,0,0,0,0,0,0,0,0,0,0,0,0,0,0,0,0,0,0,0,0,0,0,0,0,0,0,0,0]
[0,0,0,0,0,0,0,0,0,0,0,0,0,0,0,0,0,0,0,0,0,0,0,0,0,0,0,0,0]
[0,0,0,0,0,0,0,0,0,0,0,0,0,0,0,0,0,0,0,0,0,0,0,0,0,0,0,0,0]
[0,0,0,0,0,0,0,0,0,0,0,0,0,0,0,0,0,0,0,0,0,0,0,0,0,0,0,0,0]
[0,0,0,0,0,0,0,0,0,0,0,0,0,0,0,0,0,0,0,0,0,0,0,0,0,0,0,0,0]
[0,0,0,0,0,0,0,0,0,0,0,0,0,0,0,0,0,0,0,0,0,0,0,0,0,0,0,0,0]
[0,0,0,0,0,0,0,0,0,0,0,0,0,0,0,0,0,0,0,0,0,0,0,0,0,0,0,0,0]
[0,0,0,0,0,0,0,0,0,0,0,0,0,0,0,0,0,0,0,0,0,0,0,0,0,0,0,0,0]
[0,0,0,0,0,0,0,0,0,0,0,0,0,0,0,0,0,0,0,0,0,0,0,0,0,0,0,0,0]
[0,0,0,0,0,0,0,0,0,0,0,0,0,0,0,0,0,0,0,0,0,0,0,0,0,0,0,0,0]
[0,0,0,0,0,0,0,0,0,0,0,0,0,0,0,0,0,0,0,0,0,0,0,0,0,0,0,0,0]
[0,0,0,0,0,0,0,0,0,0,0,0,0,0,0,0,0,0,0,0,0,0,0,0,0,0,0,0,0]
[0,0,0,0,0,0,0,0,0,0,0,0,0,0,0,0,0,0,0,0,0,0,0,0,0,0,0,0,0]
[0,0,0,0,0,0,0,0,0,0,0,0,0,0,0,0,0,0,0,0,0,0,0,0,0,0,0,0,0]
[0,0,0,0,0,0,0,0,0,0,0,0,0,0,0,0,0,0,0,0,0,0,0,0,0,0,0,0,0]
[0,0,0,0,0,0,0,0,0,0,0,0,0,0,0,0,0,0,0,0,0,0,0,0,0,0,0,0,0]
[0,0,0,0,0,0,0,0,0,0,0,0,0,0,0,0,0,0,0,0,0,0,0,0,0,0,0,0,0]
[0,0,0,0,0,0,0,0,0,0,0,0,0,0,0,0,0,0,0,0,0,0,0,0,0,0,0,0,0]
[0,0,0,0,0,0,0,0,0,0,0,0,0,0,0,0,0,0,0,0,0,0,0,0,0,0,0,0,0]
[0,0,0,0,0,0,0,0,0,0,0,0,0,0,0,0,0,0,0,0,0,0,0,0,0,0,0,0,0]
[0,0,0,0,0,0,0,0,0,0,0,0,0,0,0,0,0,0,0,0,0,0,0,0,0,0,0,0,0]
[0,0,0,0,0,0,0,0,0,0,0,0,0,0,0,0,0,0,0,0,0,0,0,0,0,0,0,0,0]
[0,0,0,0,0,0,0,0,0,0,0,0,0,0,0,0,0,0,0,0,0,0,0,0,0,0,0,0,0]
[0,0,0,0,0,0,0,0,0,0,0,0,0,0,0,0,0,0,0,0,0,0,0,0,0,0,0,0,0]
[0,0,0,0,0,0,0,0,0,0,0,0,0,0,0,0,0,0,0,0,0,0,0,0,0,0,0,0,0]
[0,0,0,0,0,0,0,0,0,0,0,0,0,0,0,0,0,0,0,0,0,0,0,0,0,0,0,0,0]
[0,0,0,0,0,0,0,0,0,0,0,0,0,0,0,0,0,0,0,0,0,0,0,0,0,0,0,0,0]
[0,0,0,0,0,0,0,0,0,0,0,0,0,0,0,0,0,0,0,0,0,0,0,0,0,0,0,0,0]
[0,0,0,0,0,0,0,0,0,0,0,0,0,0,0,0,0,0,0,0,0,0,0,0,0,0,0,0,0]
[0,0,0,0,0,0,0,0,0,0,0,0,0,0,0,0,0,0,0,0,0,0,0,0,0,0,0,0,0]
[0,0,0,0,0,0,0,0,0,0,0,0,0,0,0,0,0,0,0,0,0,0,0,0,0,0,0,0,0]
[0,0,0,0,0,0,0,0,0,0,0,0,0,0,0,0,0,0,0,0,0,0,0,0,0,0,0,0,0]
[0,0,0,0,0,0,0,0,0,0,0,0,0,0,0,0,0,0,0,0,0,0,0,0,0,0,0,0,0]
[0,0,0,0,0,0,0,0,0,0,0,0,0,0,0,0,0,0,0,0,0,0,0,0,0,0,0,0,0]
[0,0,0,0,0,0,0,0,0,0,0,0,0,0,0,0,0,0,0,0,0,0,0,0,0,0,0,0,0]
[0,0,0,0,0,0,0,0,0,0,0,0,0,0,0,0,0,0,0,0,0,0,0,0,0,0,0,0,0]
[0,0,0,0,0,0,0,0,0,0,0,0,0,0,0,0,0,0,0,0,0,0,0,0,0,0,0,0,0]
[0,0,0,0,0,0,0,0,0,0,0,0,0,0,0,0,0,0,0,0,0,0,0,0,0,0,0,0,0]
[0,0,0,0,0,0,0,0,0,0,0,0,0,0,0,0,0,0,0,0,0,0,0,0,0,0,0,0,0]
[0,0,0,0,0,0,0,0,0,0,0,0,0,0,0,0,0,0,0,0,0,0,0,0,0,0,0,0,0]
[0,0,0,0,0,0,0,0,0,0,0,0,0,0,0,0,0,0,0,0,0,0,0,0,0,0,0,0,0]
[0,0,0,0,0,0,0,0,0,0,0,0,0,0,0,0,0,0,0,0,0,0,0,0,0,0,0,0,0]
[0,0,0,0,0,0,0,0,0,0,0,0,0,0,0,0,0,0,0,0,0,0,0,0,0,0,0,0,0]
[0,0,0,0,0,0,0,0,0,0,0,0,0,0,0,0,0,0,0,0,0,0,0,0,0,0,0,0,0]
[0,0,0,0,0,0,0,0,0,0,0,0,0,0,0,0,0,0,0,0,0,0,0,0,0,0,0,0,0]
[0,0,0,0,0,0,0,0,0,0,0,0,0,0,0,0,0,0,0,0,0,0,0,0,0,0,0,0,0]
[0,0,0,0,0,0,0,0,0,0,0,0,0,0,0,0,0,0,0,0,0,0,0,0,0,0,0,0,0]
[0,0,0,0,0,0,0,0,0,0,0,0,0,0,0,0,0,0,0,0,0,0,0,0,0,0,0,0,0]
[0,0,0,0,0,0,0,0,0,0,0,0,0,0,0,0,0,0,0,0,0,0,0,0,0,0,0,0,0]
[0,0,0,0,0,0,0,0,0,0,0,0,0,0,0,0,0,0,0,0,0,0,0,0,0,0,0,0,0]
[0,0,0,0,0,0,0,0,0,0,0,0,0,0,0,0,0,0,0,0,0,0,0,0,0,0,0,0,0]
[0,0,0,0,0,0,0,0,0,0,0,0,0,0,0,0,0,0,0,0,0,0,0,0,0,0,0,0,0]
[0,0,0,0,0,0,0,0,0,0,0,0,0,0,0,0,0,0,0,0,0,0,0,0,0,0,0,0,0]
[0,0,0,0,0,0,0,0,0,0,0,0,0,0,0,0,0,0,0,0,0,0,0,0,0,0,0,0,0]
[0,0,0,0,0,0,0,0,0,0,0,0,0,0,0,0,0,0,0,0,0,0,0,0,0,0,0,0,0]
[0,0,0,0,0,0,0,0,0,0,0,0,0,0,0,0,0,0,0,0,0,0,0,0,0,0,0,0,0]
[0,0,0,0,0,0,0,0,0,0,0,0,0,0,0,0,0,0,0,0,0,0,0,0,0,0,0,0,0]
[0,0,0,0,0,0,0,0,0,0,0,0,0,0,0,0,0,0,0,0,0,0,0,0,0,0,0,0,0]
[0,0,0,0,0,0,0,0,0,0,0,0,0,0,0,0,0,0,0,0,0,0,0,0,0,0,0,0,0]
[0,0,0,0,0,0,0,0,0,0,0,0,0,0,0,0,0,0,0,0,0,0,0,0,0,0,0,0,0]
[0,0,0,0,0,0,0,0,0,0,0,0,0,0,0,0,0,0,0,0,0,0,0,0,0,0,0,0,0]
[0,0,0,0,0,0,0,0,0,0,0,0,0,0,0,0,0,0,0,0,0,0,0,0,0,0,0,0,0]
[0,0,0,0,0,0,0,0,0,0,0,0,0,0,0,0,0,0,0,0,0,0,0,0,0,0,0,0,0]
[0,0,0,0,0,0,0,0,0,0,0,0,0,0,0,0,0,0,0,0,0,0,0,0,0,0,0,0,0]
[0,0,0,0,0,0,0,0,0,0,0,0,0,0,0,0,0,0,0,0,0,0,0,0,0,0,0,0,0]
[0,0,0,0,0,0,0,0,0,0,0,0,0,0,0,0,0,0,0,0,0,0,0,0,0,0,0,0,0]
[0,0,0,0,0,0,0,0,0,0,0,0,0,0,0,0,0,0,0,0,0,0,0,0,0,0,0,0,0]
[0,0,0,0,0,0,0,0,0,0,0,0,0,0,0,0,0,0,0,0,0,0,0,0,0,0,0,0,0]
[0,0,0,0,0,0,0,0,0,0,0,0,0,0,0,0,0,0,0,0,0,0,0,0,0,0,0,0,0]
[0,0,0,0,0,0,0,0,0,0,0,0,0,0,0,0,0,0,0,0,0,0,0,0,0,0,0,0,0]
[0,0,0,0,0,0,0,0,0,0,0,0,0,0,0,0,0,0,0,0,0,0,0,0,0,0,0,0,0]
[0,0,0,0,0,0,0,0,0,0,0,0,0,0,0,0,0,0,0,0,0,0,0,0,0,0,0,0,0]
[0,0,0,0,0,0,0,0,0,0,0,0,0,0,0,0,0,0,0,0,0,0,0,0,0,0,0,0,0]
[0,0,0,0,0,0,0,0,0,0,0,0,0,0,0,0,0,0,0,0,0,0,0,0,0,0,0,0,0]

{"sheet":"(hid) 05_WtAuswahl","index":7,"n_rows":502,"n_cols":29,"rows_kept":502,"cut":false,"hidden":true,"merged":[]}
["WT ID","HS ID","CS ID","T HS ein","T CS ein","T HS aus","T CS aus","mcp HS","mcp CS","Q hx HS","Q hx CS","Duration HX","Duration ST","crit PO","crit EN","crit EX","crit TOT","dT",null,"WT ID (2x)",null,null,"E HX","E ST","Q HX","Q ST","E-Preis","Einsparung","WT-Kosten"]
[1,2,3,4,5,6,7,8,9,10,11,12,13,14,15,16,17,18,19,20,21,22,23,24,25,26,27,28,29]
[0,0,0,0,0,0,0,0,0,0,0,0,0,0,0,0,0,0,0,0,0,0,0,0,0,0,0,0,0]
[0,0,0,0,0,0,0,0,0,0,0,0,0,0,0,0,0,0,0,0,0,0,0,0,0,0,0,0,0]
[0,0,0,0,0,0,0,0,0,0,0,0,0,0,0,0,0,0,0,0,0,0,0,0,0,0,0,0,0]
[0,0,0,0,0,0,0,0,0,0,0,0,0,0,0,0,0,0,0,0,0,0,0,0,0,0,0,0,0]
[0,0,0,0,0,0,0,0,0,0,0,0,0,0,0,0,0,0,0,0,0,0,0,0,0,0,0,0,0]
[0,0,0,0,0,0,0,0,0,0,0,0,0,0,0,0,0,0,0,0,0,0,0,0,0,0,0,0,0]
[0,0,0,0,0,0,0,0,0,0,0,0,0,0,0,0,0,0,0,0,0,0,0,0,0,0,0,0,0]
[0,0,0,0,0,0,0,0,0,0,0,0,0,0,0,0,0,0,0,0,0,0,0,0,0,0,0,0,0]
[0,0,0,0,0,0,0,0,0,0,0,0,0,0,0,0,0,0,0,0,0,0,0,0,0,0,0,0,0]
[0,0,0,0,0,0,0,0,0,0,0,0,0,0,0,0,0,0,0,0,0,0,0,0,0,0,0,0,0]
[0,0,0,0,0,0,0,0,0,0,0,0,0,0,0,0,0,0,0,0,0,0,0,0,0,0,0,0,0]
[0,0,0,0,0,0,0,0,0,0,0,0,0,0,0,0,0,0,0,0,0,0,0,0,0,0,0,0,0]
[0,0,0,0,0,0,0,0,0,0,0,0,0,0,0,0,0,0,0,0,0,0,0,0,0,0,0,0,0]
[0,0,0,0,0,0,0,0,0,0,0,0,0,0,0,0,0,0,0,0,0,0,0,0,0,0,0,0,0]
[0,0,0,0,0,0,0,0,0,0,0,0,0,0,0,0,0,0,0,0,0,0,0,0,0,0,0,0,0]
[0,0,0,0,0,0,0,0,0,0,0,0,0,0,0,0,0,0,0,0,0,0,0,0,0,0,0,0,0]
[0,0,0,0,0,0,0,0,0,0,0,0,0,0,0,0,0,0,0,0,0,0,0,0,0,0,0,0,0]
[0,0,0,0,0,0,0,0,0,0,0,0,0,0,0,0,0,0,0,0,0,0,0,0,0,0,0,0,0]
[0,0,0,0,0,0,0,0,0,0,0,0,0,0,0,0,0,0,0,0,0,0,0,0,0,0,0,0,0]
[0,0,0,0,0,0,0,0,0,0,0,0,0,0,0,0,0,0,0,0,0,0,0,0,0,0,0,0,0]
[0,0,0,0,0,0,0,0,0,0,0,0,0,0,0,0,0,0,0,0,0,0,0,0,0,0,0,0,0]
[0,0,0,0,0,0,0,0,0,0,0,0,0,0,0,0,0,0,0,0,0,0,0,0,0,0,0,0,0]
[0,0,0,0,0,0,0,0,0,0,0,0,0,0,0,0,0,0,0,0,0,0,0,0,0,0,0,0,0]
[0,0,0,0,0,0,0,0,0,0,0,0,0,0,0,0,0,0,0,0,0,0,0,0,0,0,0,0,0]
[0,0,0,0,0,0,0,0,0,0,0,0,0,0,0,0,0,0,0,0,0,0,0,0,0,0,0,0,0]
[0,0,0,0,0,0,0,0,0,0,0,0,0,0,0,0,0,0,0,0,0,0,0,0,0,0,0,0,0]
[0,0,0,0,0,0,0,0,0,0,0,0,0,0,0,0,0,0,0,0,0,0,0,0,0,0,0,0,0]
[0,0,0,0,0,0,0,0,0,0,0,0,0,0,0,0,0,0,0,0,0,0,0,0,0,0,0,0,0]
[0,0,0,0,0,0,0,0,0,0,0,0,0,0,0,0,0,0,0,0,0,0,0,0,0,0,0,0,0]
[0,0,0,0,0,0,0,0,0,0,0,0,0,0,0,0,0,0,0,0,0,0,0,0,0,0,0,0,0]
[0,0,0,0,0,0,0,0,0,0,0,0,0,0,0,0,0,0,0,0,0,0,0,0,0,0,0,0,0]
[0,0,0,0,0,0,0,0,0,0,0,0,0,0,0,0,0,0,0,0,0,0,0,0,0,0,0,0,0]
[0,0,0,0,0,0,0,0,0,0,0,0,0,0,0,0,0,0,0,0,0,0,0,0,0,0,0,0,0]
[0,0,0,0,0,0,0,0,0,0,0,0,0,0,0,0,0,0,0,0,0,0,0,0,0,0,0,0,0]
[0,0,0,0,0,0,0,0,0,0,0,0,0,0,0,0,0,0,0,0,0,0,0,0,0,0,0,0,0]
[0,0,0,0,0,0,0,0,0,0,0,0,0,0,0,0,0,0,0,0,0,0,0,0,0,0,0,0,0]
[0,0,0,0,0,0,0,0,0,0,0,0,0,0,0,0,0,0,0,0,0,0,0,0,0,0,0,0,0]
[0,0,0,0,0,0,0,0,0,0,0,0,0,0,0,0,0,0,0,0,0,0,0,0,0,0,0,0,0]
[0,0,0,0,0,0,0,0,0,0,0,0,0,0,0,0,0,0,0,0,0,0,0,0,0,0,0,0,0]
[0,0,0,0,0,0,0,0,0,0,0,0,0,0,0,0,0,0,0,0,0,0,0,0,0,0,0,0,0]
[0,0,0,0,0,0,0,0,0,0,0,0,0,0,0,0,0,0,0,0,0,0,0,0,0,0,0,0,0]
[0,0,0,0,0,0,0,0,0,0,0,0,0,0,0,0,0,0,0,0,0,0,0,0,0,0,0,0,0]
[0,0,0,0,0,0,0,0,0,0,0,0,0,0,0,0,0,0,0,0,0,0,0,0,0,0,0,0,0]
[0,0,0,0,0,0,0,0,0,0,0,0,0,0,0,0,0,0,0,0,0,0,0,0,0,0,0,0,0]
[0,0,0,0,0,0,0,0,0,0,0,0,0,0,0,0,0,0,0,0,0,0,0,0,0,0,0,0,0]
[0,0,0,0,0,0,0,0,0,0,0,0,0,0,0,0,0,0,0,0,0,0,0,0,0,0,0,0,0]
[0,0,0,0,0,0,0,0,0,0,0,0,0,0,0,0,0,0,0,0,0,0,0,0,0,0,0,0,0]
[0,0,0,0,0,0,0,0,0,0,0,0,0,0,0,0,0,0,0,0,0,0,0,0,0,0,0,0,0]
[0,0,0,0,0,0,0,0,0,0,0,0,0,0,0,0,0,0,0,0,0,0,0,0,0,0,0,0,0]
[0,0,0,0,0,0,0,0,0,0,0,0,0,0,0,0,0,0,0,0,0,0,0,0,0,0,0,0,0]
[0,0,0,0,0,0,0,0,0,0,0,0,0,0,0,0,0,0,0,0,0,0,0,0,0,0,0,0,0]
[0,0,0,0,0,0,0,0,0,0,0,0,0,0,0,0,0,0,0,0,0,0,0,0,0,0,0,0,0]
[0,0,0,0,0,0,0,0,0,0,0,0,0,0,0,0,0,0,0,0,0,0,0,0,0,0,0,0,0]
[0,0,0,0,0,0,0,0,0,0,0,0,0,0,0,0,0,0,0,0,0,0,0,0,0,0,0,0,0]
[0,0,0,0,0,0,0,0,0,0,0,0,0,0,0,0,0,0,0,0,0,0,0,0,0,0,0,0,0]
[0,0,0,0,0,0,0,0,0,0,0,0,0,0,0,0,0,0,0,0,0,0,0,0,0,0,0,0,0]
[0,0,0,0,0,0,0,0,0,0,0,0,0,0,0,0,0,0,0,0,0,0,0,0,0,0,0,0,0]
[0,0,0,0,0,0,0,0,0,0,0,0,0,0,0,0,0,0,0,0,0,0,0,0,0,0,0,0,0]
[0,0,0,0,0,0,0,0,0,0,0,0,0,0,0,0,0,0,0,0,0,0,0,0,0,0,0,0,0]
[0,0,0,0,0,0,0,0,0,0,0,0,0,0,0,0,0,0,0,0,0,0,0,0,0,0,0,0,0]
[0,0,0,0,0,0,0,0,0,0,0,0,0,0,0,0,0,0,0,0,0,0,0,0,0,0,0,0,0]
[0,0,0,0,0,0,0,0,0,0,0,0,0,0,0,0,0,0,0,0,0,0,0,0,0,0,0,0,0]
[0,0,0,0,0,0,0,0,0,0,0,0,0,0,0,0,0,0,0,0,0,0,0,0,0,0,0,0,0]
[0,0,0,0,0,0,0,0,0,0,0,0,0,0,0,0,0,0,0,0,0,0,0,0,0,0,0,0,0]
[0,0,0,0,0,0,0,0,0,0,0,0,0,0,0,0,0,0,0,0,0,0,0,0,0,0,0,0,0]
[0,0,0,0,0,0,0,0,0,0,0,0,0,0,0,0,0,0,0,0,0,0,0,0,0,0,0,0,0]
[0,0,0,0,0,0,0,0,0,0,0,0,0,0,0,0,0,0,0,0,0,0,0,0,0,0,0,0,0]
[0,0,0,0,0,0,0,0,0,0,0,0,0,0,0,0,0,0,0,0,0,0,0,0,0,0,0,0,0]
[0,0,0,0,0,0,0,0,0,0,0,0,0,0,0,0,0,0,0,0,0,0,0,0,0,0,0,0,0]
[0,0,0,0,0,0,0,0,0,0,0,0,0,0,0,0,0,0,0,0,0,0,0,0,0,0,0,0,0]
[0,0,0,0,0,0,0,0,0,0,0,0,0,0,0,0,0,0,0,0,0,0,0,0,0,0,0,0,0]
[0,0,0,0,0,0,0,0,0,0,0,0,0,0,0,0,0,0,0,0,0,0,0,0,0,0,0,0,0]
[0,0,0,0,0,0,0,0,0,0,0,0,0,0,0,0,0,0,0,0,0,0,0,0,0,0,0,0,0]
[0,0,0,0,0,0,0,0,0,0,0,0,0,0,0,0,0,0,0,0,0,0,0,0,0,0,0,0,0]
[0,0,0,0,0,0,0,0,0,0,0,0,0,0,0,0,0,0,0,0,0,0,0,0,0,0,0,0,0]
[0,0,0,0,0,0,0,0,0,0,0,0,0,0,0,0,0,0,0,0,0,0,0,0,0,0,0,0,0]
[0,0,0,0,0,0,0,0,0,0,0,0,0,0,0,0,0,0,0,0,0,0,0,0,0,0,0,0,0]
[0,0,0,0,0,0,0,0,0,0,0,0,0,0,0,0,0,0,0,0,0,0,0,0,0,0,0,0,0]
[0,0,0,0,0,0,0,0,0,0,0,0,0,0,0,0,0,0,0,0,0,0,0,0,0,0,0,0,0]
[0,0,0,0,0,0,0,0,0,0,0,0,0,0,0,0,0,0,0,0,0,0,0,0,0,0,0,0,0]
[0,0,0,0,0,0,0,0,0,0,0,0,0,0,0,0,0,0,0,0,0,0,0,0,0,0,0,0,0]
[0,0,0,0,0,0,0,0,0,0,0,0,0,0,0,0,0,0,0,0,0,0,0,0,0,0,0,0,0]
[0,0,0,0,0,0,0,0,0,0,0,0,0,0,0,0,0,0,0,0,0,0,0,0,0,0,0,0,0]
[0,0,0,0,0,0,0,0,0,0,0,0,0,0,0,0,0,0,0,0,0,0,0,0,0,0,0,0,0]
[0,0,0,0,0,0,0,0,0,0,0,0,0,0,0,0,0,0,0,0,0,0,0,0,0,0,0,0,0]
[0,0,0,0,0,0,0,0,0,0,0,0,0,0,0,0,0,0,0,0,0,0,0,0,0,0,0,0,0]
[0,0,0,0,0,0,0,0,0,0,0,0,0,0,0,0,0,0,0,0,0,0,0,0,0,0,0,0,0]
[0,0,0,0,0,0,0,0,0,0,0,0,0,0,0,0,0,0,0,0,0,0,0,0,0,0,0,0,0]
[0,0,0,0,0,0,0,0,0,0,0,0,0,0,0,0,0,0,0,0,0,0,0,0,0,0,0,0,0]
[0,0,0,0,0,0,0,0,0,0,0,0,0,0,0,0,0,0,0,0,0,0,0,0,0,0,0,0,0]
[0,0,0,0,0,0,0,0,0,0,0,0,0,0,0,0,0,0,0,0,0,0,0,0,0,0,0,0,0]
[0,0,0,0,0,0,0,0,0,0,0,0,0,0,0,0,0,0,0,0,0,0,0,0,0,0,0,0,0]
[0,0,0,0,0,0,0,0,0,0,0,0,0,0,0,0,0,0,0,0,0,0,0,0,0,0,0,0,0]
[0,0,0,0,0,0,0,0,0,0,0,0,0,0,0,0,0,0,0,0,0,0,0,0,0,0,0,0,0]
[0,0,0,0,0,0,0,0,0,0,0,0,0,0,0,0,0,0,0,0,0,0,0,0,0,0,0,0,0]
[0,0,0,0,0,0,0,0,0,0,0,0,0,0,0,0,0,0,0,0,0,0,0,0,0,0,0,0,0]
[0,0,0,0,0,0,0,0,0,0,0,0,0,0,0,0,0,0,0,0,0,0,0,0,0,0,0,0,0]
[0,0,0,0,0,0,0,0,0,0,0,0,0,0,0,0,0,0,0,0,0,0,0,0,0,0,0,0,0]
[0,0,0,0,0,0,0,0,0,0,0,0,0,0,0,0,0,0,0,0,0,0,0,0,0,0,0,0,0]
[0,0,0,0,0,0,0,0,0,0,0,0,0,0,0,0,0,0,0,0,0,0,0,0,0,0,0,0,0]
[0,0,0,0,0,0,0,0,0,0,0,0,0,0,0,0,0,0,0,0,0,0,0,0,0,0,0,0,0]
[0,0,0,0,0,0,0,0,0,0,0,0,0,0,0,0,0,0,0,0,0,0,0,0,0,0,0,0,0]
[0,0,0,0,0,0,0,0,0,0,0,0,0,0,0,0,0,0,0,0,0,0,0,0,0,0,0,0,0]
[0,0,0,0,0,0,0,0,0,0,0,0,0,0,0,0,0,0,0,0,0,0,0,0,0,0,0,0,0]
[0,0,0,0,0,0,0,0,0,0,0,0,0,0,0,0,0,0,0,0,0,0,0,0,0,0,0,0,0]
[0,0,0,0,0,0,0,0,0,0,0,0,0,0,0,0,0,0,0,0,0,0,0,0,0,0,0,0,0]
[0,0,0,0,0,0,0,0,0,0,0,0,0,0,0,0,0,0,0,0,0,0,0,0,0,0,0,0,0]
[0,0,0,0,0,0,0,0,0,0,0,0,0,0,0,0,0,0,0,0,0,0,0,0,0,0,0,0,0]
[0,0,0,0,0,0,0,0,0,0,0,0,0,0,0,0,0,0,0,0,0,0,0,0,0,0,0,0,0]
[0,0,0,0,0,0,0,0,0,0,0,0,0,0,0,0,0,0,0,0,0,0,0,0,0,0,0,0,0]
[0,0,0,0,0,0,0,0,0,0,0,0,0,0,0,0,0,0,0,0,0,0,0,0,0,0,0,0,0]
[0,0,0,0,0,0,0,0,0,0,0,0,0,0,0,0,0,0,0,0,0,0,0,0,0,0,0,0,0]
[0,0,0,0,0,0,0,0,0,0,0,0,0,0,0,0,0,0,0,0,0,0,0,0,0,0,0,0,0]
[0,0,0,0,0,0,0,0,0,0,0,0,0,0,0,0,0,0,0,0,0,0,0,0,0,0,0,0,0]
[0,0,0,0,0,0,0,0,0,0,0,0,0,0,0,0,0,0,0,0,0,0,0,0,0,0,0,0,0]
[0,0,0,0,0,0,0,0,0,0,0,0,0,0,0,0,0,0,0,0,0,0,0,0,0,0,0,0,0]
[0,0,0,0,0,0,0,0,0,0,0,0,0,0,0,0,0,0,0,0,0,0,0,0,0,0,0,0,0]
[0,0,0,0,0,0,0,0,0,0,0,0,0,0,0,0,0,0,0,0,0,0,0,0,0,0,0,0,0]
[0,0,0,0,0,0,0,0,0,0,0,0,0,0,0,0,0,0,0,0,0,0,0,0,0,0,0,0,0]
[0,0,0,0,0,0,0,0,0,0,0,0,0,0,0,0,0,0,0,0,0,0,0,0,0,0,0,0,0]
[0,0,0,0,0,0,0,0,0,0,0,0,0,0,0,0,0,0,0,0,0,0,0,0,0,0,0,0,0]
[0,0,0,0,0,0,0,0,0,0,0,0,0,0,0,0,0,0,0,0,0,0,0,0,0,0,0,0,0]
[0,0,0,0,0,0,0,0,0,0,0,0,0,0,0,0,0,0,0,0,0,0,0,0,0,0,0,0,0]
[0,0,0,0,0,0,0,0,0,0,0,0,0,0,0,0,0,0,0,0,0,0,0,0,0,0,0,0,0]
[0,0,0,0,0,0,0,0,0,0,0,0,0,0,0,0,0,0,0,0,0,0,0,0,0,0,0,0,0]
[0,0,0,0,0,0,0,0,0,0,0,0,0,0,0,0,0,0,0,0,0,0,0,0,0,0,0,0,0]
[0,0,0,0,0,0,0,0,0,0,0,0,0,0,0,0,0,0,0,0,0,0,0,0,0,0,0,0,0]
[0,0,0,0,0,0,0,0,0,0,0,0,0,0,0,0,0,0,0,0,0,0,0,0,0,0,0,0,0]
[0,0,0,0,0,0,0,0,0,0,0,0,0,0,0,0,0,0,0,0,0,0,0,0,0,0,0,0,0]
[0,0,0,0,0,0,0,0,0,0,0,0,0,0,0,0,0,0,0,0,0,0,0,0,0,0,0,0,0]
[0,0,0,0,0,0,0,0,0,0,0,0,0,0,0,0,0,0,0,0,0,0,0,0,0,0,0,0,0]
[0,0,0,0,0,0,0,0,0,0,0,0,0,0,0,0,0,0,0,0,0,0,0,0,0,0,0,0,0]
[0,0,0,0,0,0,0,0,0,0,0,0,0,0,0,0,0,0,0,0,0,0,0,0,0,0,0,0,0]
[0,0,0,0,0,0,0,0,0,0,0,0,0,0,0,0,0,0,0,0,0,0,0,0,0,0,0,0,0]
[0,0,0,0,0,0,0,0,0,0,0,0,0,0,0,0,0,0,0,0,0,0,0,0,0,0,0,0,0]
[0,0,0,0,0,0,0,0,0,0,0,0,0,0,0,0,0,0,0,0,0,0,0,0,0,0,0,0,0]
[0,0,0,0,0,0,0,0,0,0,0,0,0,0,0,0,0,0,0,0,0,0,0,0,0,0,0,0,0]
[0,0,0,0,0,0,0,0,0,0,0,0,0,0,0,0,0,0,0,0,0,0,0,0,0,0,0,0,0]
[0,0,0,0,0,0,0,0,0,0,0,0,0,0,0,0,0,0,0,0,0,0,0,0,0,0,0,0,0]
[0,0,0,0,0,0,0,0,0,0,0,0,0,0,0,0,0,0,0,0,0,0,0,0,0,0,0,0,0]
[0,0,0,0,0,0,0,0,0,0,0,0,0,0,0,0,0,0,0,0,0,0,0,0,0,0,0,0,0]
[0,0,0,0,0,0,0,0,0,0,0,0,0,0,0,0,0,0,0,0,0,0,0,0,0,0,0,0,0]
[0,0,0,0,0,0,0,0,0,0,0,0,0,0,0,0,0,0,0,0,0,0,0,0,0,0,0,0,0]
[0,0,0,0,0,0,0,0,0,0,0,0,0,0,0,0,0,0,0,0,0,0,0,0,0,0,0,0,0]
[0,0,0,0,0,0,0,0,0,0,0,0,0,0,0,0,0,0,0,0,0,0,0,0,0,0,0,0,0]
[0,0,0,0,0,0,0,0,0,0,0,0,0,0,0,0,0,0,0,0,0,0,0,0,0,0,0,0,0]
[0,0,0,0,0,0,0,0,0,0,0,0,0,0,0,0,0,0,0,0,0,0,0,0,0,0,0,0,0]
[0,0,0,0,0,0,0,0,0,0,0,0,0,0,0,0,0,0,0,0,0,0,0,0,0,0,0,0,0]
[0,0,0,0,0,0,0,0,0,0,0,0,0,0,0,0,0,0,0,0,0,0,0,0,0,0,0,0,0]
[0,0,0,0,0,0,0,0,0,0,0,0,0,0,0,0,0,0,0,0,0,0,0,0,0,0,0,0,0]
[0,0,0,0,0,0,0,0,0,0,0,0,0,0,0,0,0,0,0,0,0,0,0,0,0,0,0,0,0]
[0,0,0,0,0,0,0,0,0,0,0,0,0,0,0,0,0,0,0,0,0,0,0,0,0,0,0,0,0]
[0,0,0,0,0,0,0,0,0,0,0,0,0,0,0,0,0,0,0,0,0,0,0,0,0,0,0,0,0]
[0,0,0,0,0,0,0,0,0,0,0,0,0,0,0,0,0,0,0,0,0,0,0,0,0,0,0,0,0]
[0,0,0,0,0,0,0,0,0,0,0,0,0,0,0,0,0,0,0,0,0,0,0,0,0,0,0,0,0]
[0,0,0,0,0,0,0,0,0,0,0,0,0,0,0,0,0,0,0,0,0,0,0,0,0,0,0,0,0]
[0,0,0,0,0,0,0,0,0,0,0,0,0,0,0,0,0,0,0,0,0,0,0,0,0,0,0,0,0]
[0,0,0,0,0,0,0,0,0,0,0,0,0,0,0,0,0,0,0,0,0,0,0,0,0,0,0,0,0]
[0,0,0,0,0,0,0,0,0,0,0,0,0,0,0,0,0,0,0,0,0,0,0,0,0,0,0,0,0]
[0,0,0,0,0,0,0,0,0,0,0,0,0,0,0,0,0,0,0,0,0,0,0,0,0,0,0,0,0]
[0,0,0,0,0,0,0,0,0,0,0,0,0,0,0,0,0,0,0,0,0,0,0,0,0,0,0,0,0]
[0,0,0,0,0,0,0,0,0,0,0,0,0,0,0,0,0,0,0,0,0,0,0,0,0,0,0,0,0]
[0,0,0,0,0,0,0,0,0,0,0,0,0,0,0,0,0,0,0,0,0,0,0,0,0,0,0,0,0]
[0,0,0,0,0,0,0,0,0,0,0,0,0,0,0,0,0,0,0,0,0,0,0,0,0,0,0,0,0]
[0,0,0,0,0,0,0,0,0,0,0,0,0,0,0,0,0,0,0,0,0,0,0,0,0,0,0,0,0]
[0,0,0,0,0,0,0,0,0,0,0,0,0,0,0,0,0,0,0,0,0,0,0,0,0,0,0,0,0]
[0,0,0,0,0,0,0,0,0,0,0,0,0,0,0,0,0,0,0,0,0,0,0,0,0,0,0,0,0]
[0,0,0,0,0,0,0,0,0,0,0,0,0,0,0,0,0,0,0,0,0,0,0,0,0,0,0,0,0]
[0,0,0,0,0,0,0,0,0,0,0,0,0,0,0,0,0,0,0,0,0,0,0,0,0,0,0,0,0]
[0,0,0,0,0,0,0,0,0,0,0,0,0,0,0,0,0,0,0,0,0,0,0,0,0,0,0,0,0]
[0,0,0,0,0,0,0,0,0,0,0,0,0,0,0,0,0,0,0,0,0,0,0,0,0,0,0,0,0]
[0,0,0,0,0,0,0,0,0,0,0,0,0,0,0,0,0,0,0,0,0,0,0,0,0,0,0,0,0]
[0,0,0,0,0,0,0,0,0,0,0,0,0,0,0,0,0,0,0,0,0,0,0,0,0,0,0,0,0]
[0,0,0,0,0,0,0,0,0,0,0,0,0,0,0,0,0,0,0,0,0,0,0,0,0,0,0,0,0]
[0,0,0,0,0,0,0,0,0,0,0,0,0,0,0,0,0,0,0,0,0,0,0,0,0,0,0,0,0]
[0,0,0,0,0,0,0,0,0,0,0,0,0,0,0,0,0,0,0,0,0,0,0,0,0,0,0,0,0]
[0,0,0,0,0,0,0,0,0,0,0,0,0,0,0,0,0,0,0,0,0,0,0,0,0,0,0,0,0]
[0,0,0,0,0,0,0,0,0,0,0,0,0,0,0,0,0,0,0,0,0,0,0,0,0,0,0,0,0]
[0,0,0,0,0,0,0,0,0,0,0,0,0,0,0,0,0,0,0,0,0,0,0,0,0,0,0,0,0]
[0,0,0,0,0,0,0,0,0,0,0,0,0,0,0,0,0,0,0,0,0,0,0,0,0,0,0,0,0]
[0,0,0,0,0,0,0,0,0,0,0,0,0,0,0,0,0,0,0,0,0,0,0,0,0,0,0,0,0]
[0,0,0,0,0,0,0,0,0,0,0,0,0,0,0,0,0,0,0,0,0,0,0,0,0,0,0,0,0]
[0,0,0,0,0,0,0,0,0,0,0,0,0,0,0,0,0,0,0,0,0,0,0,0,0,0,0,0,0]
[0,0,0,0,0,0,0,0,0,0,0,0,0,0,0,0,0,0,0,0,0,0,0,0,0,0,0,0,0]
[0,0,0,0,0,0,0,0,0,0,0,0,0,0,0,0,0,0,0,0,0,0,0,0,0,0,0,0,0]
[0,0,0,0,0,0,0,0,0,0,0,0,0,0,0,0,0,0,0,0,0,0,0,0,0,0,0,0,0]
[0,0,0,0,0,0,0,0,0,0,0,0,0,0,0,0,0,0,0,0,0,0,0,0,0,0,0,0,0]
[0,0,0,0,0,0,0,0,0,0,0,0,0,0,0,0,0,0,0,0,0,0,0,0,0,0,0,0,0]
[0,0,0,0,0,0,0,0,0,0,0,0,0,0,0,0,0,0,0,0,0,0,0,0,0,0,0,0,0]
[0,0,0,0,0,0,0,0,0,0,0,0,0,0,0,0,0,0,0,0,0,0,0,0,0,0,0,0,0]
[0,0,0,0,0,0,0,0,0,0,0,0,0,0,0,0,0,0,0,0,0,0,0,0,0,0,0,0,0]
[0,0,0,0,0,0,0,0,0,0,0,0,0,0,0,0,0,0,0,0,0,0,0,0,0,0,0,0,0]
[0,0,0,0,0,0,0,0,0,0,0,0,0,0,0,0,0,0,0,0,0,0,0,0,0,0,0,0,0]
[0,0,0,0,0,0,0,0,0,0,0,0,0,0,0,0,0,0,0,0,0,0,0,0,0,0,0,0,0]
[0,0,0,0,0,0,0,0,0,0,0,0,0,0,0,0,0,0,0,0,0,0,0,0,0,0,0,0,0]
[0,0,0,0,0,0,0,0,0,0,0,0,0,0,0,0,0,0,0,0,0,0,0,0,0,0,0,0,0]
[0,0,0,0,0,0,0,0,0,0,0,0,0,0,0,0,0,0,0,0,0,0,0,0,0,0,0,0,0]
[0,0,0,0,0,0,0,0,0,0,0,0,0,0,0,0,0,0,0,0,0,0,0,0,0,0,0,0,0]
[0,0,0,0,0,0,0,0,0,0,0,0,0,0,0,0,0,0,0,0,0,0,0,0,0,0,0,0,0]
[0,0,0,0,0,0,0,0,0,0,0,0,0,0,0,0,0,0,0,0,0,0,0,0,0,0,0,0,0]
[0,0,0,0,0,0,0,0,0,0,0,0,0,0,0,0,0,0,0,0,0,0,0,0,0,0,0,0,0]
[0,0,0,0,0,0,0,0,0,0,0,0,0,0,0,0,0,0,0,0,0,0,0,0,0,0,0,0,0]
[0,0,0,0,0,0,0,0,0,0,0,0,0,0,0,0,0,0,0,0,0,0,0,0,0,0,0,0,0]
[0,0,0,0,0,0,0,0,0,0,0,0,0,0,0,0,0,0,0,0,0,0,0,0,0,0,0,0,0]
[0,0,0,0,0,0,0,0,0,0,0,0,0,0,0,0,0,0,0,0,0,0,0,0,0,0,0,0,0]
[0,0,0,0,0,0,0,0,0,0,0,0,0,0,0,0,0,0,0,0,0,0,0,0,0,0,0,0,0]
[0,0,0,0,0,0,0,0,0,0,0,0,0,0,0,0,0,0,0,0,0,0,0,0,0,0,0,0,0]
[0,0,0,0,0,0,0,0,0,0,0,0,0,0,0,0,0,0,0,0,0,0,0,0,0,0,0,0,0]
[0,0,0,0,0,0,0,0,0,0,0,0,0,0,0,0,0,0,0,0,0,0,0,0,0,0,0,0,0]
[0,0,0,0,0,0,0,0,0,0,0,0,0,0,0,0,0,0,0,0,0,0,0,0,0,0,0,0,0]
[0,0,0,0,0,0,0,0,0,0,0,0,0,0,0,0,0,0,0,0,0,0,0,0,0,0,0,0,0]
[0,0,0,0,0,0,0,0,0,0,0,0,0,0,0,0,0,0,0,0,0,0,0,0,0,0,0,0,0]
[0,0,0,0,0,0,0,0,0,0,0,0,0,0,0,0,0,0,0,0,0,0,0,0,0,0,0,0,0]
[0,0,0,0,0,0,0,0,0,0,0,0,0,0,0,0,0,0,0,0,0,0,0,0,0,0,0,0,0]
[0,0,0,0,0,0,0,0,0,0,0,0,0,0,0,0,0,0,0,0,0,0,0,0,0,0,0,0,0]
[0,0,0,0,0,0,0,0,0,0,0,0,0,0,0,0,0,0,0,0,0,0,0,0,0,0,0,0,0]
[0,0,0,0,0,0,0,0,0,0,0,0,0,0,0,0,0,0,0,0,0,0,0,0,0,0,0,0,0]
[0,0,0,0,0,0,0,0,0,0,0,0,0,0,0,0,0,0,0,0,0,0,0,0,0,0,0,0,0]
[0,0,0,0,0,0,0,0,0,0,0,0,0,0,0,0,0,0,0,0,0,0,0,0,0,0,0,0,0]
[0,0,0,0,0,0,0,0,0,0,0,0,0,0,0,0,0,0,0,0,0,0,0,0,0,0,0,0,0]
[0,0,0,0,0,0,0,0,0,0,0,0,0,0,0,0,0,0,0,0,0,0,0,0,0,0,0,0,0]
[0,0,0,0,0,0,0,0,0,0,0,0,0,0,0,0,0,0,0,0,0,0,0,0,0,0,0,0,0]
[0,0,0,0,0,0,0,0,0,0,0,0,0,0,0,0,0,0,0,0,0,0,0,0,0,0,0,0,0]
[0,0,0,0,0,0,0,0,0,0,0,0,0,0,0,0,0,0,0,0,0,0,0,0,0,0,0,0,0]
[0,0,0,0,0,0,0,0,0,0,0,0,0,0,0,0,0,0,0,0,0,0,0,0,0,0,0,0,0]
[0,0,0,0,0,0,0,0,0,0,0,0,0,0,0,0,0,0,0,0,0,0,0,0,0,0,0,0,0]
[0,0,0,0,0,0,0,0,0,0,0,0,0,0,0,0,0,0,0,0,0,0,0,0,0,0,0,0,0]
[0,0,0,0,0,0,0,0,0,0,0,0,0,0,0,0,0,0,0,0,0,0,0,0,0,0,0,0,0]
[0,0,0,0,0,0,0,0,0,0,0,0,0,0,0,0,0,0,0,0,0,0,0,0,0,0,0,0,0]
[0,0,0,0,0,0,0,0,0,0,0,0,0,0,0,0,0,0,0,0,0,0,0,0,0,0,0,0,0]
[0,0,0,0,0,0,0,0,0,0,0,0,0,0,0,0,0,0,0,0,0,0,0,0,0,0,0,0,0]
[0,0,0,0,0,0,0,0,0,0,0,0,0,0,0,0,0,0,0,0,0,0,0,0,0,0,0,0,0]
[0,0,0,0,0,0,0,0,0,0,0,0,0,0,0,0,0,0,0,0,0,0,0,0,0,0,0,0,0]
[0,0,0,0,0,0,0,0,0,0,0,0,0,0,0,0,0,0,0,0,0,0,0,0,0,0,0,0,0]
[0,0,0,0,0,0,0,0,0,0,0,0,0,0,0,0,0,0,0,0,0,0,0,0,0,0,0,0,0]
[0,0,0,0,0,0,0,0,0,0,0,0,0,0,0,0,0,0,0,0,0,0,0,0,0,0,0,0,0]
[0,0,0,0,0,0,0,0,0,0,0,0,0,0,0,0,0,0,0,0,0,0,0,0,0,0,0,0,0]
[0,0,0,0,0,0,0,0,0,0,0,0,0,0,0,0,0,0,0,0,0,0,0,0,0,0,0,0,0]
[0,0,0,0,0,0,0,0,0,0,0,0,0,0,0,0,0,0,0,0,0,0,0,0,0,0,0,0,0]
[0,0,0,0,0,0,0,0,0,0,0,0,0,0,0,0,0,0,0,0,0,0,0,0,0,0,0,0,0]
[0,0,0,0,0,0,0,0,0,0,0,0,0,0,0,0,0,0,0,0,0,0,0,0,0,0,0,0,0]
[0,0,0,0,0,0,0,0,0,0,0,0,0,0,0,0,0,0,0,0,0,0,0,0,0,0,0,0,0]
[0,0,0,0,0,0,0,0,0,0,0,0,0,0,0,0,0,0,0,0,0,0,0,0,0,0,0,0,0]
[0,0,0,0,0,0,0,0,0,0,0,0,0,0,0,0,0,0,0,0,0,0,0,0,0,0,0,0,0]
[0,0,0,0,0,0,0,0,0,0,0,0,0,0,0,0,0,0,0,0,0,0,0,0,0,0,0,0,0]
[0,0,0,0,0,0,0,0,0,0,0,0,0,0,0,0,0,0,0,0,0,0,0,0,0,0,0,0,0]
[0,0,0,0,0,0,0,0,0,0,0,0,0,0,0,0,0,0,0,0,0,0,0,0,0,0,0,0,0]
[0,0,0,0,0,0,0,0,0,0,0,0,0,0,0,0,0,0,0,0,0,0,0,0,0,0,0,0,0]
[0,0,0,0,0,0,0,0,0,0,0,0,0,0,0,0,0,0,0,0,0,0,0,0,0,0,0,0,0]
[0,0,0,0,0,0,0,0,0,0,0,0,0,0,0,0,0,0,0,0,0,0,0,0,0,0,0,0,0]
[0,0,0,0,0,0,0,0,0,0,0,0,0,0,0,0,0,0,0,0,0,0,0,0,0,0,0,0,0]
[0,0,0,0,0,0,0,0,0,0,0,0,0,0,0,0,0,0,0,0,0,0,0,0,0,0,0,0,0]
[0,0,0,0,0,0,0,0,0,0,0,0,0,0,0,0,0,0,0,0,0,0,0,0,0,0,0,0,0]
[0,0,0,0,0,0,0,0,0,0,0,0,0,0,0,0,0,0,0,0,0,0,0,0,0,0,0,0,0]
[0,0,0,0,0,0,0,0,0,0,0,0,0,0,0,0,0,0,0,0,0,0,0,0,0,0,0,0,0]
[0,0,0,0,0,0,0,0,0,0,0,0,0,0,0,0,0,0,0,0,0,0,0,0,0,0,0,0,0]
[0,0,0,0,0,0,0,0,0,0,0,0,0,0,0,0,0,0,0,0,0,0,0,0,0,0,0,0,0]
[0,0,0,0,0,0,0,0,0,0,0,0,0,0,0,0,0,0,0,0,0,0,0,0,0,0,0,0,0]
[0,0,0,0,0,0,0,0,0,0,0,0,0,0,0,0,0,0,0,0,0,0,0,0,0,0,0,0,0]
[0,0,0,0,0,0,0,0,0,0,0,0,0,0,0,0,0,0,0,0,0,0,0,0,0,0,0,0,0]
[0,0,0,0,0,0,0,0,0,0,0,0,0,0,0,0,0,0,0,0,0,0,0,0,0,0,0,0,0]
[0,0,0,0,0,0,0,0,0,0,0,0,0,0,0,0,0,0,0,0,0,0,0,0,0,0,0,0,0]
[0,0,0,0,0,0,0,0,0,0,0,0,0,0,0,0,0,0,0,0,0,0,0,0,0,0,0,0,0]
[0,0,0,0,0,0,0,0,0,0,0,0,0,0,0,0,0,0,0,0,0,0,0,0,0,0,0,0,0]
[0,0,0,0,0,0,0,0,0,0,0,0,0,0,0,0,0,0,0,0,0,0,0,0,0,0,0,0,0]
[0,0,0,0,0,0,0,0,0,0,0,0,0,0,0,0,0,0,0,0,0,0,0,0,0,0,0,0,0]
[0,0,0,0,0,0,0,0,0,0,0,0,0,0,0,0,0,0,0,0,0,0,0,0,0,0,0,0,0]
[0,0,0,0,0,0,0,0,0,0,0,0,0,0,0,0,0,0,0,0,0,0,0,0,0,0,0,0,0]
[0,0,0,0,0,0,0,0,0,0,0,0,0,0,0,0,0,0,0,0,0,0,0,0,0,0,0,0,0]
[0,0,0,0,0,0,0,0,0,0,0,0,0,0,0,0,0,0,0,0,0,0,0,0,0,0,0,0,0]
[0,0,0,0,0,0,0,0,0,0,0,0,0,0,0,0,0,0,0,0,0,0,0,0,0,0,0,0,0]
[0,0,0,0,0,0,0,0,0,0,0,0,0,0,0,0,0,0,0,0,0,0,0,0,0,0,0,0,0]
[0,0,0,0,0,0,0,0,0,0,0,0,0,0,0,0,0,0,0,0,0,0,0,0,0,0,0,0,0]
[0,0,0,0,0,0,0,0,0,0,0,0,0,0,0,0,0,0,0,0,0,0,0,0,0,0,0,0,0]
[0,0,0,0,0,0,0,0,0,0,0,0,0,0,0,0,0,0,0,0,0,0,0,0,0,0,0,0,0]
[0,0,0,0,0,0,0,0,0,0,0,0,0,0,0,0,0,0,0,0,0,0,0,0,0,0,0,0,0]
[0,0,0,0,0,0,0,0,0,0,0,0,0,0,0,0,0,0,0,0,0,0,0,0,0,0,0,0,0]
[0,0,0,0,0,0,0,0,0,0,0,0,0,0,0,0,0,0,0,0,0,0,0,0,0,0,0,0,0]
[0,0,0,0,0,0,0,0,0,0,0,0,0,0,0,0,0,0,0,0,0,0,0,0,0,0,0,0,0]
[0,0,0,0,0,0,0,0,0,0,0,0,0,0,0,0,0,0,0,0,0,0,0,0,0,0,0,0,0]
[0,0,0,0,0,0,0,0,0,0,0,0,0,0,0,0,0,0,0,0,0,0,0,0,0,0,0,0,0]
[0,0,0,0,0,0,0,0,0,0,0,0,0,0,0,0,0,0,0,0,0,0,0,0,0,0,0,0,0]
[0,0,0,0,0,0,0,0,0,0,0,0,0,0,0,0,0,0,0,0,0,0,0,0,0,0,0,0,0]
[0,0,0,0,0,0,0,0,0,0,0,0,0,0,0,0,0,0,0,0,0,0,0,0,0,0,0,0,0]
[0,0,0,0,0,0,0,0,0,0,0,0,0,0,0,0,0,0,0,0,0,0,0,0,0,0,0,0,0]
[0,0,0,0,0,0,0,0,0,0,0,0,0,0,0,0,0,0,0,0,0,0,0,0,0,0,0,0,0]
[0,0,0,0,0,0,0,0,0,0,0,0,0,0,0,0,0,0,0,0,0,0,0,0,0,0,0,0,0]
[0,0,0,0,0,0,0,0,0,0,0,0,0,0,0,0,0,0,0,0,0,0,0,0,0,0,0,0,0]
[0,0,0,0,0,0,0,0,0,0,0,0,0,0,0,0,0,0,0,0,0,0,0,0,0,0,0,0,0]
[0,0,0,0,0,0,0,0,0,0,0,0,0,0,0,0,0,0,0,0,0,0,0,0,0,0,0,0,0]
[0,0,0,0,0,0,0,0,0,0,0,0,0,0,0,0,0,0,0,0,0,0,0,0,0,0,0,0,0]
[0,0,0,0,0,0,0,0,0,0,0,0,0,0,0,0,0,0,0,0,0,0,0,0,0,0,0,0,0]
[0,0,0,0,0,0,0,0,0,0,0,0,0,0,0,0,0,0,0,0,0,0,0,0,0,0,0,0,0]
[0,0,0,0,0,0,0,0,0,0,0,0,0,0,0,0,0,0,0,0,0,0,0,0,0,0,0,0,0]
[0,0,0,0,0,0,0,0,0,0,0,0,0,0,0,0,0,0,0,0,0,0,0,0,0,0,0,0,0]
[0,0,0,0,0,0,0,0,0,0,0,0,0,0,0,0,0,0,0,0,0,0,0,0,0,0,0,0,0]
[0,0,0,0,0,0,0,0,0,0,0,0,0,0,0,0,0,0,0,0,0,0,0,0,0,0,0,0,0]
[0,0,0,0,0,0,0,0,0,0,0,0,0,0,0,0,0,0,0,0,0,0,0,0,0,0,0,0,0]
[0,0,0,0,0,0,0,0,0,0,0,0,0,0,0,0,0,0,0,0,0,0,0,0,0,0,0,0,0]
[0,0,0,0,0,0,0,0,0,0,0,0,0,0,0,0,0,0,0,0,0,0,0,0,0,0,0,0,0]
[0,0,0,0,0,0,0,0,0,0,0,0,0,0,0,0,0,0,0,0,0,0,0,0,0,0,0,0,0]
[0,0,0,0,0,0,0,0,0,0,0,0,0,0,0,0,0,0,0,0,0,0,0,0,0,0,0,0,0]
[0,0,0,0,0,0,0,0,0,0,0,0,0,0,0,0,0,0,0,0,0,0,0,0,0,0,0,0,0]
[0,0,0,0,0,0,0,0,0,0,0,0,0,0,0,0,0,0,0,0,0,0,0,0,0,0,0,0,0]
[0,0,0,0,0,0,0,0,0,0,0,0,0,0,0,0,0,0,0,0,0,0,0,0,0,0,0,0,0]
[0,0,0,0,0,0,0,0,0,0,0,0,0,0,0,0,0,0,0,0,0,0,0,0,0,0,0,0,0]
[0,0,0,0,0,0,0,0,0,0,0,0,0,0,0,0,0,0,0,0,0,0,0,0,0,0,0,0,0]
[0,0,0,0,0,0,0,0,0,0,0,0,0,0,0,0,0,0,0,0,0,0,0,0,0,0,0,0,0]
[0,0,0,0,0,0,0,0,0,0,0,0,0,0,0,0,0,0,0,0,0,0,0,0,0,0,0,0,0]
[0,0,0,0,0,0,0,0,0,0,0,0,0,0,0,0,0,0,0,0,0,0,0,0,0,0,0,0,0]
[0,0,0,0,0,0,0,0,0,0,0,0,0,0,0,0,0,0,0,0,0,0,0,0,0,0,0,0,0]
[0,0,0,0,0,0,0,0,0,0,0,0,0,0,0,0,0,0,0,0,0,0,0,0,0,0,0,0,0]
[0,0,0,0,0,0,0,0,0,0,0,0,0,0,0,0,0,0,0,0,0,0,0,0,0,0,0,0,0]
[0,0,0,0,0,0,0,0,0,0,0,0,0,0,0,0,0,0,0,0,0,0,0,0,0,0,0,0,0]
[0,0,0,0,0,0,0,0,0,0,0,0,0,0,0,0,0,0,0,0,0,0,0,0,0,0,0,0,0]
[0,0,0,0,0,0,0,0,0,0,0,0,0,0,0,0,0,0,0,0,0,0,0,0,0,0,0,0,0]
[0,0,0,0,0,0,0,0,0,0,0,0,0,0,0,0,0,0,0,0,0,0,0,0,0,0,0,0,0]
[0,0,0,0,0,0,0,0,0,0,0,0,0,0,0,0,0,0,0,0,0,0,0,0,0,0,0,0,0]
[0,0,0,0,0,0,0,0,0,0,0,0,0,0,0,0,0,0,0,0,0,0,0,0,0,0,0,0,0]
[0,0,0,0,0,0,0,0,0,0,0,0,0,0,0,0,0,0,0,0,0,0,0,0,0,0,0,0,0]
[0,0,0,0,0,0,0,0,0,0,0,0,0,0,0,0,0,0,0,0,0,0,0,0,0,0,0,0,0]
[0,0,0,0,0,0,0,0,0,0,0,0,0,0,0,0,0,0,0,0,0,0,0,0,0,0,0,0,0]
[0,0,0,0,0,0,0,0,0,0,0,0,0,0,0,0,0,0,0,0,0,0,0,0,0,0,0,0,0]
[0,0,0,0,0,0,0,0,0,0,0,0,0,0,0,0,0,0,0,0,0,0,0,0,0,0,0,0,0]
[0,0,0,0,0,0,0,0,0,0,0,0,0,0,0,0,0,0,0,0,0,0,0,0,0,0,0,0,0]
[0,0,0,0,0,0,0,0,0,0,0,0,0,0,0,0,0,0,0,0,0,0,0,0,0,0,0,0,0]
[0,0,0,0,0,0,0,0,0,0,0,0,0,0,0,0,0,0,0,0,0,0,0,0,0,0,0,0,0]
[0,0,0,0,0,0,0,0,0,0,0,0,0,0,0,0,0,0,0,0,0,0,0,0,0,0,0,0,0]
[0,0,0,0,0,0,0,0,0,0,0,0,0,0,0,0,0,0,0,0,0,0,0,0,0,0,0,0,0]
[0,0,0,0,0,0,0,0,0,0,0,0,0,0,0,0,0,0,0,0,0,0,0,0,0,0,0,0,0]
[0,0,0,0,0,0,0,0,0,0,0,0,0,0,0,0,0,0,0,0,0,0,0,0,0,0,0,0,0]
[0,0,0,0,0,0,0,0,0,0,0,0,0,0,0,0,0,0,0,0,0,0,0,0,0,0,0,0,0]
[0,0,0,0,0,0,0,0,0,0,0,0,0,0,0,0,0,0,0,0,0,0,0,0,0,0,0,0,0]
[0,0,0,0,0,0,0,0,0,0,0,0,0,0,0,0,0,0,0,0,0,0,0,0,0,0,0,0,0]
[0,0,0,0,0,0,0,0,0,0,0,0,0,0,0,0,0,0,0,0,0,0,0,0,0,0,0,0,0]
[0,0,0,0,0,0,0,0,0,0,0,0,0,0,0,0,0,0,0,0,0,0,0,0,0,0,0,0,0]
[0,0,0,0,0,0,0,0,0,0,0,0,0,0,0,0,0,0,0,0,0,0,0,0,0,0,0,0,0]
[0,0,0,0,0,0,0,0,0,0,0,0,0,0,0,0,0,0,0,0,0,0,0,0,0,0,0,0,0]
[0,0,0,0,0,0,0,0,0,0,0,0,0,0,0,0,0,0,0,0,0,0,0,0,0,0,0,0,0]
[0,0,0,0,0,0,0,0,0,0,0,0,0,0,0,0,0,0,0,0,0,0,0,0,0,0,0,0,0]
[0,0,0,0,0,0,0,0,0,0,0,0,0,0,0,0,0,0,0,0,0,0,0,0,0,0,0,0,0]
[0,0,0,0,0,0,0,0,0,0,0,0,0,0,0,0,0,0,0,0,0,0,0,0,0,0,0,0,0]
[0,0,0,0,0,0,0,0,0,0,0,0,0,0,0,0,0,0,0,0,0,0,0,0,0,0,0,0,0]
[0,0,0,0,0,0,0,0,0,0,0,0,0,0,0,0,0,0,0,0,0,0,0,0,0,0,0,0,0]
[0,0,0,0,0,0,0,0,0,0,0,0,0,0,0,0,0,0,0,0,0,0,0,0,0,0,0,0,0]
[0,0,0,0,0,0,0,0,0,0,0,0,0,0,0,0,0,0,0,0,0,0,0,0,0,0,0,0,0]
[0,0,0,0,0,0,0,0,0,0,0,0,0,0,0,0,0,0,0,0,0,0,0,0,0,0,0,0,0]
[0,0,0,0,0,0,0,0,0,0,0,0,0,0,0,0,0,0,0,0,0,0,0,0,0,0,0,0,0]
[0,0,0,0,0,0,0,0,0,0,0,0,0,0,0,0,0,0,0,0,0,0,0,0,0,0,0,0,0]
[0,0,0,0,0,0,0,0,0,0,0,0,0,0,0,0,0,0,0,0,0,0,0,0,0,0,0,0,0]
[0,0,0,0,0,0,0,0,0,0,0,0,0,0,0,0,0,0,0,0,0,0,0,0,0,0,0,0,0]
[0,0,0,0,0,0,0,0,0,0,0,0,0,0,0,0,0,0,0,0,0,0,0,0,0,0,0,0,0]
[0,0,0,0,0,0,0,0,0,0,0,0,0,0,0,0,0,0,0,0,0,0,0,0,0,0,0,0,0]
[0,0,0,0,0,0,0,0,0,0,0,0,0,0,0,0,0,0,0,0,0,0,0,0,0,0,0,0,0]
[0,0,0,0,0,0,0,0,0,0,0,0,0,0,0,0,0,0,0,0,0,0,0,0,0,0,0,0,0]
[0,0,0,0,0,0,0,0,0,0,0,0,0,0,0,0,0,0,0,0,0,0,0,0,0,0,0,0,0]
[0,0,0,0,0,0,0,0,0,0,0,0,0,0,0,0,0,0,0,0,0,0,0,0,0,0,0,0,0]
[0,0,0,0,0,0,0,0,0,0,0,0,0,0,0,0,0,0,0,0,0,0,0,0,0,0,0,0,0]
[0,0,0,0,0,0,0,0,0,0,0,0,0,0,0,0,0,0,0,0,0,0,0,0,0,0,0,0,0]
[0,0,0,0,0,0,0,0,0,0,0,0,0,0,0,0,0,0,0,0,0,0,0,0,0,0,0,0,0]
[0,0,0,0,0,0,0,0,0,0,0,0,0,0,0,0,0,0,0,0,0,0,0,0,0,0,0,0,0]
[0,0,0,0,0,0,0,0,0,0,0,0,0,0,0,0,0,0,0,0,0,0,0,0,0,0,0,0,0]
[0,0,0,0,0,0,0,0,0,0,0,0,0,0,0,0,0,0,0,0,0,0,0,0,0,0,0,0,0]
[0,0,0,0,0,0,0,0,0,0,0,0,0,0,0,0,0,0,0,0,0,0,0,0,0,0,0,0,0]
[0,0,0,0,0,0,0,0,0,0,0,0,0,0,0,0,0,0,0,0,0,0,0,0,0,0,0,0,0]
[0,0,0,0,0,0,0,0,0,0,0,0,0,0,0,0,0,0,0,0,0,0,0,0,0,0,0,0,0]
[0,0,0,0,0,0,0,0,0,0,0,0,0,0,0,0,0,0,0,0,0,0,0,0,0,0,0,0,0]
[0,0,0,0,0,0,0,0,0,0,0,0,0,0,0,0,0,0,0,0,0,0,0,0,0,0,0,0,0]
[0,0,0,0,0,0,0,0,0,0,0,0,0,0,0,0,0,0,0,0,0,0,0,0,0,0,0,0,0]
[0,0,0,0,0,0,0,0,0,0,0,0,0,0,0,0,0,0,0,0,0,0,0,0,0,0,0,0,0]
[0,0,0,0,0,0,0,0,0,0,0,0,0,0,0,0,0,0,0,0,0,0,0,0,0,0,0,0,0]
[0,0,0,0,0,0,0,0,0,0,0,0,0,0,0,0,0,0,0,0,0,0,0,0,0,0,0,0,0]
[0,0,0,0,0,0,0,0,0,0,0,0,0,0,0,0,0,0,0,0,0,0,0,0,0,0,0,0,0]
[0,0,0,0,0,0,0,0,0,0,0,0,0,0,0,0,0,0,0,0,0,0,0,0,0,0,0,0,0]
[0,0,0,0,0,0,0,0,0,0,0,0,0,0,0,0,0,0,0,0,0,0,0,0,0,0,0,0,0]
[0,0,0,0,0,0,0,0,0,0,0,0,0,0,0,0,0,0,0,0,0,0,0,0,0,0,0,0,0]
[0,0,0,0,0,0,0,0,0,0,0,0,0,0,0,0,0,0,0,0,0,0,0,0,0,0,0,0,0]
[0,0,0,0,0,0,0,0,0,0,0,0,0,0,0,0,0,0,0,0,0,0,0,0,0,0,0,0,0]
[0,0,0,0,0,0,0,0,0,0,0,0,0,0,0,0,0,0,0,0,0,0,0,0,0,0,0,0,0]
[0,0,0,0,0,0,0,0,0,0,0,0,0,0,0,0,0,0,0,0,0,0,0,0,0,0,0,0,0]
[0,0,0,0,0,0,0,0,0,0,0,0,0,0,0,0,0,0,0,0,0,0,0,0,0,0,0,0,0]
[0,0,0,0,0,0,0,0,0,0,0,0,0,0,0,0,0,0,0,0,0,0,0,0,0,0,0,0,0]
[0,0,0,0,0,0,0,0,0,0,0,0,0,0,0,0,0,0,0,0,0,0,0,0,0,0,0,0,0]
[0,0,0,0,0,0,0,0,0,0,0,0,0,0,0,0,0,0,0,0,0,0,0,0,0,0,0,0,0]
[0,0,0,0,0,0,0,0,0,0,0,0,0,0,0,0,0,0,0,0,0,0,0,0,0,0,0,0,0]
[0,0,0,0,0,0,0,0,0,0,0,0,0,0,0,0,0,0,0,0,0,0,0,0,0,0,0,0,0]
[0,0,0,0,0,0,0,0,0,0,0,0,0,0,0,0,0,0,0,0,0,0,0,0,0,0,0,0,0]
[0,0,0,0,0,0,0,0,0,0,0,0,0,0,0,0,0,0,0,0,0,0,0,0,0,0,0,0,0]
[0,0,0,0,0,0,0,0,0,0,0,0,0,0,0,0,0,0,0,0,0,0,0,0,0,0,0,0,0]
[0,0,0,0,0,0,0,0,0,0,0,0,0,0,0,0,0,0,0,0,0,0,0,0,0,0,0,0,0]
[0,0,0,0,0,0,0,0,0,0,0,0,0,0,0,0,0,0,0,0,0,0,0,0,0,0,0,0,0]
[0,0,0,0,0,0,0,0,0,0,0,0,0,0,0,0,0,0,0,0,0,0,0,0,0,0,0,0,0]
[0,0,0,0,0,0,0,0,0,0,0,0,0,0,0,0,0,0,0,0,0,0,0,0,0,0,0,0,0]
[0,0,0,0,0,0,0,0,0,0,0,0,0,0,0,0,0,0,0,0,0,0,0,0,0,0,0,0,0]
[0,0,0,0,0,0,0,0,0,0,0,0,0,0,0,0,0,0,0,0,0,0,0,0,0,0,0,0,0]
[0,0,0,0,0,0,0,0,0,0,0,0,0,0,0,0,0,0,0,0,0,0,0,0,0,0,0,0,0]
[0,0,0,0,0,0,0,0,0,0,0,0,0,0,0,0,0,0,0,0,0,0,0,0,0,0,0,0,0]
[0,0,0,0,0,0,0,0,0,0,0,0,0,0,0,0,0,0,0,0,0,0,0,0,0,0,0,0,0]
[0,0,0,0,0,0,0,0,0,0,0,0,0,0,0,0,0,0,0,0,0,0,0,0,0,0,0,0,0]
[0,0,0,0,0,0,0,0,0,0,0,0,0,0,0,0,0,0,0,0,0,0,0,0,0,0,0,0,0]
[0,0,0,0,0,0,0,0,0,0,0,0,0,0,0,0,0,0,0,0,0,0,0,0,0,0,0,0,0]
[0,0,0,0,0,0,0,0,0,0,0,0,0,0,0,0,0,0,0,0,0,0,0,0,0,0,0,0,0]
[0,0,0,0,0,0,0,0,0,0,0,0,0,0,0,0,0,0,0,0,0,0,0,0,0,0,0,0,0]
[0,0,0,0,0,0,0,0,0,0,0,0,0,0,0,0,0,0,0,0,0,0,0,0,0,0,0,0,0]
[0,0,0,0,0,0,0,0,0,0,0,0,0,0,0,0,0,0,0,0,0,0,0,0,0,0,0,0,0]
[0,0,0,0,0,0,0,0,0,0,0,0,0,0,0,0,0,0,0,0,0,0,0,0,0,0,0,0,0]
[0,0,0,0,0,0,0,0,0,0,0,0,0,0,0,0,0,0,0,0,0,0,0,0,0,0,0,0,0]
[0,0,0,0,0,0,0,0,0,0,0,0,0,0,0,0,0,0,0,0,0,0,0,0,0,0,0,0,0]
[0,0,0,0,0,0,0,0,0,0,0,0,0,0,0,0,0,0,0,0,0,0,0,0,0,0,0,0,0]
[0,0,0,0,0,0,0,0,0,0,0,0,0,0,0,0,0,0,0,0,0,0,0,0,0,0,0,0,0]
[0,0,0,0,0,0,0,0,0,0,0,0,0,0,0,0,0,0,0,0,0,0,0,0,0,0,0,0,0]
[0,0,0,0,0,0,0,0,0,0,0,0,0,0,0,0,0,0,0,0,0,0,0,0,0,0,0,0,0]
[0,0,0,0,0,0,0,0,0,0,0,0,0,0,0,0,0,0,0,0,0,0,0,0,0,0,0,0,0]
[0,0,0,0,0,0,0,0,0,0,0,0,0,0,0,0,0,0,0,0,0,0,0,0,0,0,0,0,0]
[0,0,0,0,0,0,0,0,0,0,0,0,0,0,0,0,0,0,0,0,0,0,0,0,0,0,0,0,0]
[0,0,0,0,0,0,0,0,0,0,0,0,0,0,0,0,0,0,0,0,0,0,0,0,0,0,0,0,0]
[0,0,0,0,0,0,0,0,0,0,0,0,0,0,0,0,0,0,0,0,0,0,0,0,0,0,0,0,0]
[0,0,0,0,0,0,0,0,0,0,0,0,0,0,0,0,0,0,0,0,0,0,0,0,0,0,0,0,0]
[0,0,0,0,0,0,0,0,0,0,0,0,0,0,0,0,0,0,0,0,0,0,0,0,0,0,0,0,0]
[0,0,0,0,0,0,0,0,0,0,0,0,0,0,0,0,0,0,0,0,0,0,0,0,0,0,0,0,0]
[0,0,0,0,0,0,0,0,0,0,0,0,0,0,0,0,0,0,0,0,0,0,0,0,0,0,0,0,0]
[0,0,0,0,0,0,0,0,0,0,0,0,0,0,0,0,0,0,0,0,0,0,0,0,0,0,0,0,0]
[0,0,0,0,0,0,0,0,0,0,0,0,0,0,0,0,0,0,0,0,0,0,0,0,0,0,0,0,0]
[0,0,0,0,0,0,0,0,0,0,0,0,0,0,0,0,0,0,0,0,0,0,0,0,0,0,0,0,0]
[0,0,0,0,0,0,0,0,0,0,0,0,0,0,0,0,0,0,0,0,0,0,0,0,0,0,0,0,0]
[0,0,0,0,0,0,0,0,0,0,0,0,0,0,0,0,0,0,0,0,0,0,0,0,0,0,0,0,0]
[0,0,0,0,0,0,0,0,0,0,0,0,0,0,0,0,0,0,0,0,0,0,0,0,0,0,0,0,0]
[0,0,0,0,0,0,0,0,0,0,0,0,0,0,0,0,0,0,0,0,0,0,0,0,0,0,0,0,0]
[0,0,0,0,0,0,0,0,0,0,0,0,0,0,0,0,0,0,0,0,0,0,0,0,0,0,0,0,0]
[0,0,0,0,0,0,0,0,0,0,0,0,0,0,0,0,0,0,0,0,0,0,0,0,0,0,0,0,0]
[0,0,0,0,0,0,0,0,0,0,0,0,0,0,0,0,0,0,0,0,0,0,0,0,0,0,0,0,0]
[0,0,0,0,0,0,0,0,0,0,0,0,0,0,0,0,0,0,0,0,0,0,0,0,0,0,0,0,0]
[0,0,0,0,0,0,0,0,0,0,0,0,0,0,0,0,0,0,0,0,0,0,0,0,0,0,0,0,0]
[0,0,0,0,0,0,0,0,0,0,0,0,0,0,0,0,0,0,0,0,0,0,0,0,0,0,0,0,0]
[0,0,0,0,0,0,0,0,0,0,0,0,0,0,0,0,0,0,0,0,0,0,0,0,0,0,0,0,0]
[0,0,0,0,0,0,0,0,0,0,0,0,0,0,0,0,0,0,0,0,0,0,0,0,0,0,0,0,0]
[0,0,0,0,0,0,0,0,0,0,0,0,0,0,0,0,0,0,0,0,0,0,0,0,0,0,0,0,0]
[0,0,0,0,0,0,0,0,0,0,0,0,0,0,0,0,0,0,0,0,0,0,0,0,0,0,0,0,0]
[0,0,0,0,0,0,0,0,0,0,0,0,0,0,0,0,0,0,0,0,0,0,0,0,0,0,0,0,0]
[0,0,0,0,0,0,0,0,0,0,0,0,0,0,0,0,0,0,0,0,0,0,0,0,0,0,0,0,0]
[0,0,0,0,0,0,0,0,0,0,0,0,0,0,0,0,0,0,0,0,0,0,0,0,0,0,0,0,0]
[0,0,0,0,0,0,0,0,0,0,0,0,0,0,0,0,0,0,0,0,0,0,0,0,0,0,0,0,0]
[0,0,0,0,0,0,0,0,0,0,0,0,0,0,0,0,0,0,0,0,0,0,0,0,0,0,0,0,0]
[0,0,0,0,0,0,0,0,0,0,0,0,0,0,0,0,0,0,0,0,0,0,0,0,0,0,0,0,0]
[0,0,0,0,0,0,0,0,0,0,0,0,0,0,0,0,0,0,0,0,0,0,0,0,0,0,0,0,0]
[0,0,0,0,0,0,0,0,0,0,0,0,0,0,0,0,0,0,0,0,0,0,0,0,0,0,0,0,0]
[0,0,0,0,0,0,0,0,0,0,0,0,0,0,0,0,0,0,0,0,0,0,0,0,0,0,0,0,0]
[0,0,0,0,0,0,0,0,0,0,0,0,0,0,0,0,0,0,0,0,0,0,0,0,0,0,0,0,0]
[0,0,0,0,0,0,0,0,0,0,0,0,0,0,0,0,0,0,0,0,0,0,0,0,0,0,0,0,0]
[0,0,0,0,0,0,0,0,0,0,0,0,0,0,0,0,0,0,0,0,0,0,0,0,0,0,0,0,0]
[0,0,0,0,0,0,0,0,0,0,0,0,0,0,0,0,0,0,0,0,0,0,0,0,0,0,0,0,0]
[0,0,0,0,0,0,0,0,0,0,0,0,0,0,0,0,0,0,0,0,0,0,0,0,0,0,0,0,0]
[0,0,0,0,0,0,0,0,0,0,0,0,0,0,0,0,0,0,0,0,0,0,0,0,0,0,0,0,0]
[0,0,0,0,0,0,0,0,0,0,0,0,0,0,0,0,0,0,0,0,0,0,0,0,0,0,0,0,0]
[0,0,0,0,0,0,0,0,0,0,0,0,0,0,0,0,0,0,0,0,0,0,0,0,0,0,0,0,0]
[0,0,0,0,0,0,0,0,0,0,0,0,0,0,0,0,0,0,0,0,0,0,0,0,0,0,0,0,0]
[0,0,0,0,0,0,0,0,0,0,0,0,0,0,0,0,0,0,0,0,0,0,0,0,0,0,0,0,0]
[0,0,0,0,0,0,0,0,0,0,0,0,0,0,0,0,0,0,0,0,0,0,0,0,0,0,0,0,0]
[0,0,0,0,0,0,0,0,0,0,0,0,0,0,0,0,0,0,0,0,0,0,0,0,0,0,0,0,0]
[0,0,0,0,0,0,0,0,0,0,0,0,0,0,0,0,0,0,0,0,0,0,0,0,0,0,0,0,0]
[0,0,0,0,0,0,0,0,0,0,0,0,0,0,0,0,0,0,0,0,0,0,0,0,0,0,0,0,0]
[0,0,0,0,0,0,0,0,0,0,0,0,0,0,0,0,0,0,0,0,0,0,0,0,0,0,0,0,0]
[0,0,0,0,0,0,0,0,0,0,0,0,0,0,0,0,0,0,0,0,0,0,0,0,0,0,0,0,0]
[0,0,0,0,0,0,0,0,0,0,0,0,0,0,0,0,0,0,0,0,0,0,0,0,0,0,0,0,0]
[0,0,0,0,0,0,0,0,0,0,0,0,0,0,0,0,0,0,0,0,0,0,0,0,0,0,0,0,0]
[0,0,0,0,0,0,0,0,0,0,0,0,0,0,0,0,0,0,0,0,0,0,0,0,0,0,0,0,0]
[0,0,0,0,0,0,0,0,0,0,0,0,0,0,0,0,0,0,0,0,0,0,0,0,0,0,0,0,0]
[0,0,0,0,0,0,0,0,0,0,0,0,0,0,0,0,0,0,0,0,0,0,0,0,0,0,0,0,0]
[0,0,0,0,0,0,0,0,0,0,0,0,0,0,0,0,0,0,0,0,0,0,0,0,0,0,0,0,0]
[0,0,0,0,0,0,0,0,0,0,0,0,0,0,0,0,0,0,0,0,0,0,0,0,0,0,0,0,0]
[0,0,0,0,0,0,0,0,0,0,0,0,0,0,0,0,0,0,0,0,0,0,0,0,0,0,0,0,0]
[0,0,0,0,0,0,0,0,0,0,0,0,0,0,0,0,0,0,0,0,0,0,0,0,0,0,0,0,0]
[0,0,0,0,0,0,0,0,0,0,0,0,0,0,0,0,0,0,0,0,0,0,0,0,0,0,0,0,0]
[0,0,0,0,0,0,0,0,0,0,0,0,0,0,0,0,0,0,0,0,0,0,0,0,0,0,0,0,0]
[0,0,0,0,0,0,0,0,0,0,0,0,0,0,0,0,0,0,0,0,0,0,0,0,0,0,0,0,0]
[0,0,0,0,0,0,0,0,0,0,0,0,0,0,0,0,0,0,0,0,0,0,0,0,0,0,0,0,0]
[0,0,0,0,0,0,0,0,0,0,0,0,0,0,0,0,0,0,0,0,0,0,0,0,0,0,0,0,0]
[0,0,0,0,0,0,0,0,0,0,0,0,0,0,0,0,0,0,0,0,0,0,0,0,0,0,0,0,0]
[0,0,0,0,0,0,0,0,0,0,0,0,0,0,0,0,0,0,0,0,0,0,0,0,0,0,0,0,0]
[0,0,0,0,0,0,0,0,0,0,0,0,0,0,0,0,0,0,0,0,0,0,0,0,0,0,0,0,0]
[0,0,0,0,0,0,0,0,0,0,0,0,0,0,0,0,0,0,0,0,0,0,0,0,0,0,0,0,0]
[0,0,0,0,0,0,0,0,0,0,0,0,0,0,0,0,0,0,0,0,0,0,0,0,0,0,0,0,0]
[0,0,0,0,0,0,0,0,0,0,0,0,0,0,0,0,0,0,0,0,0,0,0,0,0,0,0,0,0]
[0,0,0,0,0,0,0,0,0,0,0,0,0,0,0,0,0,0,0,0,0,0,0,0,0,0,0,0,0]
[0,0,0,0,0,0,0,0,0,0,0,0,0,0,0,0,0,0,0,0,0,0,0,0,0,0,0,0,0]
[0,0,0,0,0,0,0,0,0,0,0,0,0,0,0,0,0,0,0,0,0,0,0,0,0,0,0,0,0]
[0,0,0,0,0,0,0,0,0,0,0,0,0,0,0,0,0,0,0,0,0,0,0,0,0,0,0,0,0]
[0,0,0,0,0,0,0,0,0,0,0,0,0,0,0,0,0,0,0,0,0,0,0,0,0,0,0,0,0]
[0,0,0,0,0,0,0,0,0,0,0,0,0,0,0,0,0,0,0,0,0,0,0,0,0,0,0,0,0]
[0,0,0,0,0,0,0,0,0,0,0,0,0,0,0,0,0,0,0,0,0,0,0,0,0,0,0,0,0]
[0,0,0,0,0,0,0,0,0,0,0,0,0,0,0,0,0,0,0,0,0,0,0,0,0,0,0,0,0]
[0,0,0,0,0,0,0,0,0,0,0,0,0,0,0,0,0,0,0,0,0,0,0,0,0,0,0,0,0]
[0,0,0,0,0,0,0,0,0,0,0,0,0,0,0,0,0,0,0,0,0,0,0,0,0,0,0,0,0]
[0,0,0,0,0,0,0,0,0,0,0,0,0,0,0,0,0,0,0,0,0,0,0,0,0,0,0,0,0]
[0,0,0,0,0,0,0,0,0,0,0,0,0,0,0,0,0,0,0,0,0,0,0,0,0,0,0,0,0]
[0,0,0,0,0,0,0,0,0,0,0,0,0,0,0,0,0,0,0,0,0,0,0,0,0,0,0,0,0]
[0,0,0,0,0,0,0,0,0,0,0,0,0,0,0,0,0,0,0,0,0,0,0,0,0,0,0,0,0]
[0,0,0,0,0,0,0,0,0,0,0,0,0,0,0,0,0,0,0,0,0,0,0,0,0,0,0,0,0]
[0,0,0,0,0,0,0,0,0,0,0,0,0,0,0,0,0,0,0,0,0,0,0,0,0,0,0,0,0]
[0,0,0,0,0,0,0,0,0,0,0,0,0,0,0,0,0,0,0,0,0,0,0,0,0,0,0,0,0]

{"sheet":"varHS","index":8,"n_rows":100,"n_cols":11,"rows_kept":100,"cut":false,"hidden":true,"merged":[]}
[0,0,0,0,0,0,0,0,0,0,0]
[0,0,0,0,0,0,0,0,0,0,0]
[0,0,0,0,0,0,0,0,0,0,0]
[0,0,0,0,0,0,0,0,0,0,0]
[0,0,0,0,0,0,0,0,0,0,0]
[0,0,0,0,0,0,0,0,0,0,0]
[0,0,0,0,0,0,0,0,0,0,0]
[0,0,0,0,0,0,0,0,0,0,0]
[0,0,0,0,0,0,0,0,0,0,0]
[0,0,0,0,0,0,0,0,0,0,0]
[0,0,0,0,0,0,0,0,0,0,0]
[0,0,0,0,0,0,0,0,0,0,0]
[0,0,0,0,0,0,0,0,0,0,0]
[0,0,0,0,0,0,0,0,0,0,0]
[0,0,0,0,0,0,0,0,0,0,0]
[0,0,0,0,0,0,0,0,0,0,0]
[0,0,0,0,0,0,0,0,0,0,0]
[0,0,0,0,0,0,0,0,0,0,0]
[0,0,0,0,0,0,0,0,0,0,0]
[0,0,0,0,0,0,0,0,0,0,0]
[0,0,0,0,0,0,0,0,0,0,0]
[0,0,0,0,0,0,0,0,0,0,0]
[0,0,0,0,0,0,0,0,0,0,0]
[0,0,0,0,0,0,0,0,0,0,0]
[0,0,0,0,0,0,0,0,0,0,0]
[0,0,0,0,0,0,0,0,0,0,0]
[0,0,0,0,0,0,0,0,0,0,0]
[0,0,0,0,0,0,0,0,0,0,0]
[0,0,0,0,0,0,0,0,0,0,0]
[0,0,0,0,0,0,0,0,0,0,0]
[0,0,0,0,0,0,0,0,0,0,0]
[0,0,0,0,0,0,0,0,0,0,0]
[0,0,0,0,0,0,0,0,0,0,0]
[0,0,0,0,0,0,0,0,0,0,0]
[0,0,0,0,0,0,0,0,0,0,0]
[0,0,0,0,0,0,0,0,0,0,0]
[0,0,0,0,0,0,0,0,0,0,0]
[0,0,0,0,0,0,0,0,0,0,0]
[0,0,0,0,0,0,0,0,0,0,0]
[0,0,0,0,0,0,0,0,0,0,0]
[0,0,0,0,0,0,0,0,0,0,0]
[0,0,0,0,0,0,0,0,0,0,0]
[0,0,0,0,0,0,0,0,0,0,0]
[0,0,0,0,0,0,0,0,0,0,0]
[0,0,0,0,0,0,0,0,0,0,0]
[0,0,0,0,0,0,0,0,0,0,0]
[0,0,0,0,0,0,0,0,0,0,0]
[0,0,0,0,0,0,0,0,0,0,0]
[0,0,0,0,0,0,0,0,0,0,0]
[0,0,0,0,0,0,0,0,0,0,0]
[0,0,0,0,0,0,0,0,0,0,0]
[0,0,0,0,0,0,0,0,0,0,0]
[0,0,0,0,0,0,0,0,0,0,0]
[0,0,0,0,0,0,0,0,0,0,0]
[0,0,0,0,0,0,0,0,0,0,0]
[0,0,0,0,0,0,0,0,0,0,0]
[0,0,0,0,0,0,0,0,0,0,0]
[0,0,0,0,0,0,0,0,0,0,0]
[0,0,0,0,0,0,0,0,0,0,0]
[0,0,0,0,0,0,0,0,0,0,0]
[0,0,0,0,0,0,0,0,0,0,0]
[0,0,0,0,0,0,0,0,0,0,0]
[0,0,0,0,0,0,0,0,0,0,0]
[0,0,0,0,0,0,0,0,0,0,0]
[0,0,0,0,0,0,0,0,0,0,0]
[0,0,0,0,0,0,0,0,0,0,0]
[0,0,0,0,0,0,0,0,0,0,0]
[0,0,0,0,0,0,0,0,0,0,0]
[0,0,0,0,0,0,0,0,0,0,0]
[0,0,0,0,0,0,0,0,0,0,0]
[0,0,0,0,0,0,0,0,0,0,0]
[0,0,0,0,0,0,0,0,0,0,0]
[0,0,0,0,0,0,0,0,0,0,0]
[0,0,0,0,0,0,0,0,0,0,0]
[0,0,0,0,0,0,0,0,0,0,0]
[0,0,0,0,0,0,0,0,0,0,0]
[0,0,0,0,0,0,0,0,0,0,0]
[0,0,0,0,0,0,0,0,0,0,0]
[0,0,0,0,0,0,0,0,0,0,0]
[0,0,0,0,0,0,0,0,0,0,0]
[0,0,0,0,0,0,0,0,0,0,0]
[0,0,0,0,0,0,0,0,0,0,0]
[0,0,0,0,0,0,0,0,0,0,0]
[0,0,0,0,0,0,0,0,0,0,0]
[0,0,0,0,0,0,0,0,0,0,0]
[0,0,0,0,0,0,0,0,0,0,0]
[0,0,0,0,0,0,0,0,0,0,0]
[0,0,0,0,0,0,0,0,0,0,0]
[0,0,0,0,0,0,0,0,0,0,0]
[0,0,0,0,0,0,0,0,0,0,0]
[0,0,0,0,0,0,0,0,0,0,0]
[0,0,0,0,0,0,0,0,0,0,0]
[0,0,0,0,0,0,0,0,0,0,0]
[0,0,0,0,0,0,0,0,0,0,0]
[0,0,0,0,0,0,0,0,0,0,0]
[0,0,0,0,0,0,0,0,0,0,0]
[0,0,0,0,0,0,0,0,0,0,0]
[0,0,0,0,0,0,0,0,0,0,0]
[0,0,0,0,0,0,0,0,0,0,0]
[0,0,0,0,0,0,0,0,0,0,0]

{"sheet":"varCS","index":9,"n_rows":100,"n_cols":11,"rows_kept":100,"cut":false,"hidden":true,"merged":[]}
[0,0,0,0,0,0,0,0,0,0,0]
[0,0,0,0,0,0,0,0,0,0,0]
[0,0,0,0,0,0,0,0,0,0,0]
[0,0,0,0,0,0,0,0,0,0,0]
[0,0,0,0,0,0,0,0,0,0,0]
[0,0,0,0,0,0,0,0,0,0,0]
[0,0,0,0,0,0,0,0,0,0,0]
[0,0,0,0,0,0,0,0,0,0,0]
[0,0,0,0,0,0,0,0,0,0,0]
[0,0,0,0,0,0,0,0,0,0,0]
[0,0,0,0,0,0,0,0,0,0,0]
[0,0,0,0,0,0,0,0,0,0,0]
[0,0,0,0,0,0,0,0,0,0,0]
[0,0,0,0,0,0,0,0,0,0,0]
[0,0,0,0,0,0,0,0,0,0,0]
[0,0,0,0,0,0,0,0,0,0,0]
[0,0,0,0,0,0,0,0,0,0,0]
[0,0,0,0,0,0,0,0,0,0,0]
[0,0,0,0,0,0,0,0,0,0,0]
[0,0,0,0,0,0,0,0,0,0,0]
[0,0,0,0,0,0,0,0,0,0,0]
[0,0,0,0,0,0,0,0,0,0,0]
[0,0,0,0,0,0,0,0,0,0,0]
[0,0,0,0,0,0,0,0,0,0,0]
[0,0,0,0,0,0,0,0,0,0,0]
[0,0,0,0,0,0,0,0,0,0,0]
[0,0,0,0,0,0,0,0,0,0,0]
[0,0,0,0,0,0,0,0,0,0,0]
[0,0,0,0,0,0,0,0,0,0,0]
[0,0,0,0,0,0,0,0,0,0,0]
[0,0,0,0,0,0,0,0,0,0,0]
[0,0,0,0,0,0,0,0,0,0,0]
[0,0,0,0,0,0,0,0,0,0,0]
[0,0,0,0,0,0,0,0,0,0,0]
[0,0,0,0,0,0,0,0,0,0,0]
[0,0,0,0,0,0,0,0,0,0,0]
[0,0,0,0,0,0,0,0,0,0,0]
[0,0,0,0,0,0,0,0,0,0,0]
[0,0,0,0,0,0,0,0,0,0,0]
[0,0,0,0,0,0,0,0,0,0,0]
[0,0,0,0,0,0,0,0,0,0,0]
[0,0,0,0,0,0,0,0,0,0,0]
[0,0,0,0,0,0,0,0,0,0,0]
[0,0,0,0,0,0,0,0,0,0,0]
[0,0,0,0,0,0,0,0,0,0,0]
[0,0,0,0,0,0,0,0,0,0,0]
[0,0,0,0,0,0,0,0,0,0,0]
[0,0,0,0,0,0,0,0,0,0,0]
[0,0,0,0,0,0,0,0,0,0,0]
[0,0,0,0,0,0,0,0,0,0,0]
[0,0,0,0,0,0,0,0,0,0,0]
[0,0,0,0,0,0,0,0,0,0,0]
[0,0,0,0,0,0,0,0,0,0,0]
[0,0,0,0,0,0,0,0,0,0,0]
[0,0,0,0,0,0,0,0,0,0,0]
[0,0,0,0,0,0,0,0,0,0,0]
[0,0,0,0,0,0,0,0,0,0,0]
[0,0,0,0,0,0,0,0,0,0,0]
[0,0,0,0,0,0,0,0,0,0,0]
[0,0,0,0,0,0,0,0,0,0,0]
[0,0,0,0,0,0,0,0,0,0,0]
[0,0,0,0,0,0,0,0,0,0,0]
[0,0,0,0,0,0,0,0,0,0,0]
[0,0,0,0,0,0,0,0,0,0,0]
[0,0,0,0,0,0,0,0,0,0,0]
[0,0,0,0,0,0,0,0,0,0,0]
[0,0,0,0,0,0,0,0,0,0,0]
[0,0,0,0,0,0,0,0,0,0,0]
[0,0,0,0,0,0,0,0,0,0,0]
[0,0,0,0,0,0,0,0,0,0,0]
[0,0,0,0,0,0,0,0,0,0,0]
[0,0,0,0,0,0,0,0,0,0,0]
[0,0,0,0,0,0,0,0,0,0,0]
[0,0,0,0,0,0,0,0,0,0,0]
[0,0,0,0,0,0,0,0,0,0,0]
[0,0,0,0,0,0,0,0,0,0,0]
[0,0,0,0,0,0,0,0,0,0,0]
[0,0,0,0,0,0,0,0,0,0,0]
[0,0,0,0,0,0,0,0,0,0,0]
[0,0,0,0,0,0,0,0,0,0,0]
[0,0,0,0,0,0,0,0,0,0,0]
[0,0,0,0,0,0,0,0,0,0,0]
[0,0,0,0,0,0,0,0,0,0,0]
[0,0,0,0,0,0,0,0,0,0,0]
[0,0,0,0,0,0,0,0,0,0,0]
[0,0,0,0,0,0,0,0,0,0,0]
[0,0,0,0,0,0,0,0,0,0,0]
[0,0,0,0,0,0,0,0,0,0,0]
[0,0,0,0,0,0,0,0,0,0,0]
[0,0,0,0,0,0,0,0,0,0,0]
[0,0,0,0,0,0,0,0,0,0,0]
[0,0,0,0,0,0,0,0,0,0,0]
[0,0,0,0,0,0,0,0,0,0,0]
[0,0,0,0,0,0,0,0,0,0,0]
[0,0,0,0,0,0,0,0,0,0,0]
[0,0,0,0,0,0,0,0,0,0,0]
[0,0,0,0,0,0,0,0,0,0,0]
[0,0,0,0,0,0,0,0,0,0,0]
[0,0,0,0,0,0,0,0,0,0,0]
[0,0,0,0,0,0,0,0,0,0,0]

{"sheet":"varHXfinder","index":10,"n_rows":500,"n_cols":29,"rows_kept":500,"cut":false,"hidden":true,"merged":[]}
[0,0,0,0,0,0,0,0,0,0,0,0,0,0,0,0,0,0,0,0,0,0,0,0,0,0,0,0,0]
[0,0,0,0,0,0,0,0,0,0,0,0,0,0,0,0,0,0,0,0,0,0,0,0,0,0,0,0,0]
[0,0,0,0,0,0,0,0,0,0,0,0,0,0,0,0,0,0,0,0,0,0,0,0,0,0,0,0,0]
[0,0,0,0,0,0,0,0,0,0,0,0,0,0,0,0,0,0,0,0,0,0,0,0,0,0,0,0,0]
[0,0,0,0,0,0,0,0,0,0,0,0,0,0,0,0,0,0,0,0,0,0,0,0,0,0,0,0,0]
[0,0,0,0,0,0,0,0,0,0,0,0,0,0,0,0,0,0,0,0,0,0,0,0,0,0,0,0,0]
[0,0,0,0,0,0,0,0,0,0,0,0,0,0,0,0,0,0,0,0,0,0,0,0,0,0,0,0,0]
[0,0,0,0,0,0,0,0,0,0,0,0,0,0,0,0,0,0,0,0,0,0,0,0,0,0,0,0,0]
[0,0,0,0,0,0,0,0,0,0,0,0,0,0,0,0,0,0,0,0,0,0,0,0,0,0,0,0,0]
[0,0,0,0,0,0,0,0,0,0,0,0,0,0,0,0,0,0,0,0,0,0,0,0,0,0,0,0,0]
[0,0,0,0,0,0,0,0,0,0,0,0,0,0,0,0,0,0,0,0,0,0,0,0,0,0,0,0,0]
[0,0,0,0,0,0,0,0,0,0,0,0,0,0,0,0,0,0,0,0,0,0,0,0,0,0,0,0,0]
[0,0,0,0,0,0,0,0,0,0,0,0,0,0,0,0,0,0,0,0,0,0,0,0,0,0,0,0,0]
[0,0,0,0,0,0,0,0,0,0,0,0,0,0,0,0,0,0,0,0,0,0,0,0,0,0,0,0,0]
[0,0,0,0,0,0,0,0,0,0,0,0,0,0,0,0,0,0,0,0,0,0,0,0,0,0,0,0,0]
[0,0,0,0,0,0,0,0,0,0,0,0,0,0,0,0,0,0,0,0,0,0,0,0,0,0,0,0,0]
[0,0,0,0,0,0,0,0,0,0,0,0,0,0,0,0,0,0,0,0,0,0,0,0,0,0,0,0,0]
[0,0,0,0,0,0,0,0,0,0,0,0,0,0,0,0,0,0,0,0,0,0,0,0,0,0,0,0,0]
[0,0,0,0,0,0,0,0,0,0,0,0,0,0,0,0,0,0,0,0,0,0,0,0,0,0,0,0,0]
[0,0,0,0,0,0,0,0,0,0,0,0,0,0,0,0,0,0,0,0,0,0,0,0,0,0,0,0,0]
[0,0,0,0,0,0,0,0,0,0,0,0,0,0,0,0,0,0,0,0,0,0,0,0,0,0,0,0,0]
[0,0,0,0,0,0,0,0,0,0,0,0,0,0,0,0,0,0,0,0,0,0,0,0,0,0,0,0,0]
[0,0,0,0,0,0,0,0,0,0,0,0,0,0,0,0,0,0,0,0,0,0,0,0,0,0,0,0,0]
[0,0,0,0,0,0,0,0,0,0,0,0,0,0,0,0,0,0,0,0,0,0,0,0,0,0,0,0,0]
[0,0,0,0,0,0,0,0,0,0,0,0,0,0,0,0,0,0,0,0,0,0,0,0,0,0,0,0,0]
[0,0,0,0,0,0,0,0,0,0,0,0,0,0,0,0,0,0,0,0,0,0,0,0,0,0,0,0,0]
[0,0,0,0,0,0,0,0,0,0,0,0,0,0,0,0,0,0,0,0,0,0,0,0,0,0,0,0,0]
[0,0,0,0,0,0,0,0,0,0,0,0,0,0,0,0,0,0,0,0,0,0,0,0,0,0,0,0,0]
[0,0,0,0,0,0,0,0,0,0,0,0,0,0,0,0,0,0,0,0,0,0,0,0,0,0,0,0,0]
[0,0,0,0,0,0,0,0,0,0,0,0,0,0,0,0,0,0,0,0,0,0,0,0,0,0,0,0,0]
[0,0,0,0,0,0,0,0,0,0,0,0,0,0,0,0,0,0,0,0,0,0,0,0,0,0,0,0,0]
[0,0,0,0,0,0,0,0,0,0,0,0,0,0,0,0,0,0,0,0,0,0,0,0,0,0,0,0,0]
[0,0,0,0,0,0,0,0,0,0,0,0,0,0,0,0,0,0,0,0,0,0,0,0,0,0,0,0,0]
[0,0,0,0,0,0,0,0,0,0,0,0,0,0,0,0,0,0,0,0,0,0,0,0,0,0,0,0,0]
[0,0,0,0,0,0,0,0,0,0,0,0,0,0,0,0,0,0,0,0,0,0,0,0,0,0,0,0,0]
[0,0,0,0,0,0,0,0,0,0,0,0,0,0,0,0,0,0,0,0,0,0,0,0,0,0,0,0,0]
[0,0,0,0,0,0,0,0,0,0,0,0,0,0,0,0,0,0,0,0,0,0,0,0,0,0,0,0,0]
[0,0,0,0,0,0,0,0,0,0,0,0,0,0,0,0,0,0,0,0,0,0,0,0,0,0,0,0,0]
[0,0,0,0,0,0,0,0,0,0,0,0,0,0,0,0,0,0,0,0,0,0,0,0,0,0,0,0,0]
[0,0,0,0,0,0,0,0,0,0,0,0,0,0,0,0,0,0,0,0,0,0,0,0,0,0,0,0,0]
[0,0,0,0,0,0,0,0,0,0,0,0,0,0,0,0,0,0,0,0,0,0,0,0,0,0,0,0,0]
[0,0,0,0,0,0,0,0,0,0,0,0,0,0,0,0,0,0,0,0,0,0,0,0,0,0,0,0,0]
[0,0,0,0,0,0,0,0,0,0,0,0,0,0,0,0,0,0,0,0,0,0,0,0,0,0,0,0,0]
[0,0,0,0,0,0,0,0,0,0,0,0,0,0,0,0,0,0,0,0,0,0,0,0,0,0,0,0,0]
[0,0,0,0,0,0,0,0,0,0,0,0,0,0,0,0,0,0,0,0,0,0,0,0,0,0,0,0,0]
[0,0,0,0,0,0,0,0,0,0,0,0,0,0,0,0,0,0,0,0,0,0,0,0,0,0,0,0,0]
[0,0,0,0,0,0,0,0,0,0,0,0,0,0,0,0,0,0,0,0,0,0,0,0,0,0,0,0,0]
[0,0,0,0,0,0,0,0,0,0,0,0,0,0,0,0,0,0,0,0,0,0,0,0,0,0,0,0,0]
[0,0,0,0,0,0,0,0,0,0,0,0,0,0,0,0,0,0,0,0,0,0,0,0,0,0,0,0,0]
[0,0,0,0,0,0,0,0,0,0,0,0,0,0,0,0,0,0,0,0,0,0,0,0,0,0,0,0,0]
[0,0,0,0,0,0,0,0,0,0,0,0,0,0,0,0,0,0,0,0,0,0,0,0,0,0,0,0,0]
[0,0,0,0,0,0,0,0,0,0,0,0,0,0,0,0,0,0,0,0,0,0,0,0,0,0,0,0,0]
[0,0,0,0,0,0,0,0,0,0,0,0,0,0,0,0,0,0,0,0,0,0,0,0,0,0,0,0,0]
[0,0,0,0,0,0,0,0,0,0,0,0,0,0,0,0,0,0,0,0,0,0,0,0,0,0,0,0,0]
[0,0,0,0,0,0,0,0,0,0,0,0,0,0,0,0,0,0,0,0,0,0,0,0,0,0,0,0,0]
[0,0,0,0,0,0,0,0,0,0,0,0,0,0,0,0,0,0,0,0,0,0,0,0,0,0,0,0,0]
[0,0,0,0,0,0,0,0,0,0,0,0,0,0,0,0,0,0,0,0,0,0,0,0,0,0,0,0,0]
[0,0,0,0,0,0,0,0,0,0,0,0,0,0,0,0,0,0,0,0,0,0,0,0,0,0,0,0,0]
[0,0,0,0,0,0,0,0,0,0,0,0,0,0,0,0,0,0,0,0,0,0,0,0,0,0,0,0,0]
[0,0,0,0,0,0,0,0,0,0,0,0,0,0,0,0,0,0,0,0,0,0,0,0,0,0,0,0,0]
[0,0,0,0,0,0,0,0,0,0,0,0,0,0,0,0,0,0,0,0,0,0,0,0,0,0,0,0,0]
[0,0,0,0,0,0,0,0,0,0,0,0,0,0,0,0,0,0,0,0,0,0,0,0,0,0,0,0,0]
[0,0,0,0,0,0,0,0,0,0,0,0,0,0,0,0,0,0,0,0,0,0,0,0,0,0,0,0,0]
[0,0,0,0,0,0,0,0,0,0,0,0,0,0,0,0,0,0,0,0,0,0,0,0,0,0,0,0,0]
[0,0,0,0,0,0,0,0,0,0,0,0,0,0,0,0,0,0,0,0,0,0,0,0,0,0,0,0,0]
[0,0,0,0,0,0,0,0,0,0,0,0,0,0,0,0,0,0,0,0,0,0,0,0,0,0,0,0,0]
[0,0,0,0,0,0,0,0,0,0,0,0,0,0,0,0,0,0,0,0,0,0,0,0,0,0,0,0,0]
[0,0,0,0,0,0,0,0,0,0,0,0,0,0,0,0,0,0,0,0,0,0,0,0,0,0,0,0,0]
[0,0,0,0,0,0,0,0,0,0,0,0,0,0,0,0,0,0,0,0,0,0,0,0,0,0,0,0,0]
[0,0,0,0,0,0,0,0,0,0,0,0,0,0,0,0,0,0,0,0,0,0,0,0,0,0,0,0,0]
[0,0,0,0,0,0,0,0,0,0,0,0,0,0,0,0,0,0,0,0,0,0,0,0,0,0,0,0,0]
[0,0,0,0,0,0,0,0,0,0,0,0,0,0,0,0,0,0,0,0,0,0,0,0,0,0,0,0,0]
[0,0,0,0,0,0,0,0,0,0,0,0,0,0,0,0,0,0,0,0,0,0,0,0,0,0,0,0,0]
[0,0,0,0,0,0,0,0,0,0,0,0,0,0,0,0,0,0,0,0,0,0,0,0,0,0,0,0,0]
[0,0,0,0,0,0,0,0,0,0,0,0,0,0,0,0,0,0,0,0,0,0,0,0,0,0,0,0,0]
[0,0,0,0,0,0,0,0,0,0,0,0,0,0,0,0,0,0,0,0,0,0,0,0,0,0,0,0,0]
[0,0,0,0,0,0,0,0,0,0,0,0,0,0,0,0,0,0,0,0,0,0,0,0,0,0,0,0,0]
[0,0,0,0,0,0,0,0,0,0,0,0,0,0,0,0,0,0,0,0,0,0,0,0,0,0,0,0,0]
[0,0,0,0,0,0,0,0,0,0,0,0,0,0,0,0,0,0,0,0,0,0,0,0,0,0,0,0,0]
[0,0,0,0,0,0,0,0,0,0,0,0,0,0,0,0,0,0,0,0,0,0,0,0,0,0,0,0,0]
[0,0,0,0,0,0,0,0,0,0,0,0,0,0,0,0,0,0,0,0,0,0,0,0,0,0,0,0,0]
[0,0,0,0,0,0,0,0,0,0,0,0,0,0,0,0,0,0,0,0,0,0,0,0,0,0,0,0,0]
[0,0,0,0,0,0,0,0,0,0,0,0,0,0,0,0,0,0,0,0,0,0,0,0,0,0,0,0,0]
[0,0,0,0,0,0,0,0,0,0,0,0,0,0,0,0,0,0,0,0,0,0,0,0,0,0,0,0,0]
[0,0,0,0,0,0,0,0,0,0,0,0,0,0,0,0,0,0,0,0,0,0,0,0,0,0,0,0,0]
[0,0,0,0,0,0,0,0,0,0,0,0,0,0,0,0,0,0,0,0,0,0,0,0,0,0,0,0,0]
[0,0,0,0,0,0,0,0,0,0,0,0,0,0,0,0,0,0,0,0,0,0,0,0,0,0,0,0,0]
[0,0,0,0,0,0,0,0,0,0,0,0,0,0,0,0,0,0,0,0,0,0,0,0,0,0,0,0,0]
[0,0,0,0,0,0,0,0,0,0,0,0,0,0,0,0,0,0,0,0,0,0,0,0,0,0,0,0,0]
[0,0,0,0,0,0,0,0,0,0,0,0,0,0,0,0,0,0,0,0,0,0,0,0,0,0,0,0,0]
[0,0,0,0,0,0,0,0,0,0,0,0,0,0,0,0,0,0,0,0,0,0,0,0,0,0,0,0,0]
[0,0,0,0,0,0,0,0,0,0,0,0,0,0,0,0,0,0,0,0,0,0,0,0,0,0,0,0,0]
[0,0,0,0,0,0,0,0,0,0,0,0,0,0,0,0,0,0,0,0,0,0,0,0,0,0,0,0,0]
[0,0,0,0,0,0,0,0,0,0,0,0,0,0,0,0,0,0,0,0,0,0,0,0,0,0,0,0,0]
[0,0,0,0,0,0,0,0,0,0,0,0,0,0,0,0,0,0,0,0,0,0,0,0,0,0,0,0,0]
[0,0,0,0,0,0,0,0,0,0,0,0,0,0,0,0,0,0,0,0,0,0,0,0,0,0,0,0,0]
[0,0,0,0,0,0,0,0,0,0,0,0,0,0,0,0,0,0,0,0,0,0,0,0,0,0,0,0,0]
[0,0,0,0,0,0,0,0,0,0,0,0,0,0,0,0,0,0,0,0,0,0,0,0,0,0,0,0,0]
[0,0,0,0,0,0,0,0,0,0,0,0,0,0,0,0,0,0,0,0,0,0,0,0,0,0,0,0,0]
[0,0,0,0,0,0,0,0,0,0,0,0,0,0,0,0,0,0,0,0,0,0,0,0,0,0,0,0,0]
[0,0,0,0,0,0,0,0,0,0,0,0,0,0,0,0,0,0,0,0,0,0,0,0,0,0,0,0,0]
[0,0,0,0,0,0,0,0,0,0,0,0,0,0,0,0,0,0,0,0,0,0,0,0,0,0,0,0,0]
[0,0,0,0,0,0,0,0,0,0,0,0,0,0,0,0,0,0,0,0,0,0,0,0,0,0,0,0,0]
[0,0,0,0,0,0,0,0,0,0,0,0,0,0,0,0,0,0,0,0,0,0,0,0,0,0,0,0,0]
[0,0,0,0,0,0,0,0,0,0,0,0,0,0,0,0,0,0,0,0,0,0,0,0,0,0,0,0,0]
[0,0,0,0,0,0,0,0,0,0,0,0,0,0,0,0,0,0,0,0,0,0,0,0,0,0,0,0,0]
[0,0,0,0,0,0,0,0,0,0,0,0,0,0,0,0,0,0,0,0,0,0,0,0,0,0,0,0,0]
[0,0,0,0,0,0,0,0,0,0,0,0,0,0,0,0,0,0,0,0,0,0,0,0,0,0,0,0,0]
[0,0,0,0,0,0,0,0,0,0,0,0,0,0,0,0,0,0,0,0,0,0,0,0,0,0,0,0,0]
[0,0,0,0,0,0,0,0,0,0,0,0,0,0,0,0,0,0,0,0,0,0,0,0,0,0,0,0,0]
[0,0,0,0,0,0,0,0,0,0,0,0,0,0,0,0,0,0,0,0,0,0,0,0,0,0,0,0,0]
[0,0,0,0,0,0,0,0,0,0,0,0,0,0,0,0,0,0,0,0,0,0,0,0,0,0,0,0,0]
[0,0,0,0,0,0,0,0,0,0,0,0,0,0,0,0,0,0,0,0,0,0,0,0,0,0,0,0,0]
[0,0,0,0,0,0,0,0,0,0,0,0,0,0,0,0,0,0,0,0,0,0,0,0,0,0,0,0,0]
[0,0,0,0,0,0,0,0,0,0,0,0,0,0,0,0,0,0,0,0,0,0,0,0,0,0,0,0,0]
[0,0,0,0,0,0,0,0,0,0,0,0,0,0,0,0,0,0,0,0,0,0,0,0,0,0,0,0,0]
[0,0,0,0,0,0,0,0,0,0,0,0,0,0,0,0,0,0,0,0,0,0,0,0,0,0,0,0,0]
[0,0,0,0,0,0,0,0,0,0,0,0,0,0,0,0,0,0,0,0,0,0,0,0,0,0,0,0,0]
[0,0,0,0,0,0,0,0,0,0,0,0,0,0,0,0,0,0,0,0,0,0,0,0,0,0,0,0,0]
[0,0,0,0,0,0,0,0,0,0,0,0,0,0,0,0,0,0,0,0,0,0,0,0,0,0,0,0,0]
[0,0,0,0,0,0,0,0,0,0,0,0,0,0,0,0,0,0,0,0,0,0,0,0,0,0,0,0,0]
[0,0,0,0,0,0,0,0,0,0,0,0,0,0,0,0,0,0,0,0,0,0,0,0,0,0,0,0,0]
[0,0,0,0,0,0,0,0,0,0,0,0,0,0,0,0,0,0,0,0,0,0,0,0,0,0,0,0,0]
[0,0,0,0,0,0,0,0,0,0,0,0,0,0,0,0,0,0,0,0,0,0,0,0,0,0,0,0,0]
[0,0,0,0,0,0,0,0,0,0,0,0,0,0,0,0,0,0,0,0,0,0,0,0,0,0,0,0,0]
[0,0,0,0,0,0,0,0,0,0,0,0,0,0,0,0,0,0,0,0,0,0,0,0,0,0,0,0,0]
[0,0,0,0,0,0,0,0,0,0,0,0,0,0,0,0,0,0,0,0,0,0,0,0,0,0,0,0,0]
[0,0,0,0,0,0,0,0,0,0,0,0,0,0,0,0,0,0,0,0,0,0,0,0,0,0,0,0,0]
[0,0,0,0,0,0,0,0,0,0,0,0,0,0,0,0,0,0,0,0,0,0,0,0,0,0,0,0,0]
[0,0,0,0,0,0,0,0,0,0,0,0,0,0,0,0,0,0,0,0,0,0,0,0,0,0,0,0,0]
[0,0,0,0,0,0,0,0,0,0,0,0,0,0,0,0,0,0,0,0,0,0,0,0,0,0,0,0,0]
[0,0,0,0,0,0,0,0,0,0,0,0,0,0,0,0,0,0,0,0,0,0,0,0,0,0,0,0,0]
[0,0,0,0,0,0,0,0,0,0,0,0,0,0,0,0,0,0,0,0,0,0,0,0,0,0,0,0,0]
[0,0,0,0,0,0,0,0,0,0,0,0,0,0,0,0,0,0,0,0,0,0,0,0,0,0,0,0,0]
[0,0,0,0,0,0,0,0,0,0,0,0,0,0,0,0,0,0,0,0,0,0,0,0,0,0,0,0,0]
[0,0,0,0,0,0,0,0,0,0,0,0,0,0,0,0,0,0,0,0,0,0,0,0,0,0,0,0,0]
[0,0,0,0,0,0,0,0,0,0,0,0,0,0,0,0,0,0,0,0,0,0,0,0,0,0,0,0,0]
[0,0,0,0,0,0,0,0,0,0,0,0,0,0,0,0,0,0,0,0,0,0,0,0,0,0,0,0,0]
[0,0,0,0,0,0,0,0,0,0,0,0,0,0,0,0,0,0,0,0,0,0,0,0,0,0,0,0,0]
[0,0,0,0,0,0,0,0,0,0,0,0,0,0,0,0,0,0,0,0,0,0,0,0,0,0,0,0,0]
[0,0,0,0,0,0,0,0,0,0,0,0,0,0,0,0,0,0,0,0,0,0,0,0,0,0,0,0,0]
[0,0,0,0,0,0,0,0,0,0,0,0,0,0,0,0,0,0,0,0,0,0,0,0,0,0,0,0,0]
[0,0,0,0,0,0,0,0,0,0,0,0,0,0,0,0,0,0,0,0,0,0,0,0,0,0,0,0,0]
[0,0,0,0,0,0,0,0,0,0,0,0,0,0,0,0,0,0,0,0,0,0,0,0,0,0,0,0,0]
[0,0,0,0,0,0,0,0,0,0,0,0,0,0,0,0,0,0,0,0,0,0,0,0,0,0,0,0,0]
[0,0,0,0,0,0,0,0,0,0,0,0,0,0,0,0,0,0,0,0,0,0,0,0,0,0,0,0,0]
[0,0,0,0,0,0,0,0,0,0,0,0,0,0,0,0,0,0,0,0,0,0,0,0,0,0,0,0,0]
[0,0,0,0,0,0,0,0,0,0,0,0,0,0,0,0,0,0,0,0,0,0,0,0,0,0,0,0,0]
[0,0,0,0,0,0,0,0,0,0,0,0,0,0,0,0,0,0,0,0,0,0,0,0,0,0,0,0,0]
[0,0,0,0,0,0,0,0,0,0,0,0,0,0,0,0,0,0,0,0,0,0,0,0,0,0,0,0,0]
[0,0,0,0,0,0,0,0,0,0,0,0,0,0,0,0,0,0,0,0,0,0,0,0,0,0,0,0,0]
[0,0,0,0,0,0,0,0,0,0,0,0,0,0,0,0,0,0,0,0,0,0,0,0,0,0,0,0,0]
[0,0,0,0,0,0,0,0,0,0,0,0,0,0,0,0,0,0,0,0,0,0,0,0,0,0,0,0,0]
[0,0,0,0,0,0,0,0,0,0,0,0,0,0,0,0,0,0,0,0,0,0,0,0,0,0,0,0,0]
[0,0,0,0,0,0,0,0,0,0,0,0,0,0,0,0,0,0,0,0,0,0,0,0,0,0,0,0,0]
[0,0,0,0,0,0,0,0,0,0,0,0,0,0,0,0,0,0,0,0,0,0,0,0,0,0,0,0,0]
[0,0,0,0,0,0,0,0,0,0,0,0,0,0,0,0,0,0,0,0,0,0,0,0,0,0,0,0,0]
[0,0,0,0,0,0,0,0,0,0,0,0,0,0,0,0,0,0,0,0,0,0,0,0,0,0,0,0,0]
[0,0,0,0,0,0,0,0,0,0,0,0,0,0,0,0,0,0,0,0,0,0,0,0,0,0,0,0,0]
[0,0,0,0,0,0,0,0,0,0,0,0,0,0,0,0,0,0,0,0,0,0,0,0,0,0,0,0,0]
[0,0,0,0,0,0,0,0,0,0,0,0,0,0,0,0,0,0,0,0,0,0,0,0,0,0,0,0,0]
[0,0,0,0,0,0,0,0,0,0,0,0,0,0,0,0,0,0,0,0,0,0,0,0,0,0,0,0,0]
[0,0,0,0,0,0,0,0,0,0,0,0,0,0,0,0,0,0,0,0,0,0,0,0,0,0,0,0,0]
[0,0,0,0,0,0,0,0,0,0,0,0,0,0,0,0,0,0,0,0,0,0,0,0,0,0,0,0,0]
[0,0,0,0,0,0,0,0,0,0,0,0,0,0,0,0,0,0,0,0,0,0,0,0,0,0,0,0,0]
[0,0,0,0,0,0,0,0,0,0,0,0,0,0,0,0,0,0,0,0,0,0,0,0,0,0,0,0,0]
[0,0,0,0,0,0,0,0,0,0,0,0,0,0,0,0,0,0,0,0,0,0,0,0,0,0,0,0,0]
[0,0,0,0,0,0,0,0,0,0,0,0,0,0,0,0,0,0,0,0,0,0,0,0,0,0,0,0,0]
[0,0,0,0,0,0,0,0,0,0,0,0,0,0,0,0,0,0,0,0,0,0,0,0,0,0,0,0,0]
[0,0,0,0,0,0,0,0,0,0,0,0,0,0,0,0,0,0,0,0,0,0,0,0,0,0,0,0,0]
[0,0,0,0,0,0,0,0,0,0,0,0,0,0,0,0,0,0,0,0,0,0,0,0,0,0,0,0,0]
[0,0,0,0,0,0,0,0,0,0,0,0,0,0,0,0,0,0,0,0,0,0,0,0,0,0,0,0,0]
[0,0,0,0,0,0,0,0,0,0,0,0,0,0,0,0,0,0,0,0,0,0,0,0,0,0,0,0,0]
[0,0,0,0,0,0,0,0,0,0,0,0,0,0,0,0,0,0,0,0,0,0,0,0,0,0,0,0,0]
[0,0,0,0,0,0,0,0,0,0,0,0,0,0,0,0,0,0,0,0,0,0,0,0,0,0,0,0,0]
[0,0,0,0,0,0,0,0,0,0,0,0,0,0,0,0,0,0,0,0,0,0,0,0,0,0,0,0,0]
[0,0,0,0,0,0,0,0,0,0,0,0,0,0,0,0,0,0,0,0,0,0,0,0,0,0,0,0,0]
[0,0,0,0,0,0,0,0,0,0,0,0,0,0,0,0,0,0,0,0,0,0,0,0,0,0,0,0,0]
[0,0,0,0,0,0,0,0,0,0,0,0,0,0,0,0,0,0,0,0,0,0,0,0,0,0,0,0,0]
[0,0,0,0,0,0,0,0,0,0,0,0,0,0,0,0,0,0,0,0,0,0,0,0,0,0,0,0,0]
[0,0,0,0,0,0,0,0,0,0,0,0,0,0,0,0,0,0,0,0,0,0,0,0,0,0,0,0,0]
[0,0,0,0,0,0,0,0,0,0,0,0,0,0,0,0,0,0,0,0,0,0,0,0,0,0,0,0,0]
[0,0,0,0,0,0,0,0,0,0,0,0,0,0,0,0,0,0,0,0,0,0,0,0,0,0,0,0,0]
[0,0,0,0,0,0,0,0,0,0,0,0,0,0,0,0,0,0,0,0,0,0,0,0,0,0,0,0,0]
[0,0,0,0,0,0,0,0,0,0,0,0,0,0,0,0,0,0,0,0,0,0,0,0,0,0,0,0,0]
[0,0,0,0,0,0,0,0,0,0,0,0,0,0,0,0,0,0,0,0,0,0,0,0,0,0,0,0,0]
[0,0,0,0,0,0,0,0,0,0,0,0,0,0,0,0,0,0,0,0,0,0,0,0,0,0,0,0,0]
[0,0,0,0,0,0,0,0,0,0,0,0,0,0,0,0,0,0,0,0,0,0,0,0,0,0,0,0,0]
[0,0,0,0,0,0,0,0,0,0,0,0,0,0,0,0,0,0,0,0,0,0,0,0,0,0,0,0,0]
[0,0,0,0,0,0,0,0,0,0,0,0,0,0,0,0,0,0,0,0,0,0,0,0,0,0,0,0,0]
[0,0,0,0,0,0,0,0,0,0,0,0,0,0,0,0,0,0,0,0,0,0,0,0,0,0,0,0,0]
[0,0,0,0,0,0,0,0,0,0,0,0,0,0,0,0,0,0,0,0,0,0,0,0,0,0,0,0,0]
[0,0,0,0,0,0,0,0,0,0,0,0,0,0,0,0,0,0,0,0,0,0,0,0,0,0,0,0,0]
[0,0,0,0,0,0,0,0,0,0,0,0,0,0,0,0,0,0,0,0,0,0,0,0,0,0,0,0,0]
[0,0,0,0,0,0,0,0,0,0,0,0,0,0,0,0,0,0,0,0,0,0,0,0,0,0,0,0,0]
[0,0,0,0,0,0,0,0,0,0,0,0,0,0,0,0,0,0,0,0,0,0,0,0,0,0,0,0,0]
[0,0,0,0,0,0,0,0,0,0,0,0,0,0,0,0,0,0,0,0,0,0,0,0,0,0,0,0,0]
[0,0,0,0,0,0,0,0,0,0,0,0,0,0,0,0,0,0,0,0,0,0,0,0,0,0,0,0,0]
[0,0,0,0,0,0,0,0,0,0,0,0,0,0,0,0,0,0,0,0,0,0,0,0,0,0,0,0,0]
[0,0,0,0,0,0,0,0,0,0,0,0,0,0,0,0,0,0,0,0,0,0,0,0,0,0,0,0,0]
[0,0,0,0,0,0,0,0,0,0,0,0,0,0,0,0,0,0,0,0,0,0,0,0,0,0,0,0,0]
[0,0,0,0,0,0,0,0,0,0,0,0,0,0,0,0,0,0,0,0,0,0,0,0,0,0,0,0,0]
[0,0,0,0,0,0,0,0,0,0,0,0,0,0,0,0,0,0,0,0,0,0,0,0,0,0,0,0,0]
[0,0,0,0,0,0,0,0,0,0,0,0,0,0,0,0,0,0,0,0,0,0,0,0,0,0,0,0,0]
[0,0,0,0,0,0,0,0,0,0,0,0,0,0,0,0,0,0,0,0,0,0,0,0,0,0,0,0,0]
[0,0,0,0,0,0,0,0,0,0,0,0,0,0,0,0,0,0,0,0,0,0,0,0,0,0,0,0,0]
[0,0,0,0,0,0,0,0,0,0,0,0,0,0,0,0,0,0,0,0,0,0,0,0,0,0,0,0,0]
[0,0,0,0,0,0,0,0,0,0,0,0,0,0,0,0,0,0,0,0,0,0,0,0,0,0,0,0,0]
[0,0,0,0,0,0,0,0,0,0,0,0,0,0,0,0,0,0,0,0,0,0,0,0,0,0,0,0,0]
[0,0,0,0,0,0,0,0,0,0,0,0,0,0,0,0,0,0,0,0,0,0,0,0,0,0,0,0,0]
[0,0,0,0,0,0,0,0,0,0,0,0,0,0,0,0,0,0,0,0,0,0,0,0,0,0,0,0,0]
[0,0,0,0,0,0,0,0,0,0,0,0,0,0,0,0,0,0,0,0,0,0,0,0,0,0,0,0,0]
[0,0,0,0,0,0,0,0,0,0,0,0,0,0,0,0,0,0,0,0,0,0,0,0,0,0,0,0,0]
[0,0,0,0,0,0,0,0,0,0,0,0,0,0,0,0,0,0,0,0,0,0,0,0,0,0,0,0,0]
[0,0,0,0,0,0,0,0,0,0,0,0,0,0,0,0,0,0,0,0,0,0,0,0,0,0,0,0,0]
[0,0,0,0,0,0,0,0,0,0,0,0,0,0,0,0,0,0,0,0,0,0,0,0,0,0,0,0,0]
[0,0,0,0,0,0,0,0,0,0,0,0,0,0,0,0,0,0,0,0,0,0,0,0,0,0,0,0,0]
[0,0,0,0,0,0,0,0,0,0,0,0,0,0,0,0,0,0,0,0,0,0,0,0,0,0,0,0,0]
[0,0,0,0,0,0,0,0,0,0,0,0,0,0,0,0,0,0,0,0,0,0,0,0,0,0,0,0,0]
[0,0,0,0,0,0,0,0,0,0,0,0,0,0,0,0,0,0,0,0,0,0,0,0,0,0,0,0,0]
[0,0,0,0,0,0,0,0,0,0,0,0,0,0,0,0,0,0,0,0,0,0,0,0,0,0,0,0,0]
[0,0,0,0,0,0,0,0,0,0,0,0,0,0,0,0,0,0,0,0,0,0,0,0,0,0,0,0,0]
[0,0,0,0,0,0,0,0,0,0,0,0,0,0,0,0,0,0,0,0,0,0,0,0,0,0,0,0,0]
[0,0,0,0,0,0,0,0,0,0,0,0,0,0,0,0,0,0,0,0,0,0,0,0,0,0,0,0,0]
[0,0,0,0,0,0,0,0,0,0,0,0,0,0,0,0,0,0,0,0,0,0,0,0,0,0,0,0,0]
[0,0,0,0,0,0,0,0,0,0,0,0,0,0,0,0,0,0,0,0,0,0,0,0,0,0,0,0,0]
[0,0,0,0,0,0,0,0,0,0,0,0,0,0,0,0,0,0,0,0,0,0,0,0,0,0,0,0,0]
[0,0,0,0,0,0,0,0,0,0,0,0,0,0,0,0,0,0,0,0,0,0,0,0,0,0,0,0,0]
[0,0,0,0,0,0,0,0,0,0,0,0,0,0,0,0,0,0,0,0,0,0,0,0,0,0,0,0,0]
[0,0,0,0,0,0,0,0,0,0,0,0,0,0,0,0,0,0,0,0,0,0,0,0,0,0,0,0,0]
[0,0,0,0,0,0,0,0,0,0,0,0,0,0,0,0,0,0,0,0,0,0,0,0,0,0,0,0,0]
[0,0,0,0,0,0,0,0,0,0,0,0,0,0,0,0,0,0,0,0,0,0,0,0,0,0,0,0,0]
[0,0,0,0,0,0,0,0,0,0,0,0,0,0,0,0,0,0,0,0,0,0,0,0,0,0,0,0,0]
[0,0,0,0,0,0,0,0,0,0,0,0,0,0,0,0,0,0,0,0,0,0,0,0,0,0,0,0,0]
[0,0,0,0,0,0,0,0,0,0,0,0,0,0,0,0,0,0,0,0,0,0,0,0,0,0,0,0,0]
[0,0,0,0,0,0,0,0,0,0,0,0,0,0,0,0,0,0,0,0,0,0,0,0,0,0,0,0,0]
[0,0,0,0,0,0,0,0,0,0,0,0,0,0,0,0,0,0,0,0,0,0,0,0,0,0,0,0,0]
[0,0,0,0,0,0,0,0,0,0,0,0,0,0,0,0,0,0,0,0,0,0,0,0,0,0,0,0,0]
[0,0,0,0,0,0,0,0,0,0,0,0,0,0,0,0,0,0,0,0,0,0,0,0,0,0,0,0,0]
[0,0,0,0,0,0,0,0,0,0,0,0,0,0,0,0,0,0,0,0,0,0,0,0,0,0,0,0,0]
[0,0,0,0,0,0,0,0,0,0,0,0,0,0,0,0,0,0,0,0,0,0,0,0,0,0,0,0,0]
[0,0,0,0,0,0,0,0,0,0,0,0,0,0,0,0,0,0,0,0,0,0,0,0,0,0,0,0,0]
[0,0,0,0,0,0,0,0,0,0,0,0,0,0,0,0,0,0,0,0,0,0,0,0,0,0,0,0,0]
[0,0,0,0,0,0,0,0,0,0,0,0,0,0,0,0,0,0,0,0,0,0,0,0,0,0,0,0,0]
[0,0,0,0,0,0,0,0,0,0,0,0,0,0,0,0,0,0,0,0,0,0,0,0,0,0,0,0,0]
[0,0,0,0,0,0,0,0,0,0,0,0,0,0,0,0,0,0,0,0,0,0,0,0,0,0,0,0,0]
[0,0,0,0,0,0,0,0,0,0,0,0,0,0,0,0,0,0,0,0,0,0,0,0,0,0,0,0,0]
[0,0,0,0,0,0,0,0,0,0,0,0,0,0,0,0,0,0,0,0,0,0,0,0,0,0,0,0,0]
[0,0,0,0,0,0,0,0,0,0,0,0,0,0,0,0,0,0,0,0,0,0,0,0,0,0,0,0,0]
[0,0,0,0,0,0,0,0,0,0,0,0,0,0,0,0,0,0,0,0,0,0,0,0,0,0,0,0,0]
[0,0,0,0,0,0,0,0,0,0,0,0,0,0,0,0,0,0,0,0,0,0,0,0,0,0,0,0,0]
[0,0,0,0,0,0,0,0,0,0,0,0,0,0,0,0,0,0,0,0,0,0,0,0,0,0,0,0,0]
[0,0,0,0,0,0,0,0,0,0,0,0,0,0,0,0,0,0,0,0,0,0,0,0,0,0,0,0,0]
[0,0,0,0,0,0,0,0,0,0,0,0,0,0,0,0,0,0,0,0,0,0,0,0,0,0,0,0,0]
[0,0,0,0,0,0,0,0,0,0,0,0,0,0,0,0,0,0,0,0,0,0,0,0,0,0,0,0,0]
[0,0,0,0,0,0,0,0,0,0,0,0,0,0,0,0,0,0,0,0,0,0,0,0,0,0,0,0,0]
[0,0,0,0,0,0,0,0,0,0,0,0,0,0,0,0,0,0,0,0,0,0,0,0,0,0,0,0,0]
[0,0,0,0,0,0,0,0,0,0,0,0,0,0,0,0,0,0,0,0,0,0,0,0,0,0,0,0,0]
[0,0,0,0,0,0,0,0,0,0,0,0,0,0,0,0,0,0,0,0,0,0,0,0,0,0,0,0,0]
[0,0,0,0,0,0,0,0,0,0,0,0,0,0,0,0,0,0,0,0,0,0,0,0,0,0,0,0,0]
[0,0,0,0,0,0,0,0,0,0,0,0,0,0,0,0,0,0,0,0,0,0,0,0,0,0,0,0,0]
[0,0,0,0,0,0,0,0,0,0,0,0,0,0,0,0,0,0,0,0,0,0,0,0,0,0,0,0,0]
[0,0,0,0,0,0,0,0,0,0,0,0,0,0,0,0,0,0,0,0,0,0,0,0,0,0,0,0,0]
[0,0,0,0,0,0,0,0,0,0,0,0,0,0,0,0,0,0,0,0,0,0,0,0,0,0,0,0,0]
[0,0,0,0,0,0,0,0,0,0,0,0,0,0,0,0,0,0,0,0,0,0,0,0,0,0,0,0,0]
[0,0,0,0,0,0,0,0,0,0,0,0,0,0,0,0,0,0,0,0,0,0,0,0,0,0,0,0,0]
[0,0,0,0,0,0,0,0,0,0,0,0,0,0,0,0,0,0,0,0,0,0,0,0,0,0,0,0,0]
[0,0,0,0,0,0,0,0,0,0,0,0,0,0,0,0,0,0,0,0,0,0,0,0,0,0,0,0,0]
[0,0,0,0,0,0,0,0,0,0,0,0,0,0,0,0,0,0,0,0,0,0,0,0,0,0,0,0,0]
[0,0,0,0,0,0,0,0,0,0,0,0,0,0,0,0,0,0,0,0,0,0,0,0,0,0,0,0,0]
[0,0,0,0,0,0,0,0,0,0,0,0,0,0,0,0,0,0,0,0,0,0,0,0,0,0,0,0,0]
[0,0,0,0,0,0,0,0,0,0,0,0,0,0,0,0,0,0,0,0,0,0,0,0,0,0,0,0,0]
[0,0,0,0,0,0,0,0,0,0,0,0,0,0,0,0,0,0,0,0,0,0,0,0,0,0,0,0,0]
[0,0,0,0,0,0,0,0,0,0,0,0,0,0,0,0,0,0,0,0,0,0,0,0,0,0,0,0,0]
[0,0,0,0,0,0,0,0,0,0,0,0,0,0,0,0,0,0,0,0,0,0,0,0,0,0,0,0,0]
[0,0,0,0,0,0,0,0,0,0,0,0,0,0,0,0,0,0,0,0,0,0,0,0,0,0,0,0,0]
[0,0,0,0,0,0,0,0,0,0,0,0,0,0,0,0,0,0,0,0,0,0,0,0,0,0,0,0,0]
[0,0,0,0,0,0,0,0,0,0,0,0,0,0,0,0,0,0,0,0,0,0,0,0,0,0,0,0,0]
[0,0,0,0,0,0,0,0,0,0,0,0,0,0,0,0,0,0,0,0,0,0,0,0,0,0,0,0,0]
[0,0,0,0,0,0,0,0,0,0,0,0,0,0,0,0,0,0,0,0,0,0,0,0,0,0,0,0,0]
[0,0,0,0,0,0,0,0,0,0,0,0,0,0,0,0,0,0,0,0,0,0,0,0,0,0,0,0,0]
[0,0,0,0,0,0,0,0,0,0,0,0,0,0,0,0,0,0,0,0,0,0,0,0,0,0,0,0,0]
[0,0,0,0,0,0,0,0,0,0,0,0,0,0,0,0,0,0,0,0,0,0,0,0,0,0,0,0,0]
[0,0,0,0,0,0,0,0,0,0,0,0,0,0,0,0,0,0,0,0,0,0,0,0,0,0,0,0,0]
[0,0,0,0,0,0,0,0,0,0,0,0,0,0,0,0,0,0,0,0,0,0,0,0,0,0,0,0,0]
[0,0,0,0,0,0,0,0,0,0,0,0,0,0,0,0,0,0,0,0,0,0,0,0,0,0,0,0,0]
[0,0,0,0,0,0,0,0,0,0,0,0,0,0,0,0,0,0,0,0,0,0,0,0,0,0,0,0,0]
[0,0,0,0,0,0,0,0,0,0,0,0,0,0,0,0,0,0,0,0,0,0,0,0,0,0,0,0,0]
[0,0,0,0,0,0,0,0,0,0,0,0,0,0,0,0,0,0,0,0,0,0,0,0,0,0,0,0,0]
[0,0,0,0,0,0,0,0,0,0,0,0,0,0,0,0,0,0,0,0,0,0,0,0,0,0,0,0,0]
[0,0,0,0,0,0,0,0,0,0,0,0,0,0,0,0,0,0,0,0,0,0,0,0,0,0,0,0,0]
[0,0,0,0,0,0,0,0,0,0,0,0,0,0,0,0,0,0,0,0,0,0,0,0,0,0,0,0,0]
[0,0,0,0,0,0,0,0,0,0,0,0,0,0,0,0,0,0,0,0,0,0,0,0,0,0,0,0,0]
[0,0,0,0,0,0,0,0,0,0,0,0,0,0,0,0,0,0,0,0,0,0,0,0,0,0,0,0,0]
[0,0,0,0,0,0,0,0,0,0,0,0,0,0,0,0,0,0,0,0,0,0,0,0,0,0,0,0,0]
[0,0,0,0,0,0,0,0,0,0,0,0,0,0,0,0,0,0,0,0,0,0,0,0,0,0,0,0,0]
[0,0,0,0,0,0,0,0,0,0,0,0,0,0,0,0,0,0,0,0,0,0,0,0,0,0,0,0,0]
[0,0,0,0,0,0,0,0,0,0,0,0,0,0,0,0,0,0,0,0,0,0,0,0,0,0,0,0,0]
[0,0,0,0,0,0,0,0,0,0,0,0,0,0,0,0,0,0,0,0,0,0,0,0,0,0,0,0,0]
[0,0,0,0,0,0,0,0,0,0,0,0,0,0,0,0,0,0,0,0,0,0,0,0,0,0,0,0,0]
[0,0,0,0,0,0,0,0,0,0,0,0,0,0,0,0,0,0,0,0,0,0,0,0,0,0,0,0,0]
[0,0,0,0,0,0,0,0,0,0,0,0,0,0,0,0,0,0,0,0,0,0,0,0,0,0,0,0,0]
[0,0,0,0,0,0,0,0,0,0,0,0,0,0,0,0,0,0,0,0,0,0,0,0,0,0,0,0,0]
[0,0,0,0,0,0,0,0,0,0,0,0,0,0,0,0,0,0,0,0,0,0,0,0,0,0,0,0,0]
[0,0,0,0,0,0,0,0,0,0,0,0,0,0,0,0,0,0,0,0,0,0,0,0,0,0,0,0,0]
[0,0,0,0,0,0,0,0,0,0,0,0,0,0,0,0,0,0,0,0,0,0,0,0,0,0,0,0,0]
[0,0,0,0,0,0,0,0,0,0,0,0,0,0,0,0,0,0,0,0,0,0,0,0,0,0,0,0,0]
[0,0,0,0,0,0,0,0,0,0,0,0,0,0,0,0,0,0,0,0,0,0,0,0,0,0,0,0,0]
[0,0,0,0,0,0,0,0,0,0,0,0,0,0,0,0,0,0,0,0,0,0,0,0,0,0,0,0,0]
[0,0,0,0,0,0,0,0,0,0,0,0,0,0,0,0,0,0,0,0,0,0,0,0,0,0,0,0,0]
[0,0,0,0,0,0,0,0,0,0,0,0,0,0,0,0,0,0,0,0,0,0,0,0,0,0,0,0,0]
[0,0,0,0,0,0,0,0,0,0,0,0,0,0,0,0,0,0,0,0,0,0,0,0,0,0,0,0,0]
[0,0,0,0,0,0,0,0,0,0,0,0,0,0,0,0,0,0,0,0,0,0,0,0,0,0,0,0,0]
[0,0,0,0,0,0,0,0,0,0,0,0,0,0,0,0,0,0,0,0,0,0,0,0,0,0,0,0,0]
[0,0,0,0,0,0,0,0,0,0,0,0,0,0,0,0,0,0,0,0,0,0,0,0,0,0,0,0,0]
[0,0,0,0,0,0,0,0,0,0,0,0,0,0,0,0,0,0,0,0,0,0,0,0,0,0,0,0,0]
[0,0,0,0,0,0,0,0,0,0,0,0,0,0,0,0,0,0,0,0,0,0,0,0,0,0,0,0,0]
[0,0,0,0,0,0,0,0,0,0,0,0,0,0,0,0,0,0,0,0,0,0,0,0,0,0,0,0,0]
[0,0,0,0,0,0,0,0,0,0,0,0,0,0,0,0,0,0,0,0,0,0,0,0,0,0,0,0,0]
[0,0,0,0,0,0,0,0,0,0,0,0,0,0,0,0,0,0,0,0,0,0,0,0,0,0,0,0,0]
[0,0,0,0,0,0,0,0,0,0,0,0,0,0,0,0,0,0,0,0,0,0,0,0,0,0,0,0,0]
[0,0,0,0,0,0,0,0,0,0,0,0,0,0,0,0,0,0,0,0,0,0,0,0,0,0,0,0,0]
[0,0,0,0,0,0,0,0,0,0,0,0,0,0,0,0,0,0,0,0,0,0,0,0,0,0,0,0,0]
[0,0,0,0,0,0,0,0,0,0,0,0,0,0,0,0,0,0,0,0,0,0,0,0,0,0,0,0,0]
[0,0,0,0,0,0,0,0,0,0,0,0,0,0,0,0,0,0,0,0,0,0,0,0,0,0,0,0,0]
[0,0,0,0,0,0,0,0,0,0,0,0,0,0,0,0,0,0,0,0,0,0,0,0,0,0,0,0,0]
[0,0,0,0,0,0,0,0,0,0,0,0,0,0,0,0,0,0,0,0,0,0,0,0,0,0,0,0,0]
[0,0,0,0,0,0,0,0,0,0,0,0,0,0,0,0,0,0,0,0,0,0,0,0,0,0,0,0,0]
[0,0,0,0,0,0,0,0,0,0,0,0,0,0,0,0,0,0,0,0,0,0,0,0,0,0,0,0,0]
[0,0,0,0,0,0,0,0,0,0,0,0,0,0,0,0,0,0,0,0,0,0,0,0,0,0,0,0,0]
[0,0,0,0,0,0,0,0,0,0,0,0,0,0,0,0,0,0,0,0,0,0,0,0,0,0,0,0,0]
[0,0,0,0,0,0,0,0,0,0,0,0,0,0,0,0,0,0,0,0,0,0,0,0,0,0,0,0,0]
[0,0,0,0,0,0,0,0,0,0,0,0,0,0,0,0,0,0,0,0,0,0,0,0,0,0,0,0,0]
[0,0,0,0,0,0,0,0,0,0,0,0,0,0,0,0,0,0,0,0,0,0,0,0,0,0,0,0,0]
[0,0,0,0,0,0,0,0,0,0,0,0,0,0,0,0,0,0,0,0,0,0,0,0,0,0,0,0,0]
[0,0,0,0,0,0,0,0,0,0,0,0,0,0,0,0,0,0,0,0,0,0,0,0,0,0,0,0,0]
[0,0,0,0,0,0,0,0,0,0,0,0,0,0,0,0,0,0,0,0,0,0,0,0,0,0,0,0,0]
[0,0,0,0,0,0,0,0,0,0,0,0,0,0,0,0,0,0,0,0,0,0,0,0,0,0,0,0,0]
[0,0,0,0,0,0,0,0,0,0,0,0,0,0,0,0,0,0,0,0,0,0,0,0,0,0,0,0,0]
[0,0,0,0,0,0,0,0,0,0,0,0,0,0,0,0,0,0,0,0,0,0,0,0,0,0,0,0,0]
[0,0,0,0,0,0,0,0,0,0,0,0,0,0,0,0,0,0,0,0,0,0,0,0,0,0,0,0,0]
[0,0,0,0,0,0,0,0,0,0,0,0,0,0,0,0,0,0,0,0,0,0,0,0,0,0,0,0,0]
[0,0,0,0,0,0,0,0,0,0,0,0,0,0,0,0,0,0,0,0,0,0,0,0,0,0,0,0,0]
[0,0,0,0,0,0,0,0,0,0,0,0,0,0,0,0,0,0,0,0,0,0,0,0,0,0,0,0,0]
[0,0,0,0,0,0,0,0,0,0,0,0,0,0,0,0,0,0,0,0,0,0,0,0,0,0,0,0,0]
[0,0,0,0,0,0,0,0,0,0,0,0,0,0,0,0,0,0,0,0,0,0,0,0,0,0,0,0,0]
[0,0,0,0,0,0,0,0,0,0,0,0,0,0,0,0,0,0,0,0,0,0,0,0,0,0,0,0,0]
[0,0,0,0,0,0,0,0,0,0,0,0,0,0,0,0,0,0,0,0,0,0,0,0,0,0,0,0,0]
[0,0,0,0,0,0,0,0,0,0,0,0,0,0,0,0,0,0,0,0,0,0,0,0,0,0,0,0,0]
[0,0,0,0,0,0,0,0,0,0,0,0,0,0,0,0,0,0,0,0,0,0,0,0,0,0,0,0,0]
[0,0,0,0,0,0,0,0,0,0,0,0,0,0,0,0,0,0,0,0,0,0,0,0,0,0,0,0,0]
[0,0,0,0,0,0,0,0,0,0,0,0,0,0,0,0,0,0,0,0,0,0,0,0,0,0,0,0,0]
[0,0,0,0,0,0,0,0,0,0,0,0,0,0,0,0,0,0,0,0,0,0,0,0,0,0,0,0,0]
[0,0,0,0,0,0,0,0,0,0,0,0,0,0,0,0,0,0,0,0,0,0,0,0,0,0,0,0,0]
[0,0,0,0,0,0,0,0,0,0,0,0,0,0,0,0,0,0,0,0,0,0,0,0,0,0,0,0,0]
[0,0,0,0,0,0,0,0,0,0,0,0,0,0,0,0,0,0,0,0,0,0,0,0,0,0,0,0,0]
[0,0,0,0,0,0,0,0,0,0,0,0,0,0,0,0,0,0,0,0,0,0,0,0,0,0,0,0,0]
[0,0,0,0,0,0,0,0,0,0,0,0,0,0,0,0,0,0,0,0,0,0,0,0,0,0,0,0,0]
[0,0,0,0,0,0,0,0,0,0,0,0,0,0,0,0,0,0,0,0,0,0,0,0,0,0,0,0,0]
[0,0,0,0,0,0,0,0,0,0,0,0,0,0,0,0,0,0,0,0,0,0,0,0,0,0,0,0,0]
[0,0,0,0,0,0,0,0,0,0,0,0,0,0,0,0,0,0,0,0,0,0,0,0,0,0,0,0,0]
[0,0,0,0,0,0,0,0,0,0,0,0,0,0,0,0,0,0,0,0,0,0,0,0,0,0,0,0,0]
[0,0,0,0,0,0,0,0,0,0,0,0,0,0,0,0,0,0,0,0,0,0,0,0,0,0,0,0,0]
[0,0,0,0,0,0,0,0,0,0,0,0,0,0,0,0,0,0,0,0,0,0,0,0,0,0,0,0,0]
[0,0,0,0,0,0,0,0,0,0,0,0,0,0,0,0,0,0,0,0,0,0,0,0,0,0,0,0,0]
[0,0,0,0,0,0,0,0,0,0,0,0,0,0,0,0,0,0,0,0,0,0,0,0,0,0,0,0,0]
[0,0,0,0,0,0,0,0,0,0,0,0,0,0,0,0,0,0,0,0,0,0,0,0,0,0,0,0,0]
[0,0,0,0,0,0,0,0,0,0,0,0,0,0,0,0,0,0,0,0,0,0,0,0,0,0,0,0,0]
[0,0,0,0,0,0,0,0,0,0,0,0,0,0,0,0,0,0,0,0,0,0,0,0,0,0,0,0,0]
[0,0,0,0,0,0,0,0,0,0,0,0,0,0,0,0,0,0,0,0,0,0,0,0,0,0,0,0,0]
[0,0,0,0,0,0,0,0,0,0,0,0,0,0,0,0,0,0,0,0,0,0,0,0,0,0,0,0,0]
[0,0,0,0,0,0,0,0,0,0,0,0,0,0,0,0,0,0,0,0,0,0,0,0,0,0,0,0,0]
[0,0,0,0,0,0,0,0,0,0,0,0,0,0,0,0,0,0,0,0,0,0,0,0,0,0,0,0,0]
[0,0,0,0,0,0,0,0,0,0,0,0,0,0,0,0,0,0,0,0,0,0,0,0,0,0,0,0,0]
[0,0,0,0,0,0,0,0,0,0,0,0,0,0,0,0,0,0,0,0,0,0,0,0,0,0,0,0,0]
[0,0,0,0,0,0,0,0,0,0,0,0,0,0,0,0,0,0,0,0,0,0,0,0,0,0,0,0,0]
[0,0,0,0,0,0,0,0,0,0,0,0,0,0,0,0,0,0,0,0,0,0,0,0,0,0,0,0,0]
[0,0,0,0,0,0,0,0,0,0,0,0,0,0,0,0,0,0,0,0,0,0,0,0,0,0,0,0,0]
[0,0,0,0,0,0,0,0,0,0,0,0,0,0,0,0,0,0,0,0,0,0,0,0,0,0,0,0,0]
[0,0,0,0,0,0,0,0,0,0,0,0,0,0,0,0,0,0,0,0,0,0,0,0,0,0,0,0,0]
[0,0,0,0,0,0,0,0,0,0,0,0,0,0,0,0,0,0,0,0,0,0,0,0,0,0,0,0,0]
[0,0,0,0,0,0,0,0,0,0,0,0,0,0,0,0,0,0,0,0,0,0,0,0,0,0,0,0,0]
[0,0,0,0,0,0,0,0,0,0,0,0,0,0,0,0,0,0,0,0,0,0,0,0,0,0,0,0,0]
[0,0,0,0,0,0,0,0,0,0,0,0,0,0,0,0,0,0,0,0,0,0,0,0,0,0,0,0,0]
[0,0,0,0,0,0,0,0,0,0,0,0,0,0,0,0,0,0,0,0,0,0,0,0,0,0,0,0,0]
[0,0,0,0,0,0,0,0,0,0,0,0,0,0,0,0,0,0,0,0,0,0,0,0,0,0,0,0,0]
[0,0,0,0,0,0,0,0,0,0,0,0,0,0,0,0,0,0,0,0,0,0,0,0,0,0,0,0,0]
[0,0,0,0,0,0,0,0,0,0,0,0,0,0,0,0,0,0,0,0,0,0,0,0,0,0,0,0,0]
[0,0,0,0,0,0,0,0,0,0,0,0,0,0,0,0,0,0,0,0,0,0,0,0,0,0,0,0,0]
[0,0,0,0,0,0,0,0,0,0,0,0,0,0,0,0,0,0,0,0,0,0,0,0,0,0,0,0,0]
[0,0,0,0,0,0,0,0,0,0,0,0,0,0,0,0,0,0,0,0,0,0,0,0,0,0,0,0,0]
[0,0,0,0,0,0,0,0,0,0,0,0,0,0,0,0,0,0,0,0,0,0,0,0,0,0,0,0,0]
[0,0,0,0,0,0,0,0,0,0,0,0,0,0,0,0,0,0,0,0,0,0,0,0,0,0,0,0,0]
[0,0,0,0,0,0,0,0,0,0,0,0,0,0,0,0,0,0,0,0,0,0,0,0,0,0,0,0,0]
[0,0,0,0,0,0,0,0,0,0,0,0,0,0,0,0,0,0,0,0,0,0,0,0,0,0,0,0,0]
[0,0,0,0,0,0,0,0,0,0,0,0,0,0,0,0,0,0,0,0,0,0,0,0,0,0,0,0,0]
[0,0,0,0,0,0,0,0,0,0,0,0,0,0,0,0,0,0,0,0,0,0,0,0,0,0,0,0,0]
[0,0,0,0,0,0,0,0,0,0,0,0,0,0,0,0,0,0,0,0,0,0,0,0,0,0,0,0,0]
[0,0,0,0,0,0,0,0,0,0,0,0,0,0,0,0,0,0,0,0,0,0,0,0,0,0,0,0,0]
[0,0,0,0,0,0,0,0,0,0,0,0,0,0,0,0,0,0,0,0,0,0,0,0,0,0,0,0,0]
[0,0,0,0,0,0,0,0,0,0,0,0,0,0,0,0,0,0,0,0,0,0,0,0,0,0,0,0,0]
[0,0,0,0,0,0,0,0,0,0,0,0,0,0,0,0,0,0,0,0,0,0,0,0,0,0,0,0,0]
[0,0,0,0,0,0,0,0,0,0,0,0,0,0,0,0,0,0,0,0,0,0,0,0,0,0,0,0,0]
[0,0,0,0,0,0,0,0,0,0,0,0,0,0,0,0,0,0,0,0,0,0,0,0,0,0,0,0,0]
[0,0,0,0,0,0,0,0,0,0,0,0,0,0,0,0,0,0,0,0,0,0,0,0,0,0,0,0,0]
[0,0,0,0,0,0,0,0,0,0,0,0,0,0,0,0,0,0,0,0,0,0,0,0,0,0,0,0,0]
[0,0,0,0,0,0,0,0,0,0,0,0,0,0,0,0,0,0,0,0,0,0,0,0,0,0,0,0,0]
[0,0,0,0,0,0,0,0,0,0,0,0,0,0,0,0,0,0,0,0,0,0,0,0,0,0,0,0,0]
[0,0,0,0,0,0,0,0,0,0,0,0,0,0,0,0,0,0,0,0,0,0,0,0,0,0,0,0,0]
[0,0,0,0,0,0,0,0,0,0,0,0,0,0,0,0,0,0,0,0,0,0,0,0,0,0,0,0,0]
[0,0,0,0,0,0,0,0,0,0,0,0,0,0,0,0,0,0,0,0,0,0,0,0,0,0,0,0,0]
[0,0,0,0,0,0,0,0,0,0,0,0,0,0,0,0,0,0,0,0,0,0,0,0,0,0,0,0,0]
[0,0,0,0,0,0,0,0,0,0,0,0,0,0,0,0,0,0,0,0,0,0,0,0,0,0,0,0,0]
[0,0,0,0,0,0,0,0,0,0,0,0,0,0,0,0,0,0,0,0,0,0,0,0,0,0,0,0,0]
[0,0,0,0,0,0,0,0,0,0,0,0,0,0,0,0,0,0,0,0,0,0,0,0,0,0,0,0,0]
[0,0,0,0,0,0,0,0,0,0,0,0,0,0,0,0,0,0,0,0,0,0,0,0,0,0,0,0,0]
[0,0,0,0,0,0,0,0,0,0,0,0,0,0,0,0,0,0,0,0,0,0,0,0,0,0,0,0,0]
[0,0,0,0,0,0,0,0,0,0,0,0,0,0,0,0,0,0,0,0,0,0,0,0,0,0,0,0,0]
[0,0,0,0,0,0,0,0,0,0,0,0,0,0,0,0,0,0,0,0,0,0,0,0,0,0,0,0,0]
[0,0,0,0,0,0,0,0,0,0,0,0,0,0,0,0,0,0,0,0,0,0,0,0,0,0,0,0,0]
[0,0,0,0,0,0,0,0,0,0,0,0,0,0,0,0,0,0,0,0,0,0,0,0,0,0,0,0,0]
[0,0,0,0,0,0,0,0,0,0,0,0,0,0,0,0,0,0,0,0,0,0,0,0,0,0,0,0,0]
[0,0,0,0,0,0,0,0,0,0,0,0,0,0,0,0,0,0,0,0,0,0,0,0,0,0,0,0,0]
[0,0,0,0,0,0,0,0,0,0,0,0,0,0,0,0,0,0,0,0,0,0,0,0,0,0,0,0,0]
[0,0,0,0,0,0,0,0,0,0,0,0,0,0,0,0,0,0,0,0,0,0,0,0,0,0,0,0,0]
[0,0,0,0,0,0,0,0,0,0,0,0,0,0,0,0,0,0,0,0,0,0,0,0,0,0,0,0,0]
[0,0,0,0,0,0,0,0,0,0,0,0,0,0,0,0,0,0,0,0,0,0,0,0,0,0,0,0,0]
[0,0,0,0,0,0,0,0,0,0,0,0,0,0,0,0,0,0,0,0,0,0,0,0,0,0,0,0,0]
[0,0,0,0,0,0,0,0,0,0,0,0,0,0,0,0,0,0,0,0,0,0,0,0,0,0,0,0,0]
[0,0,0,0,0,0,0,0,0,0,0,0,0,0,0,0,0,0,0,0,0,0,0,0,0,0,0,0,0]
[0,0,0,0,0,0,0,0,0,0,0,0,0,0,0,0,0,0,0,0,0,0,0,0,0,0,0,0,0]
[0,0,0,0,0,0,0,0,0,0,0,0,0,0,0,0,0,0,0,0,0,0,0,0,0,0,0,0,0]
[0,0,0,0,0,0,0,0,0,0,0,0,0,0,0,0,0,0,0,0,0,0,0,0,0,0,0,0,0]
[0,0,0,0,0,0,0,0,0,0,0,0,0,0,0,0,0,0,0,0,0,0,0,0,0,0,0,0,0]
[0,0,0,0,0,0,0,0,0,0,0,0,0,0,0,0,0,0,0,0,0,0,0,0,0,0,0,0,0]
[0,0,0,0,0,0,0,0,0,0,0,0,0,0,0,0,0,0,0,0,0,0,0,0,0,0,0,0,0]
[0,0,0,0,0,0,0,0,0,0,0,0,0,0,0,0,0,0,0,0,0,0,0,0,0,0,0,0,0]
[0,0,0,0,0,0,0,0,0,0,0,0,0,0,0,0,0,0,0,0,0,0,0,0,0,0,0,0,0]
[0,0,0,0,0,0,0,0,0,0,0,0,0,0,0,0,0,0,0,0,0,0,0,0,0,0,0,0,0]
[0,0,0,0,0,0,0,0,0,0,0,0,0,0,0,0,0,0,0,0,0,0,0,0,0,0,0,0,0]
[0,0,0,0,0,0,0,0,0,0,0,0,0,0,0,0,0,0,0,0,0,0,0,0,0,0,0,0,0]
[0,0,0,0,0,0,0,0,0,0,0,0,0,0,0,0,0,0,0,0,0,0,0,0,0,0,0,0,0]
[0,0,0,0,0,0,0,0,0,0,0,0,0,0,0,0,0,0,0,0,0,0,0,0,0,0,0,0,0]
[0,0,0,0,0,0,0,0,0,0,0,0,0,0,0,0,0,0,0,0,0,0,0,0,0,0,0,0,0]
[0,0,0,0,0,0,0,0,0,0,0,0,0,0,0,0,0,0,0,0,0,0,0,0,0,0,0,0,0]
[0,0,0,0,0,0,0,0,0,0,0,0,0,0,0,0,0,0,0,0,0,0,0,0,0,0,0,0,0]
[0,0,0,0,0,0,0,0,0,0,0,0,0,0,0,0,0,0,0,0,0,0,0,0,0,0,0,0,0]
[0,0,0,0,0,0,0,0,0,0,0,0,0,0,0,0,0,0,0,0,0,0,0,0,0,0,0,0,0]
[0,0,0,0,0,0,0,0,0,0,0,0,0,0,0,0,0,0,0,0,0,0,0,0,0,0,0,0,0]
[0,0,0,0,0,0,0,0,0,0,0,0,0,0,0,0,0,0,0,0,0,0,0,0,0,0,0,0,0]
[0,0,0,0,0,0,0,0,0,0,0,0,0,0,0,0,0,0,0,0,0,0,0,0,0,0,0,0,0]
[0,0,0,0,0,0,0,0,0,0,0,0,0,0,0,0,0,0,0,0,0,0,0,0,0,0,0,0,0]
[0,0,0,0,0,0,0,0,0,0,0,0,0,0,0,0,0,0,0,0,0,0,0,0,0,0,0,0,0]
[0,0,0,0,0,0,0,0,0,0,0,0,0,0,0,0,0,0,0,0,0,0,0,0,0,0,0,0,0]
[0,0,0,0,0,0,0,0,0,0,0,0,0,0,0,0,0,0,0,0,0,0,0,0,0,0,0,0,0]
[0,0,0,0,0,0,0,0,0,0,0,0,0,0,0,0,0,0,0,0,0,0,0,0,0,0,0,0,0]
[0,0,0,0,0,0,0,0,0,0,0,0,0,0,0,0,0,0,0,0,0,0,0,0,0,0,0,0,0]
[0,0,0,0,0,0,0,0,0,0,0,0,0,0,0,0,0,0,0,0,0,0,0,0,0,0,0,0,0]
[0,0,0,0,0,0,0,0,0,0,0,0,0,0,0,0,0,0,0,0,0,0,0,0,0,0,0,0,0]
[0,0,0,0,0,0,0,0,0,0,0,0,0,0,0,0,0,0,0,0,0,0,0,0,0,0,0,0,0]
[0,0,0,0,0,0,0,0,0,0,0,0,0,0,0,0,0,0,0,0,0,0,0,0,0,0,0,0,0]
[0,0,0,0,0,0,0,0,0,0,0,0,0,0,0,0,0,0,0,0,0,0,0,0,0,0,0,0,0]
[0,0,0,0,0,0,0,0,0,0,0,0,0,0,0,0,0,0,0,0,0,0,0,0,0,0,0,0,0]
[0,0,0,0,0,0,0,0,0,0,0,0,0,0,0,0,0,0,0,0,0,0,0,0,0,0,0,0,0]
[0,0,0,0,0,0,0,0,0,0,0,0,0,0,0,0,0,0,0,0,0,0,0,0,0,0,0,0,0]
[0,0,0,0,0,0,0,0,0,0,0,0,0,0,0,0,0,0,0,0,0,0,0,0,0,0,0,0,0]
[0,0,0,0,0,0,0,0,0,0,0,0,0,0,0,0,0,0,0,0,0,0,0,0,0,0,0,0,0]
[0,0,0,0,0,0,0,0,0,0,0,0,0,0,0,0,0,0,0,0,0,0,0,0,0,0,0,0,0]
[0,0,0,0,0,0,0,0,0,0,0,0,0,0,0,0,0,0,0,0,0,0,0,0,0,0,0,0,0]
[0,0,0,0,0,0,0,0,0,0,0,0,0,0,0,0,0,0,0,0,0,0,0,0,0,0,0,0,0]
[0,0,0,0,0,0,0,0,0,0,0,0,0,0,0,0,0,0,0,0,0,0,0,0,0,0,0,0,0]
[0,0,0,0,0,0,0,0,0,0,0,0,0,0,0,0,0,0,0,0,0,0,0,0,0,0,0,0,0]
[0,0,0,0,0,0,0,0,0,0,0,0,0,0,0,0,0,0,0,0,0,0,0,0,0,0,0,0,0]
[0,0,0,0,0,0,0,0,0,0,0,0,0,0,0,0,0,0,0,0,0,0,0,0,0,0,0,0,0]
[0,0,0,0,0,0,0,0,0,0,0,0,0,0,0,0,0,0,0,0,0,0,0,0,0,0,0,0,0]
[0,0,0,0,0,0,0,0,0,0,0,0,0,0,0,0,0,0,0,0,0,0,0,0,0,0,0,0,0]
[0,0,0,0,0,0,0,0,0,0,0,0,0,0,0,0,0,0,0,0,0,0,0,0,0,0,0,0,0]
[0,0,0,0,0,0,0,0,0,0,0,0,0,0,0,0,0,0,0,0,0,0,0,0,0,0,0,0,0]
[0,0,0,0,0,0,0,0,0,0,0,0,0,0,0,0,0,0,0,0,0,0,0,0,0,0,0,0,0]
[0,0,0,0,0,0,0,0,0,0,0,0,0,0,0,0,0,0,0,0,0,0,0,0,0,0,0,0,0]
[0,0,0,0,0,0,0,0,0,0,0,0,0,0,0,0,0,0,0,0,0,0,0,0,0,0,0,0,0]
[0,0,0,0,0,0,0,0,0,0,0,0,0,0,0,0,0,0,0,0,0,0,0,0,0,0,0,0,0]
[0,0,0,0,0,0,0,0,0,0,0,0,0,0,0,0,0,0,0,0,0,0,0,0,0,0,0,0,0]
[0,0,0,0,0,0,0,0,0,0,0,0,0,0,0,0,0,0,0,0,0,0,0,0,0,0,0,0,0]
[0,0,0,0,0,0,0,0,0,0,0,0,0,0,0,0,0,0,0,0,0,0,0,0,0,0,0,0,0]
[0,0,0,0,0,0,0,0,0,0,0,0,0,0,0,0,0,0,0,0,0,0,0,0,0,0,0,0,0]
[0,0,0,0,0,0,0,0,0,0,0,0,0,0,0,0,0,0,0,0,0,0,0,0,0,0,0,0,0]
[0,0,0,0,0,0,0,0,0,0,0,0,0,0,0,0,0,0,0,0,0,0,0,0,0,0,0,0,0]
[0,0,0,0,0,0,0,0,0,0,0,0,0,0,0,0,0,0,0,0,0,0,0,0,0,0,0,0,0]
[0,0,0,0,0,0,0,0,0,0,0,0,0,0,0,0,0,0,0,0,0,0,0,0,0,0,0,0,0]
[0,0,0,0,0,0,0,0,0,0,0,0,0,0,0,0,0,0,0,0,0,0,0,0,0,0,0,0,0]
[0,0,0,0,0,0,0,0,0,0,0,0,0,0,0,0,0,0,0,0,0,0,0,0,0,0,0,0,0]
[0,0,0,0,0,0,0,0,0,0,0,0,0,0,0,0,0,0,0,0,0,0,0,0,0,0,0,0,0]
[0,0,0,0,0,0,0,0,0,0,0,0,0,0,0,0,0,0,0,0,0,0,0,0,0,0,0,0,0]
[0,0,0,0,0,0,0,0,0,0,0,0,0,0,0,0,0,0,0,0,0,0,0,0,0,0,0,0,0]
[0,0,0,0,0,0,0,0,0,0,0,0,0,0,0,0,0,0,0,0,0,0,0,0,0,0,0,0,0]
[0,0,0,0,0,0,0,0,0,0,0,0,0,0,0,0,0,0,0,0,0,0,0,0,0,0,0,0,0]
[0,0,0,0,0,0,0,0,0,0,0,0,0,0,0,0,0,0,0,0,0,0,0,0,0,0,0,0,0]
[0,0,0,0,0,0,0,0,0,0,0,0,0,0,0,0,0,0,0,0,0,0,0,0,0,0,0,0,0]
[0,0,0,0,0,0,0,0,0,0,0,0,0,0,0,0,0,0,0,0,0,0,0,0,0,0,0,0,0]

{"sheet":"99_Annex","index":11,"n_rows":28,"n_cols":46,"rows_kept":28,"cut":false,"hidden":true,"merged":[]}
["Fixed Data",2,null,4,null,6,null,8,null,10,null,12,null,14,null,16,null,null,null,null,null,null,null,null,null,null,null,null,null,30,null,32,null,null,35,null,null,38,null,null,null,42]
[null,null,null,null,null,null,null,null,null,null,null,null,null,null,null,null,0,1,2,3,4,5,6,7,8,9,10,11,12]
["array_BoilerTypes",null,"array_EnergyAssigning",null,"uf_Now",null,"array_BakingOvenTypes",null,"array_SteamingMethods",null,"array_BakingOvenEnergySource",null,"array_BoilerEfficiencyCalcTypes",null,"array_EERCalcTypes",null,"array_HX_Headers",null,null,null,null,null,null,null,null,null,null,null,null,null,"Liste Ströme",null,"iHS","iCS",null,"iChosen","iDiaChosen",null,"PE Factor","CO2 Factor","iEnergieTraeger",null,null,null,"CO2","PE Factor"]
["Steam",null,"default: assumed part load factor",null,"uf_Boiler",null,"autoclave oven",null,"direct infusion of steam",null,"Diesel",null,"Calculate Boiler Efficiency",null,"Estimate EER",null,"iEntry (hidden)","hs id (hidden)","cs id (hidden)","HX Name","HS ","CS","Q [kW]","active [h]","E [MWh]","T HS in [°C]","T CS in [°C]","T HS out [°C]","T CS out [°C]",null,"Prozess",null,0,0,null,{"$f":"MAX('05_WT_Auswahl'!A5:A14)+1","v":1},{"$f":"IF(rng_iChosen=1,1,rng_iChosen-1)","v":1},null,{"$f":"VLOOKUP($AO$4,$AR$5:$AT$14,3,FALSE)","v":1.1100000000000001},{"$f":"VLOOKUP($AO$4,$AR$5:$AT$14,2,FALSE)","v":0.21451999999999999},4,null,null,null,"kg CO2e/kWh","kWhPE/kWhFE"]
["Hot Water",null,"define percentage of each energy source",null,null,null,"rack oven",null,"hot water from storages (variable)",null,"Natural Gas",null,"Enter Boiler Efficiency",null,"Enter EER manually",null,null,null,null,null,null,null,null,null,null,null,null,null,null,null,"Utility",null,null,null,null,null,null,null,null,null,null,null,"Kohle",1,0.31303999999999998,1.05]
["Thermal Oil",null,"define energy of each energy source",null,null,null,"deck oven",null,"electric instantaneous water heater",null,"Biogas",null,null,null,null,null,null,null,null,null,null,null,null,null,null,null,null,null,null,null,null,null,null,null,null,null,null,null,null,null,null,null,"Diesel",2,0.25117,1.1000000000000001]
[null,null,null,null,null,null,"others",null,null,null,"Electricity",null,null,null,null,null,null,null,null,null,null,null,null,null,null,null,null,null,null,null,null,null,null,null,null,null,null,null,null,null,null,null,"Heizöl",3,0.26876,1.17]
[null,null,null,null,null,null,null,null,null,null,"Solar Thermal",null,null,null,null,null,null,null,null,null,null,null,null,null,null,null,null,null,null,null,null,null,null,null,null,null,null,null,null,null,null,null,"Flüssiggas",4,0.21451999999999999,1.1100000000000001]
[null,null,null,null,null,null,null,null,null,null,"Steam 2 bar",null,null,null,null,null,null,null,null,null,null,null,null,null,null,null,null,null,null,null,null,null,null,null,null,null,null,null,null,null,null,null,"Erdgas",5,0.18404000000000001,1.17]
[null,null,null,null,null,null,null,null,null,null,"Steam 5 bar",null,null,null,null,null,null,null,null,null,null,null,null,null,null,null,null,null,null,null,null,null,null,null,null,null,null,null,null,null,null,null,"Petrol",6,0.24051,1.1000000000000001]
[null,null,null,null,null,null,null,null,null,null,"Thermal Oil 5 bar",null,null,null,null,null,null,null,null,null,null,null,null,null,null,null,null,null,null,null,null,null,null,null,null,null,null,null,null,null,null,null,"Biomass (Hackschnitzel)",7,0,1.06]
[null,null,null,null,null,null,null,null,null,null,"Hot Water 1 bar",null,null,null,null,null,null,null,null,null,null,null,null,null,null,null,null,null,null,null,null,null,null,null,null,null,null,null,null,null,null,null,"Biogas",8,0,1.5]
[null,null,null,null,null,null,null,null,null,null,"Steam 6 bar",null,null,null,null,null,null,null,null,null,null,null,null,null,null,null,null,null,null,null,null,null,null,null,null,null,null,null,null,null,null,null,"Fernwärme (bei 70 % fossil)",9,0.21643999999999999,0.7]
[null,null,null,null,null,null,null,null,null,null,"  bar",null,null,null,null,null,null,null,null,null,null,null,null,null,null,null,null,null,null,null,null,null,null,null,null,null,null,null,null,null,null,null,"Strom",10,0.18787999999999999,2.97]
[null,null,null,null,null,null,null,null,null,null,"Thermal Oil 2 bar"]
[]
[]
[]
[]
[null,null,null,null,null,null,null,null,null,null,null,null,null,null,null,null,null,null,null,null,null,146,{"$f":"DEC2HEX(V20)","v":"92"}]
[null,null,null,null,null,null,null,null,null,null,null,null,null,null,null,null,null,null,null,null,null,205,{"$f":"DEC2HEX(V21)","v":"CD"}]
[null,null,null,null,null,null,null,null,null,null,null,null,null,null,null,null,null,null,null,null,null,220,{"$f":"DEC2HEX(V22)","v":"DC"}]
[null,null,null,null,null,null,null,null,null,null,null,null,null,null,null,null,null,null,null,null,null,null,{"$f":"\"H&\"&W20&W21&W22","v":"H&92CDDC"}]
[]
[null,null,null,null,null,null,null,null,null,null,null,null,null,null,null,null,null,null,null,null,null,49,{"$f":"DEC2HEX(V25)","v":"31"}]
[null,null,null,null,null,null,null,null,null,null,null,null,null,null,null,null,null,null,null,null,null,134,{"$f":"DEC2HEX(V26)","v":"86"}]
[null,null,null,null,null,null,null,null,null,null,null,null,null,null,null,null,null,null,null,null,null,155,{"$f":"DEC2HEX(V27)","v":"9B"}]
[null,null,null,null,null,null,null,null,null,null,null,null,null,null,null,null,null,null,null,null,null,null,{"$f":"\"H&\"&W25&W26&W27","v":"H&31869B"}]