{"text_format":"1","workbook":"xlsx","n_sheets":6,"sheets":["Welcome","Comments","Calculation","Translation","Data sheet","hilf"],"not_rendered":{"charts":0,"images":15,"macros":1,"external_links":0,"defined_names":6,"comments":3,"pivot_tables":0},"unopened":[],"bounds":{"document_bytes":16777216,"sheet_cells":100000,"rows_first":2000,"rows_last":500,"rows_between":2000,"halvings":0,"cell_chars":16384,"cell_head_chars":4096},"cells_cut":0,"cells_raw":0,"read":"whole","date_system":"1900"}

{"sheet":"Welcome","index":0,"n_rows":39,"n_cols":15,"rows_kept":39,"cut":false,"hidden":false,"merged":[[1,1,2,8],[28,1,28,8],[30,1,30,8],[31,1,31,8]]}
[]
[null,"Welcome to the \"Solid Biomass Fuel Parameters\" Calculation Tool\nof the Austrian Energy Agency.",null,null,null,null,null,null,6]
[]
[]
[null,1,null,"Please select your language",null,null,null,"English",null,null,null,null,null,null,1]
[null,null,null,null,null,null,null,null,null,null,null,null,null,null,1]
[null,2,null,"Bitte wählen Sie Ihre Sprache",null,null,null,"German"]
[]
[null,3,null,"Izaberite jezik",null,null,null,"Croatian"]
[]
{"$rows_left_out":30}
{"sheet":"Comments","index":1,"n_rows":53,"n_cols":17,"rows_kept":53,"cut":false,"hidden":true,"merged":[]}
[]
["On this sheet you find the translation of the comments given in column E of the sheet \"Calculation\" (cell references to \"Calculation\" sheet - see first column of this sheet)"]
[]
["Reference Cell in \nsheet \"Calculation\"","English","Deutsch","Croatian","Ukranian","Greek","Romanian","Bulgarian","Slovak","Finnsih","Polish"]
[null,"Class   natural wood low ash content; P16S particle classification main fraction (3,15 < P ≤ 16) mm",null,"Razred   prirodno drvo nizak udio pepela; klasifikacija čestice P16S glavna frakcija (3,15 < P ≤ 16) mm","Натуральна деревина класу   з низькою зольністю; основні фракції (3,15 < P ≤ 16) мм по класифікації частинок P16S","Κλάση   φυσικό ξύλο χαμηλή περιεκτικότητα τέφρας; P16S ταξινόμηση σωματιδίων κύριο κλάσμα (3,15 <P≤16)mm","Clasa   - lemn natural cu continut scazut de cenusa; P16S - clasificarea dupa fractia majora a particulelor (3.15 < P ≤ 16) mm","Клас А1 натурална дървесина ниско пепелно съдържание; П16S класификация на частици основна фракция (3,5<Р≤16)мм","Trieda A1 prírodné drevo s nízkym obsahom popola; P16S klasifikácia častíc hlavných rozmerov (3,15 < P ≤ 16) mm","Luokka A1, luonnon puu alhainen tuhkapitoisuus","Naturalne drewno klasa A1 niska zawartość popiołu; klasyfikacja cząstek frakcji głównej P16S (3,15 < P ≤ 16) mm"]
[null,"Class A1 natural wood low ash content; P31S particle classification main fraction (3,15 < P ≤ 31,5) mm",null,"Razred A1 prirodno drvo nizak udio pepela; klasifikacija čestice P31S glavna frakcija (3,15 < P ≤ 31,5) mm","Натуральна деревина класу A1 з низькою зольністю; основні фракції (3,15 < P ≤ 31,5) мм по класифікації частинок P31S","Κλάση Α1 φυσικό ξύλο χαμηλή περιεκτικότητα τέφρας; P31S ταξινόμηση σωματιδίων κύριο κλάσμα (3,15 <P≤31,5)mm","Clasa A1 - lemn natural cu continut scazut de cenusa; P31S - clasificarea dupa fractia majora a particulelor (3.15 < P ≤ 31.15) mm","Клас А1 натурална дървесина ниско пепелно съдържание; П31S класификация на частици основна фракция (3,5<Р≤31,5)мм","Trieda A1 prírodné drevo s nízkym obsahom popola; P31S klasifikácia častíc hlavných rozmerov (3,15 < P ≤ 31,5) mm","Luokka A1, luonnon puu alhainen tuhkapitoisuus","Naturalne drewno klasa A1 niska zawartość popiołu; klasyfikacja cząstek frakcji głównej P31S (3,15 < P ≤ 31,5) mm"]
[null,"Class A1 natural wood low ash content; P45S particle classification main fraction (3,15 < P ≤ 45) mm",null,"Razred A1 prirodno drvo nizak udio pepela; klasifikacija čestice P45S glavna frakcija (3,15 < P ≤ 45) mm","Натуральна деревина класу A1 з низькою зольністю; основні фракції (3,15 < P ≤ 45) мм по класифікації частинок P45S","Κλάση Α1 φυσικό ξύλο χαμηλή περιεκτικότητα τέφρας; P45S ταξινόμηση σωματιδίων κύριο κλάσμα (3,15<P≤45)mm","Clasa A1 - lemn natural cu continut scazut de cenusa; P45S - clasificarea dupa fractia majora a particulelor  (3.15 < P ≤ 45) mm","Клас А1 натурална дървесина ниско пепелно съдържание; П45S класификация на частици основна фракция (3,5<Р≤45)мм","Trieda A1 prírodné drevo s nízkym obsahom popola; P45S klasifikácia častíc hlavných rozmerov (3,15 < P ≤ 45) mm","Luokka A1, luonnon puu alhainen tuhkapitoisuus","Naturalne drewno klasa A1 niska zawartość popiołu; klasyfikacja cząstek frakcji głównej P45S (3,15 < P ≤ 45) mm"]
[null,"Class A2 natural wood high ash content; P31S particle classification main fraction (3,15 < P ≤ 16) mm",null,"Razred A2 prirodno drvo visok udio pepela; klasifikacija čestice P31S glavna frakcija (3,15 < P ≤ 16) mm","Натуральна деревина класу A2 з високою зольністю; основні фракції (3,15 < P ≤ 16) мм по класифікації частинок P16S","Κλάση Α2 φυσικό ξύλο χαμηλή περιεκτικότητα τέφρας; P31S ταξινόμηση σωματιδίων κύριο κλάσμα (3, 15<P≤16)mm","Clasa A2 - lemn natural cu continut ridicat de cenusa; P16S - clasificarea dupa fractia majora a particulei  (3.15 < P ≤ 16) mm","Клас А2 натурална дървесина високо пепелно съдържание; П16S класификация на частици основна фракция (3,5<Р≤16)мм","Trieda A2 prírodné drevo s vysokým obsahom popola; P31S klasifikácia častíc hlavných rozmerov (3,15 < P ≤ 16) mm","Luokka A2, luonnon puu korkea tuhkapitoisuus","Naturalne drewno klasa A2 wysoka zawartość popiołu; klasyfikacja cząstek frakcji głównej P31S (3,15 < P ≤ 16) mm"]
[null,"Class A2 natural wood high ash content; P31S particle classification main fraction (3,15 < P ≤ 31,5) mm",null,"Razred A2 prirodno drvo visok udio pepela; klasifikacija čestice P31S glavna frakcija (3,15 < P ≤ 31,5) mm","s","Κλάση Α2 φυσικό ξύλο χαμηλή περιεκτικότητα τέφρας; P31S ταξινόμηση σωματιδίων κύριο κλάσμα (3, 15<P≤31,5)mm","Clasa A2 - lemn natural cu continut ridicat de cenusa; P31S - clasificarea dupa fractia majora a particulei  (3,15 < P ≤ 31.15) mm","Клас А2 натурална дървесина високо пепелно съдържание; П31S класификация на частици основна фракция (3,5<Р≤31,5)мм","Trieda A2 prírodné drevo s vysokým obsahom popola; P31S klasifikácia častíc hlavných rozmerov (3,15 < P ≤ 31,5) mm","Luokka A2, luonnon puu korkea tuhkapitoisuus","Naturalne drewno klasa A2 wysoka zawartość popiołu; klasyfikacja cząstek frakcji głównej P31S (3,15 < P ≤ 31,5) mm"]
[null,"Class A2 natural wood high ash content; P45S particle classification main fraction (3,15 < P ≤ 45) mm",null,"Razred A2 prirodno drvo visok udio pepela; klasifikacija čestice P45S glavna frakcija (3,15 < P ≤ 45) mm","Натуральна деревина класу A2 з високою зольністю; основні фракції (3,15 < P ≤ 45) мм по класифікації частинок P45S","Κλάση Α2 φυσικό ξύλο χαμηλή περιεκτικότητα τέφρας; P45S ταξινόμηση σωματιδίων κύριο κλάσμα (3,15<P≤45)mm","Clasa A2 - lemn natural cu continut ridicat de cenusa; P45S - clasificarea dupa fractia majora a particulei  (3.15 < P < 45) mm","Клас А2 натурална дървесина високо пепелно съдържание; П45S класификация на частици основна фракция (3,5<Р≤45)мм","Trieda A2 prírodné drevo s vysokým obsahom popola; P45S klasifikácia častíc hlavných rozmerov (3,15 < P ≤ 45) mm","Luokka A2, luonnon puu korkea tuhkapitoisuus","Naturalne drewno klasa A2 wysoka zawartość popiołu; klasyfikacja cząstek frakcji głównej P45S (3,15 < P ≤ 45) mm"]
{"$rows_left_out":44}
{"sheet":"Calculation","index":2,"n_rows":89,"n_cols":19,"rows_kept":89,"cut":false,"hidden":false,"merged":[[75,1,75,18],[6,6,6,8],[36,2,40,2],[68,1,68,18],[69,1,69,18],[17,1,18,1],[19,1,20,1],[3,10,3,11],[42,1,43,1],[6,14,6,16],[72,1,72,18],[73,1,73,18]]}
[null,"Spreadsheet for the calculation of parameters and prices of wood fuel and straw assortments"]
[null,"Version 1.8"]
[null,"Please enter your variables in the light red cells."]
[null,"For the calculations to work as intended, macros have to be activated in the Excel settings => Tools | Macro | Security | Security level | set to \"Medium\".",null,null,null,null,null,null,null,null,{"$f":"VLOOKUP(Welcome!O5,Welcome!B5:H23,7,FALSE)","v":"English"},null,0]
[null,"Move the cursor over the red triangle in the respective cell to show the hidden comments containing additional information on the respective parameters.",null,null,null,null,null,null,null,null,null,null,0]
[]
[null,"Parameters",null,null,null,null,"Wood species",null,null,null,"Bark",null,"Compressed wood",null,"Straw",null,null,null,"Other"]
[]
[null,"Basic parameters","Wood species/ fuel type","Selection in the drop-down menu",null,null,"CW & NCW","CW & NCW","CW & NCW",null,"bark NCW",null,"bark briquettes",null,"straw bales small","straw bales small","straw bales small",null,"natural gas"]
[null,null,"Fuel group","Assignment to fuel groups",null,null,{"$f":"VLOOKUP(G9,'Data sheet'!B6:P98,5,FALSE)","v":"CW & NCW (mixed)"},{"$f":"VLOOKUP(H9,'Data sheet'!B6:P98,5,FALSE)","v":"CW & NCW (mixed)"},{"$f":"VLOOKUP(I9,'Data sheet'!B6:P98,5,FALSE)","v":"CW & NCW (mixed)"},null,{"$f":"VLOOKUP(K9,'Data sheet'!B6:P98,5,FALSE)","v":"bark NCW"},null,"Compressed wood",null,{"$f":"VLOOKUP(O9,'Data sheet'!B6:P98,5,FALSE)","v":"straw mixed"},{"$f":"VLOOKUP(P9,'Data sheet'!B6:P98,5,FALSE)","v":"straw mixed"},{"$f":"VLOOKUP(Q9,'Data sheet'!B6:P98,5,FALSE)","v":"straw mixed"},null,"fossil"]
{"$rows_left_out":80}
{"sheet":"Translation","index":3,"n_rows":226,"n_cols":17,"rows_kept":226,"cut":false,"hidden":true,"merged":[]}
[1]
[]
["Sheet","Adress","English","German","Croatian","Ukrainian","Greek","Romanian","Bulgarian","Slovak","Finnish","Polish"]
["Calculation","B1","Spreadsheet for the calculation of parameters and prices of wood fuel and straw assortments","Kalkulationsblatt zur Ermittlung von Kenndaten und Preisen für Energieholzsortimente","Tablica za izračun parametara i cijena ogrjevnog drva i slame ","Електронна таблиця для розрахунку параметрів та цін різних видів деревного палива та соломи","Υπολογιστικό Φύλλο για τον υπολογισμό των παραμέτρων και των τιμών των καυσίμων ξύλου και διαφόρων ειδών αχύρου","Foaie de calcul pentru calculul parametrilor si a preturilor de combustibili din lemn si sortimente de paie","Таблица за изчисляване на параметрите и цените на дървесно гориво и слама","Výpočtový formulár pre výpočet parametrov a cien palivového dreva a výberu slamy","Laskentataulukko ","Arkusz do kalkulacji parametrów i cen paliw drzewnych i słomy"]
["Calculation","B2","Version 1.8","Version 1.8","Version 1.8","Version 1.8","Version 1.8","Version 1.8","Version 1.8","Version 1.8","Version 1.8","Version 1.8"]
["Calculation","B3","Please enter your variables in the light red cells.","Bitte verwenden Sie die hellroten Zellen um die Variablen zu ändern.","Unesite svoje varijable u svijetlo crvena polja ","Уведіть ваші значення у світло-червоні комірки","Παρακαλούμε εισάγετε τις μεταβλητές σας στα κελιά με ανοιχτό κόκκινο χρώμα","Va rugam sa introduceti variabilele in celulele rosu deschis .","Моля поставете променливите в светлочервените клетки","Prosím zadajte vaše premenné do svetločervených buniek","Lisää muuttujat taulukon punaisiin soluihin.","Wpisz swoje zmienne w jasno czerwone komórki."]
["Calculation","B4","For the calculations to work as intended, macros have to be activated in the Excel settings => Tools | Macro | Security | Security level | set to \"Medium\".","Für die Ausführung der Berechnungsroutinen müssen Makros aktiviert sein => Excel-Einstellung unter Extras | Makro | Sicherheit | auf \"Mittel\" stellen.","Za ispravan rad tablice izračuna potrebno je aktivirati makro funckije u Excel postavkama  na Tools | Macro | Security | Security level |  \"Medium\"","Для правильного проведення розрахунків активуйте макроси в настройках Excel => Інструменти | Макроси | Безпека | Рівень безпеки | встановіть \"Середній\"","Για να γίνουν οι υπολογισμοί όπως προβλέπεται, πρέπει να ενεργοποιηθούν οι μακροεντολές (macros) στις ρυθμίσεις του Excell Þ  Tools | Macro | Security | Security Level | επιλέξτε \"Medium\"","Pentru calcule trebuie sa  sa fie activata functia  macros  in setarile Excel = > Tools | Macro | Securitate | Nivelul de securitate | setate la \" Medium \".","За правилната работа на таблицата за изчисляване, трябва да се активират макросите в Excel settings","Pre správnu prácu výpočtu, musia byť aktivované makrá v Exceli - nastavenia =>Nástroje | Makro | Bezpečnosť | Úroveň zabezpečenia | Medium","Jotta laskelmat toimivat tarkoitetulla tavalla, täytyy makrot aktivoida Excel asetuksista => Työkalut | Makro | Turvallisuus | Turvallisuus taso | aseta asentoon \"Medium\".","W celu prawidłowej kalkulacji należy włączyć makra w ustawieniach Excela => Narzędzia | Makra | Bezpieczeństwo | Poziom bezpieczeństwa | Ustawić na średni Tools | Macro | Security | Security level | set to \"Medium\"."]
["Calculation","B5","Move the cursor over the red triangle in the respective cell to show the hidden comments containing additional information on the respective parameters.","Ziehen Sie den Mauszeiger auf die Kommentare (rotes Dreieck in der jeweiligen Zelle) um zusätzliche Informationen zu den einzelnen Kennwerten zu erhalten.","Dovesti kursor na crveni trokut u odgovarajućem polju kako bi se pokazao skriveni komentar koji sadrži dodatne informacije o odgovarajućim parametrima","Наведіть курсор на червоний трикутник у відповідній комірці для перегляду схованих коментарів, що містять додаткову інформацію щодо відповідного параметру","Μετακινήστε τον κέρσορα πάνω από το κόκκινο τρίγωνο στο αντίστοιχο κελί για να εμφανιστούν τα κρυμμένα σχόλια που περιέχουν επιπρόσθετες πληροφορίες για τις αντίστοιχες παραμέτρους.","Mutati cursorul pe triunghiul rosu in celula respectiva pentru a afisa comentariile ascunse care contin informatii suplimentare cu privire la parametrii respectivi .","Преместете курсора по червения триъгълник в съответната клетка за да се покажат скритите коментари, съдържащи допълнителна информация за съответните параметри","Presuňte kurzor myši nad červený trojuholník v danej bunke aby sa Vám ukázali skryté komentáre obsahujúce ďalšie informácie pre príslušné parametre","Parametriä koskevia lisäohjeita saat laittamalla kursorin solun päälle.","Przesuń kursor na czerwony trójkąt w poszczególnej komórce aby pokazać ukryty komentarz zawierający dodatkowe informacje o poszczególnych parametrach."]
["Calculation","B7","Parameters","Kennwerte","Parametri ","Характеристики","Παράμετροι","Parametri","Параметри","Parametre","Muuttujat","Parametry"]
["Calculation","B9","Basic parameters","Grundeingabe","Osnovni parametri","Основні характеристики","Βασικές παράμετροι","Parametri de baza","Базови параметри","Základné parametre","Perusmuuttujat","Podstawowe parametry"]
{"$rows_left_out":217}
{"sheet":"Data sheet","index":4,"n_rows":128,"n_cols":23,"rows_kept":128,"cut":false,"hidden":false,"merged":[[2,17,4,17],[2,1,4,1],[2,2,4,2],[2,3,4,3],[2,4,4,4],[2,5,4,5],[2,6,3,6],[2,7,3,7],[2,8,3,8],[2,15,2,16],[2,9,2,10],[2,11,2,14]]}
[1,"Data sheet for the calculation of parameters and prices of wood fuel assortments"]
[null,null,null,null,null,null,null,null,null,null,null,11,12,13,14,15,16,null,null,"Spalte1","Spalte2","Spalte3","Spalte4"]
[null,"Wood species/ fuel type",null,"Botanical name","Alternative name(s)","Fuel group","Sortier-\nung","H-content","Higher heating value","Oven-dry density",null,"Bulk density\n(moisture content (dry basis) 12-15)",null,null,null,"Shrinkage",null,"Comments",null,"Assortment","Conversion factor","Unit","Ash content %"]
[null,null,null,null,null,null,null,null,null,"Mean","Source","Minimum","Mean","Maximum","Source","Mean","Source"]
[null,null,null,null,null,null,null,"[%]","-","[kg/m³]",null,"[kg/m³]","[kg/m³]","[kg/m³]",null,"[%]"]
[null,"CW & NCW",null,"-","-","CW & NCW (mixed)",1,6.2,20.206035400000001,475,"5)"," -"," -"," -","-",12.3,"5)","The oven-dry density, the shrinkage rate, the hydrogen content and the higher heating value were calculated by weighting based on the use of the different wood species according to the Austrian Forest Inventory.",null,"solid wood mass",1,"m³(solid)",1.5]
[null,"coniferous wood",null,"-","-","CW (mixed)",2,6.3,20.3669431,445,"5)"," -"," -"," -","-",11.7,"5)","The oven-dry density, the shrinkage rate, the hydrogen content and the higher heating value were calculated by weighting based on the use of the different wood species according to the Austrian Forest Inventory.",null,"split firewood (1 m)",1.6667000000000001,"m³(stacked)",1]
[null,"Cedar",null,"Cedrus deodara","Himalayan Cedar, Deodar Cedar","coniferous wood",3,6.3,20.3669431,470,"1)","-",545,"-","3)",11.2,"3)","No minimum and maximum bulk density values.",null,"firewood (stacked)",1.25,{"$f":"V7","v":"m³(stacked)"},1]
[null,"Cypress",null,"Cypressus sempervirens","Mediterranean Cypress",{"$f":"$F$8","v":"coniferous wood"},3,6.3,20.3669431,450,"1)",450," -",590,"3)",8.8000000000000007,"3)","No mean bulk density value.",null,"firewood (loose)",2,"m³(loose)",1]
[null,"Douglas Fir",null,"Pseudotsuga menziesii","-",{"$f":"$F$8","v":"coniferous wood"},3,6.3,20.3669431,470,"1)",350,502,770,"1)",11.9,"1)",null,null,"wood chips P16",2.5,{"$f":"V9","v":"m³(loose)"},1.5]
{"$rows_left_out":119}
{"sheet":"hilf","index":5,"n_rows":39,"n_cols":17,"rows_kept":39,"cut":false,"hidden":true,"merged":[]}
[0,"Allgemein"]
[1,"Am Übersetzen"]
[]
[]
[]
[]
[]
[]
[]
[]
{"$rows_left_out":29}