{"text_format":"1","workbook":"xlsx","n_sheets":12,"sheets":["Titelblatt","Betriebsdaten I","Betriebsdaten II","KWK","Abnehmerverbräuche","Auswertung_I","Auswertung_II","Hilfe","DatenTransformierung","DatenTransformierung2","Brennstoff","Hilfstabelle"],"not_rendered":{"charts":12,"images":18,"macros":1,"external_links":0,"defined_names":218,"comments":5,"pivot_tables":0},"unopened":[],"bounds":{"document_bytes":16777216,"sheet_cells":100000,"rows_first":2000,"rows_last":500,"rows_between":2000,"halvings":0,"cell_chars":16384,"cell_head_chars":4096},"cells_cut":0,"cells_raw":0,"read":"whole","date_system":"1900"}

{"sheet":"Titelblatt","index":0,"n_rows":19,"n_cols":12,"rows_kept":19,"cut":false,"hidden":false,"merged":[[0,11,0,15],[1,9,11,15],[12,9,12,15],[13,0,13,6],[14,0,14,6],[3,3,3,6],[15,0,15,6],[13,9,13,16],[9,4,9,7],[7,4,7,7],[5,4,5,7],[11,0,11,6],[12,0,12,6]]}
["QM Heizwerke - Standardisierter Betriebsbericht",null,null,null,null,null,null,null,null,"Kurzanleitung",null,"Hier geht’s zur Hilfe"]
["Version","18.0",null,null,null,null,null,null,null,"\n- Speichern Sie diese Excel-Datei auf Ihrem Computer.\n- Aktivieren Sie die BEARBEITUNG und die Excel-MAKROS beim Öffnen der Excel-Datei!\n- Geben Sie alle erforderlichen Daten in die gelben Eingabefelder ein!\n- Per Klick auf die Schaltfläche \"XML-Datei erstellen\" werden Dateien zum Hochladen erstellt.\n          - Nur die XML-Dateien können in die QM-Datenbank hochgeladen werden.          \n          - Für die Betriebsdaten und die Abnehmerverbräuche werden separate Dateien erstellt.\n          - XML-Dateien werden am gleichen Ort wie die Excel-Datei gespeichert.        \n          - Beim Erstellen der XML-Datei werden die Eingaben automatisch geprüft.\n          - Bei Fehlern wird KEINE XML-Datei erstellt.\n- Per Klick auf die Schaltfläche \"Fehlerprüfung\" können die Eingaben vorab geprüft werden.\n- Unvollständige Eingaben und Fehler werden angezeigt:\n          - Liste mit Fehlermeldungen (mit Doppelklick springt man zur betroffenen Eingabezelle).\n          - Zellen mit fehlenden oder falschen Eingaben werden ROT markiert.\n- Die Excel-Vorlage darf NICHT VERÄNDERT werden!"]
[]
[null,null,"Heizwerk - Bezeichnung:"]
[]
[null,null,"Projektnummer:",null,"Nummer des QM-Projektes in dem der Betriebsbericht hochgeladen wird z.B. 18ST001"]
[]
[null,null,"Betriebsjahr:",null,"Jahr in dem die Betriebsperiode beginnt (Beginn des Betriebsjahres 06/2016: Betriebsbericht für Jahr 2016 erstellen!)"]
[]
[null,null,"Anfangsmonat:",null,"Bei Abrechnung nach Kalenderjahr 01, bei Abrechnung nach Heizsaison z.B. 07 für Beginn im Juli"]
[]
["Der standardisierte Betriebsbericht von klimaaktiv QM Heizwerke dient zur Erfassung und nachfolgenden Auswertung (Benchmarking) der wichtigsten Betriebsdaten einer Biomasse-Nahwärmeanlage."]
["Die Erfassung und Auswertung von Betriebsdaten ist eine wichtige Grundlage für einen effizienten und langfristig erfolgreichen Heizwerksbetrieb!"]
["Zielsetzungen:\n      - Dokumentation des Anlagenbetriebes für Betreiberinnen und Betreiber\n      - Automatisierte Auswertung von Kennzahlen und Vergleich mit anderen Heizwerken\n      - Planungsgrundlage für Anlagenausbau und Optimierung\n      - Erfüllung der Berichtspflichten entsprechend Förderungsvertrag\n      - Weiterentwicklung von Förderungsmaßnahmen\n      - Gesicherte Speicherung wichtiger Daten\n",null,null,null,null,null,null,null,null,"Fehlermeldungen Betriebsbericht\nDurch Doppelklick auf die Fehlermeldung (Zeile) springt man zur entsprechenden Eingabezelle!\n\n"]
["Bei Rückfragen wenden Sie sich bitte an Ihren Qualitätsbeauftragten oder\ndas QM Heizwerke - Team von AEE INTEC\n(qm-heizwerke@aee.at, 03112 5886 -234 oder -262)."]
["Sollte das Hochladen in die QM Heizwerke - Datenbank nicht erfolgreich sein, beachten Sie bitte die Fehlermeldungen beim Hochladen und übermitteln Sie die Excel- und xml-Dateien an die KPC (qm@kommunalkredit.at, 01 31631 739)"]
[]
["erstellt vom QM Heizwerke - Team"]
["AEE INTEC"]

{"sheet":"Betriebsdaten I","index":1,"n_rows":72,"n_cols":20,"rows_kept":72,"cut":false,"hidden":false,"merged":[[2,2,2,3],[4,2,5,2],[10,2,11,2],[4,4,5,4],[10,16,11,16],[10,14,11,14],[10,15,11,15],[4,10,5,10],[4,11,5,11],[4,13,5,13],[10,11,11,11],[4,16,5,16],[4,14,5,14],[4,15,5,15],[4,8,5,8],[10,3,11,3],[4,3,5,3],[4,6,5,6],[4,7,5,7],[20,8,22,8],[20,9,22,13],[10,9,11,9],[20,1,22,3],[2,6,2,7],[23,9,23,13],[24,9,25,9],[2,11,2,12],[4,5,5,5],[4,12,5,12],[4,9,5,9],[10,12,11,12],[10,13,11,13],[20,4,22,7],[24,4,25,4],[10,10,11,10],[10,5,11,5],[10,7,11,7],[10,6,11,6],[23,4,23,8],[24,10,24,11],[24,5,24,6],[10,4,11,4],[10,8,11,8],[65,1,66,1],[65,2,66,3],[65,4,65,8],[39,2,39,3],[33,4,33,8],[41,1,41,16],[65,9,65,13],[65,14,71,16],[66,4,67,4],[66,5,66,6],[66,7,66,8],[66,9,67,9],[66,10,66,11],[66,12,66,13],[67,1,68,1],[67,2,68,3],[23,1,24,1],[25,2,26,3],[23,2,24,3],[38,2,38,3],[37,2,37,3],[35,2,36,3],[33,2,34,3],[25,1,26,1],[35,1,36,1],[33,1,34,1],[28,2,28,3],[29,2,29,3],[69,2,69,3],[70,2,70,3],[71,2,71,3],[23,14,29,16],[27,2,27,3],[33,14,39,16],[34,4,35,4],[34,10,34,11],[34,5,34,6],[34,7,34,8],[34,9,35,9],[31,4,31,13],[24,7,24,8],[24,12,24,13],[34,12,34,13],[33,9,33,13]]}
[null,null,null,null,null,null,null,null,null,null,null,null,null,null,null,null,null,"gelbe Felder sind Eingabefelder!"]
[null,"Betriebsdaten I",null,null,null,null,null,null,null,null,null,null,null,null,null,null,null,"Hier geht’s zur Hilfe"]
[null,"Projektnummer",{"$f":"IF(Titelblatt!D6=\"\",\"\",Titelblatt!D6)","v":""},null,null,"Betriebsjahr",{"$f":"IF(Titelblatt!D8=\"\",YEAR(TODAY()),Titelblatt!D8)","v":2022},null,null,null,"Anfangsmonat",{"$f":"IF(Titelblatt!D10=\"\",1,Titelblatt!D10)","v":1}]
[null,null,null,null,"Erzeugte Wärmemenge je Monat",null,null,null,null,null,null,null,null,null,null,null,null,null,null,"Check XML"]
[null,"Biomassekessel ","Komponenten-Nr. aus QM-Datenbank","Einheit",{"$f":"DATE($G$3,$L$3,1)","v":"2022-01-01"},{"$f":"IF($L$3+1>12,DATE($G$3+1,$L$3+1-12,1),DATE($G$3,$L$3+1,1))","v":"2022-02-01"},{"$f":"IF($L$3+2>12,DATE($G$3+1,$L$3+2-12,1),DATE($G$3,$L$3+2,1))","v":"2022-03-01"},{"$f":"IF($L$3+3>12,DATE($G$3+1,$L$3+3-12,1),DATE($G$3,$L$3+3,1))","v":"2022-04-01"},{"$f":"IF($L$3+4>12,DATE($G$3+1,$L$3+4-12,1),DATE($G$3,$L$3+4,1))","v":"2022-05-01"},{"$f":"IF($L$3+5>12,DATE($G$3+1,$L$3+5-12,1),DATE($G$3,$L$3+5,1))","v":"2022-06-01"},{"$f":"IF($L$3+6>12,DATE($G$3+1,$L$3+6-12,1),DATE($G$3,$L$3+6,1))","v":"2022-07-01"},{"$f":"IF($L$3+7>12,DATE($G$3+1,$L$3+7-12,1),DATE($G$3,$L$3+7,1))","v":"2022-08-01"},{"$f":"IF($L$3+8>12,DATE($G$3+1,$L$3+8-12,1),DATE($G$3,$L$3+8,1))","v":"2022-09-01"},{"$f":"IF($L$3+9>12,DATE($G$3+1,$L$3+9-12,1),DATE($G$3,$L$3+9,1))","v":"2022-10-01"},{"$f":"IF($L$3+10>12,DATE($G$3+1,$L$3+10-12,1),DATE($G$3,$L$3+10,1))","v":"2022-11-01"},{"$f":"IF($L$3+11>12,DATE($G$3+1,$L$3+11-12,1),DATE($G$3,$L$3+11,1))","v":"2022-12-01"},"Jahr","Prüfung der Monatssumme","Anzahl Eingabewerte",{"$f":"SUM(T7:T19)","v":0}]
[null,"Bezeichnung",null,null,null,null,null,null,null,null,null,null,null,null,null,null,null,{"$f":"\"(Toleranz +/- \" & Hilfstabelle!Q12*100 & \"%)\"","v":"(Toleranz +/- 3%)"}]
[null,null,null,"kWh",null,null,null,null,null,null,null,null,null,null,null,null,null,{"$f":"IF(S7=0,\"\",IF(S7<13,\"Unvollständige Eingabe\",IF(SUM(E7:P7)=0,\"keine Monatswerte vorhanden, Erstellung xml-Datei möglich\",IF(AND(SUM(E7:P7)>WM_BM_1Jahr*(1-Toleranz),SUM(E7:P7)<WM_BM_1Jahr*(1+Toleranz)), \"ok\",\"Summe Monatswerte ist nicht gleich wie der Jahreswert\"))))","v":""},{"$f":"COUNT(E7:Q7)","v":0},{"$f":"IF(OR(R7=\"ok\",SUM(E7:P7)=0),0,1)","v":0}]
[null,null,null,"kWh",null,null,null,null,null,null,null,null,null,null,null,null,null,{"$f":"IF(S8=0,\"\",IF(S8<13,\"Unvollständige Eingabe\",IF(SUM(E8:P8)=0,\"keine Monatswerte vorhanden, Erstellung xml-Datei möglich\",IF(AND(SUM(E8:P8)>WM_BM_2Jahr*(1-Toleranz),SUM(E8:P8)<WM_BM_2Jahr*(1+Toleranz)), \"ok\",\"Summe Monatswerte ist nicht gleich wie der Jahreswert\"))))","v":""},{"$f":"COUNT(E8:Q8)","v":0},{"$f":"IF(OR(R8=\"ok\",SUM(E8:P8)=0),0,1)","v":0}]
[null,null,null,"kWh",null,null,null,null,null,null,null,null,null,null,null,null,null,{"$f":"IF(S9=0,\"\",IF(S9<13,\"Unvollständige Eingabe\",IF(SUM(E9:P9)=0,\"keine Monatswerte vorhanden, Erstellung xml-Datei möglich\",IF(AND(SUM(E9:P9)>WM_BM_3Jahr*(1-Toleranz),SUM(E9:P9)<WM_BM_3Jahr*(1+Toleranz)), \"ok\",\"Summe Monatswerte ist nicht gleich wie der Jahreswert\"))))","v":""},0,{"$f":"IF(OR(R9=\"ok\",SUM(E9:P9)=0),0,1)","v":0}]
[]
[null,"Weitere Wärmeerzeuger\n(Öl-/Gas-/Biomassekessel, Kondensation, Solar,\nexterne Einspeiser, ...)","Komponenten-Nr. aus QM-Datenbank","Einheit",{"$f":"DATE($G$3,$L$3,1)","v":"2022-01-01"},{"$f":"IF($L$3+1>12,DATE($G$3+1,$L$3+1-12,1),DATE($G$3,$L$3+1,1))","v":"2022-02-01"},{"$f":"IF($L$3+2>12,DATE($G$3+1,$L$3+2-12,1),DATE($G$3,$L$3+2,1))","v":"2022-03-01"},{"$f":"IF($L$3+3>12,DATE($G$3+1,$L$3+3-12,1),DATE($G$3,$L$3+3,1))","v":"2022-04-01"},{"$f":"IF($L$3+4>12,DATE($G$3+1,$L$3+4-12,1),DATE($G$3,$L$3+4,1))","v":"2022-05-01"},{"$f":"IF($L$3+5>12,DATE($G$3+1,$L$3+5-12,1),DATE($G$3,$L$3+5,1))","v":"2022-06-01"},{"$f":"IF($L$3+6>12,DATE($G$3+1,$L$3+6-12,1),DATE($G$3,$L$3+6,1))","v":"2022-07-01"},{"$f":"IF($L$3+7>12,DATE($G$3+1,$L$3+7-12,1),DATE($G$3,$L$3+7,1))","v":"2022-08-01"},{"$f":"IF($L$3+8>12,DATE($G$3+1,$L$3+8-12,1),DATE($G$3,$L$3+8,1))","v":"2022-09-01"},{"$f":"IF($L$3+9>12,DATE($G$3+1,$L$3+9-12,1),DATE($G$3,$L$3+9,1))","v":"2022-10-01"},{"$f":"IF($L$3+10>12,DATE($G$3+1,$L$3+10-12,1),DATE($G$3,$L$3+10,1))","v":"2022-11-01"},{"$f":"IF($L$3+11>12,DATE($G$3+1,$L$3+11-12,1),DATE($G$3,$L$3+11,1))","v":"2022-12-01"},"Jahr","Prüfung der Monatssumme"]
[null,"Bezeichnung",null,null,null,null,null,null,null,null,null,null,null,null,null,null,null,{"$f":"\"(Toleranz +/- \" & Hilfstabelle!Q12*100 & \"%)\"","v":"(Toleranz +/- 3%)"}]
[null,null,null,"kWh",null,null,null,null,null,null,null,null,null,null,null,null,null,{"$f":"IF(S13=0,\"\",IF(S13<13,\"Unvollständige Eingabe\",IF(SUM(E13:P13)=0,\"keine Monatswerte vorhanden, Erstellung xml-Datei möglich\",IF(AND(SUM(E13:P13)>WM_Sonstige_1Jahr*(1-Toleranz),SUM(E13:P13)<WM_Sonstige_1Jahr*(1+Toleranz)), \"ok\",\"Summe Monatswerte ist nicht gleich wie der Jahreswert\"))))","v":""},0,{"$f":"IF(OR(R13=\"ok\",SUM(E13:P13)=0),0,1)","v":0}]
[null,null,null,"kWh",null,null,null,null,null,null,null,null,null,null,null,null,null,{"$f":"IF(S14=0,\"\",IF(S14<13,\"Unvollständige Eingabe\",IF(SUM(E14:P14)=0,\"keine Monatswerte vorhanden, Erstellung xml-Datei möglich\",IF(AND(SUM(E14:P14)>WM_Sonstige_2Jahr*(1-Toleranz),SUM(E14:P14)<WM_Sonstige_2Jahr*(1+Toleranz)), \"ok\",\"Summe Monatswerte ist nicht gleich wie der Jahreswert\"))))","v":""},0,0]
[null,null,null,"kWh",null,null,null,null,null,null,null,null,null,null,null,null,null,{"$f":"IF(S15=0,\"\",IF(S15<13,\"Unvollständige Eingabe\",IF(SUM(E15:P15)=0,\"keine Monatswerte vorhanden, Erstellung xml-Datei möglich\",IF(AND(SUM(E15:P15)>WM_Sonstige_3Jahr*(1-Toleranz),SUM(E15:P15)<WM_Sonstige_3Jahr*(1+Toleranz)), \"ok\",\"Summe Monatswerte ist nicht gleich wie der Jahreswert\"))))","v":""},0,0]
[null,null,null,"kWh",null,null,null,null,null,null,null,null,null,null,null,null,null,{"$f":"IF(S16=0,\"\",IF(S16<13,\"Unvollständige Eingabe\",IF(SUM(E16:P16)=0,\"keine Monatswerte vorhanden, Erstellung xml-Datei möglich\",IF(AND(SUM(E16:P16)>WM_Sonstige_4Jahr*(1-Toleranz),SUM(E16:P16)<WM_Sonstige_4Jahr*(1+Toleranz)), \"ok\",\"Summe Monatswerte ist nicht gleich wie der Jahreswert\"))))","v":""},0,0]
[null,null,null,"kWh",null,null,null,null,null,null,null,null,null,null,null,null,null,{"$f":"IF(S17=0,\"\",IF(S17<13,\"Unvollständige Eingabe\",IF(SUM(E17:P17)=0,\"keine Monatswerte vorhanden, Erstellung xml-Datei möglich\",IF(AND(SUM(E17:P17)>WM_Sonstige_5Jahr*(1-Toleranz),SUM(E17:P17)<WM_Sonstige_5Jahr*(1+Toleranz)), \"ok\",\"Summe Monatswerte ist nicht gleich wie der Jahreswert\"))))","v":""},0,0]
[null,null,null,"kWh",null,null,null,null,null,null,null,null,null,null,null,null,null,{"$f":"IF(S18=0,\"\",IF(S18<13,\"Unvollständige Eingabe\",IF(SUM(E18:P18)=0,\"keine Monatswerte vorhanden, Erstellung xml-Datei möglich\",IF(AND(SUM(E18:P18)>WM_Sonstige_6Jahr*(1-Toleranz),SUM(E18:P18)<WM_Sonstige_6Jahr*(1+Toleranz)), \"ok\",\"Summe Monatswerte ist nicht gleich wie der Jahreswert\"))))","v":""},0,0]
[null,null,null,"kWh",null,null,null,null,null,null,null,null,null,null,null,null,null,{"$f":"IF(S19=0,\"\",IF(S19<13,\"Unvollständige Eingabe\",IF(SUM(E19:P19)=0,\"keine Monatswerte vorhanden, Erstellung xml-Datei möglich\",IF(AND(SUM(E19:P19)>WM_Sonstige_7Jahr*(1-Toleranz),SUM(E19:P19)<WM_Sonstige_7Jahr*(1+Toleranz)), \"ok\",\"Summe Monatswerte ist nicht gleich wie der Jahreswert\"))))","v":""},0,0]
[]
[null,"Emissionen entsprechend Messgutachten",null,null,"Bezugssauerstoffgehalt der Eingabewerte:",null,null,null,null," Eingabemöglichkeiten: 6, 10 oder 11 Vol% O2"]
[]
[]
[null,"Biomassekessel ",null,null,"Emissionsmessung bei \"Volllast\"",null,null,null,null,"Emissionsmessung bei \"Teilllast\""]
[null,null,null,null,"O2 gemessen",{"$f":"\"Bezugsauerstoffgehalt \"","v":"Bezugsauerstoffgehalt "},null,{"$f":" BezugO2 & \" Vol%O2 trocken\"","v":" Vol%O2 trocken"},null,"O2 gemessen",{"$f":"F25","v":"Bezugsauerstoffgehalt "},null,{"$f":"H25","v":" Vol%O2 trocken"}]
[null,"Bezeichnung","Komponenten-Nr. aus QM-Datenbank",null,null,"CO","NOx","CxHy","Staub",null,"CO","NOx","CxHy","Staub"]
[null,null,null,null,"Vol%trocken","mg/m³n","mg/m³n","mg/m³n","mg/m³n","Vol%trocken","mg/m³n","mg/m³n","mg/m³n","mg/m³n"]
[null,{"$f":"IF(B7=\"\",\"\",B7)","v":""},""]
[null,"",""]
[null,"",""]
[]
[null,null,null,null,{"$f":"\"Umrechnung auf Bezugsauerstoffgehalt \" & IF(BezugO2 =6,10,6) & \" Vol%O2 trocken\"","v":"Umrechnung auf Bezugsauerstoffgehalt 6 Vol%O2 trocken"}]
[]
[null,"Biomassekessel ",null,null,"Emissionsmessung bei \"Volllast\"",null,null,null,null,"Emissionsmessung bei \"Teilllast\""]
[null,null,null,null,"O2 gemessen",{"$f":"\"Bezugsauerstoffgehalt \"","v":"Bezugsauerstoffgehalt "},null,{"$f":" IF(ISBLANK(BezugO2),\"\",IF(BezugO2 =6,10,6) & \" Vol%O2 trocken\")","v":""},null,"O2 gemessen",{"$f":"F35","v":"Bezugsauerstoffgehalt "},null,{"$f":"H35","v":""}]
[null,"Bezeichnung","Komponenten-Nr. aus QM-Datenbank",null,null,"CO","NOx","CxHy","Staub",null,"CO","NOx","CxHy","Staub"]
[null,null,null,null,"Vol%trocken","mg/m³n","mg/m³n","mg/m³n","mg/m³n","Vol%trocken","mg/m³n","mg/m³n","mg/m³n","mg/m³n"]
[null,{"$f":"IF(B28=\"\",\"\",B28)","v":""},{"$f":"C28","v":""},null,{"$f":"E28","v":0},{"$f":"F28*(21-IF(BezugO2 =6,10,6))/(21-BezugO2)","v":0},0,0,0,{"$f":"J28","v":0},{"$f":"K28*(21-IF(BezugO2 =6,10,6))/(21-BezugO2)","v":0},0,0,0]
[null,{"$f":"IF(B29=\"\",\"\",B29)","v":""},"",null,{"$f":"E29","v":0},0,0,0,0,{"$f":"J29","v":0},0,0,0,0]
[null,{"$f":"IF(B30=\"\",\"\",B30)","v":""},"",null,{"$f":"E30","v":0},0,0,0,0,{"$f":"J30","v":0},0,0,0,0]
[null,"Anmerkungen zur Wärmeerzeugung:"]
[]
[]
[]
[]
[]
[]
[]
[]
[]
[]
[]
[]
[]
[]
[]
[]
[]
[]
[]
[]
[]
[]
[]
[null,"Nur für Umrechnung auf 13% Bezugsauerstoff und Übertragung auf Sheet DatenTransformierung"]
[null,"Biomassekessel ",null,null,"Emissionsmessung bei \"Volllast\"",null,null,null,null,"Emissionsmessung bei \"Teilllast\""]
[null,null,null,null,"O2 gemessen","Bezugsauerstoffgehalt ",null,"13 Vol%O2 trocken",null,"O2 gemessen","Bezugsauerstoffgehalt ",null,"13 Vol%O2 trocken"]
[null,"Bezeichnung","Nr.",null,null,"CO","NOx","CxHy","Staub",null,"CO","NOx","CxHy","Staub"]
[null,null,null,null,"[Vol%trocken]","[mg/m³n]","[mg/m³n]","[mg/m³n]","[mg/m³n]","[Vol%trocken]","[mg/m³n]","[mg/m³n]","[mg/m³n]","[mg/m³n]"]
[null,0,{"$f":"EM_KmpNr_1","v":""},null,{"$f":"EM_Voll_1","v":0},{"$f":"ROUND(F28*(21-13)/(21-BezugO2),2)","v":0},0,0,0,{"$f":"EM_Teil_1","v":0},{"$f":"ROUND(K28*(21-13)/(21-BezugO2),2)","v":0},0,0,0]
[null,0,{"$f":"EM_KmpNr_2","v":""},null,{"$f":"EM_Voll_2","v":0},0,0,0,0,{"$f":"EM_Teil_2","v":0},0,0,0,0]
[null,0,{"$f":"EM_KmpNr_3","v":""},null,{"$f":"EM_Voll_3","v":0},0,0,0,0,{"$f":"EM_Teil_3","v":0},0,0,0,0]

{"sheet":"Betriebsdaten II","index":2,"n_rows":63,"n_cols":23,"rows_kept":63,"cut":false,"hidden":false,"merged":[[3,11,3,12],[27,1,27,2],[37,1,37,16],[43,1,43,2],[44,1,44,2],[42,1,42,2],[40,1,40,2],[12,1,12,16],[13,12,14,12],[29,1,29,2],[30,1,30,2],[13,7,14,7],[26,1,26,2],[13,10,14,10],[20,1,20,2],[22,1,22,16],[24,1,24,2],[25,1,25,2],[23,1,23,2],[24,6,30,15],[28,1,28,2],[45,1,45,2],[48,1,51,16],[38,1,38,4],[46,1,46,16],[39,1,39,2],[41,1,41,2],[21,1,21,2],[13,15,14,15],[13,16,14,16],[13,6,14,6],[13,1,13,2],[13,4,14,4],[13,9,14,9],[13,5,14,5],[13,11,14,11],[18,1,18,2],[19,1,19,2],[7,1,7,2],[5,1,5,2],[5,6,6,6],[5,12,6,12],[5,4,6,4],[5,5,6,5],[3,6,3,7],[5,11,6,11],[5,7,6,7],[33,1,33,16],[5,16,6,16],[3,1,3,2],[5,9,6,9],[5,10,6,10],[8,1,8,2],[5,8,6,8],[13,13,14,13],[10,1,11,2],[5,13,6,13],[5,14,6,14],[5,15,6,15],[9,1,9,2],[53,1,53,3],[57,1,57,2],[58,1,58,2],[57,3,57,6],[58,3,58,6],[53,4,53,6],[54,4,56,15],[57,8,57,9],[57,10,57,11],[57,13,57,14],[5,18,6,19],[60,4,60,6],[60,7,60,15],[61,4,61,15],[62,4,62,15],[58,8,58,9],[58,10,58,11],[58,13,58,14],[53,7,53,15],[36,4,36,5],[34,4,34,5],[13,14,14,14],[13,8,14,8],[59,1,59,16],[35,4,35,5],[31,1,31,16],[27,17,27,19],[28,17,28,19],[7,18,10,19],[11,18,11,19],[23,17,23,19],[24,17,24,19],[15,18,19,19],[13,18,13,19],[14,18,14,19],[12,17,12,19]]}
[null,null,null,null,null,null,null,null,null,null,null,null,null,null,null,null,null,"gelbe Felder sind Eingabefelder!"]
[null,"Erfassung der Betriebsdaten II",null,null,null,null,null,null,null,null,null,null,null,null,null,null,null,"Hier geht’s zur Hilfe"]
[]
[null,"Projektnummer",null,{"$f":"IF('Betriebsdaten I'!C3=\"\",\"\",'Betriebsdaten I'!C3)","v":""},null,"Betriebsjahr",{"$f":"IF('Betriebsdaten I'!G3=\"\",\"\",'Betriebsdaten I'!G3)","v":2022},null,null,null,"Anfangsmonat",{"$f":"IF('Betriebsdaten I'!L3=\"\",\"\",'Betriebsdaten I'!L3)","v":1}]
[null,null,null,null,null,null,null,null,null,null,null,null,null,null,null,null,null,null,null,null,null,"Check XML","Checksum III"]
[null,"Verteilte Wärmemengen und Volumina",null,"Monat",{"$f":"DATE($G$4,$L$4,1)","v":"2022-01-01"},{"$f":"IF($L$4+1>12,DATE($G$4+1,$L$4+1-12,1),DATE($G$4,$L$4+1,1))","v":"2022-02-01"},{"$f":"IF($L$4+2>12,DATE($G$4+1,$L$4+2-12,1),DATE($G$4,$L$4+2,1))","v":"2022-03-01"},{"$f":"IF($L$4+3>12,DATE($G$4+1,$L$4+3-12,1),DATE($G$4,$L$4+3,1))","v":"2022-04-01"},{"$f":"IF($L$4+4>12,DATE($G$4+1,$L$4+4-12,1),DATE($G$4,$L$4+4,1))","v":"2022-05-01"},{"$f":"IF($L$4+5>12,DATE($G$4+1,$L$4+5-12,1),DATE($G$4,$L$4+5,1))","v":"2022-06-01"},{"$f":"IF($L$4+6>12,DATE($G$4+1,$L$4+6-12,1),DATE($G$4,$L$4+6,1))","v":"2022-07-01"},{"$f":"IF($L$4+7>12,DATE($G$4+1,$L$4+7-12,1),DATE($G$4,$L$4+7,1))","v":"2022-08-01"},{"$f":"IF($L$4+8>12,DATE($G$4+1,$L$4+8-12,1),DATE($G$4,$L$4+8,1))","v":"2022-09-01"},{"$f":"IF($L$4+9>12,DATE($G$4+1,$L$4+9-12,1),DATE($G$4,$L$4+9,1))","v":"2022-10-01"},{"$f":"IF($L$4+10>12,DATE($G$4+1,$L$4+10-12,1),DATE($G$4,$L$4+10,1))","v":"2022-11-01"},{"$f":"IF($L$4+11>12,DATE($G$4+1,$L$4+11-12,1),DATE($G$4,$L$4+11,1))","v":"2022-12-01"},"Jahr","Prüfung der Monatssumme","Eingespeiste Wärmemenge in das Netz darf nicht kleiner sein als die Wärmemenge der Abnehmer am Netz",null,"Anzahl Eingabewerte",{"$f":"SUM(V8:V29)","v":2},{"$f":"SUM(W7:W26)","v":2}]
[null,null,null,"Einheit",null,null,null,null,null,null,null,null,null,null,null,null,null,{"$f":"\"(Toleranz +/- \" & Hilfstabelle!Q12*100 & \"%)\"","v":"(Toleranz +/- 3%)"}]
[null,"Eingesp. Wärmemenge in das Netz",null,"kWh",null,null,null,null,null,null,null,null,null,null,null,null,null,{"$f":"IF(U8=0,\"\",IF(U8<13,\"Unvollständige Eingabe\",IF(SUM(E8:P8)=0,\"keine Monatswerte vorhanden, Erstellung xml-Datei möglich\",IF(AND(SUM(E8:P8)>EingespeisteWaermemengeJahr*(1-Toleranz),SUM(E8:P8)<EingespeisteWaermemengeJahr*(1+Toleranz)), \"ok\",\"Summe Monatswerte ist nicht gleich wie der Jahreswert\"))))","v":""},{"$f":"IF(OR(ISBLANK(Q8),ISBLANK(Q10)),\"\",IF(Q10<Q8,\"ok\",\"Netzeinspeisung ist kleiner als Verbrauch der Abnehmer am Netz\"))","v":""},null,{"$f":"COUNT(E8:Q8)","v":0},{"$f":"IF(OR(R8=\"ok\",SUM(E8:P8)=0),0,1)","v":0},{"$f":"IF(S8=\"ok\",0,1)","v":1}]
[null,"Volumen Netz gefördert",null,"m³",null,null,null,null,null,null,null,null,null,null,null,null,null,{"$f":"IF(U9=0,\"\",IF(U9<13,\"Unvollständige Eingabe\",IF(SUM(E9:P9)=0,\"keine Monatswerte vorhanden, Erstellung xml-Datei möglich\",IF(AND(SUM(E9:P9)>VolumenNetzJahr*(1-Toleranz),SUM(E9:P9)<VolumenNetzJahr*(1+Toleranz)), \"ok\",\"Summe Monatswerte ist nicht gleich wie der Jahreswert\"))))","v":""},null,null,{"$f":"COUNT(E9:Q9)","v":0},{"$f":"IF(OR(R9=\"ok\",SUM(E9:P9)=0),0,1)","v":0}]
[null,"S Wärmem. d. Abnehmer am Netz",null,"kWh",null,null,null,null,null,null,null,null,null,null,null,null,null,{"$f":"IF(U10=0,\"\",IF(U10<13,\"Unvollständige Eingabe\",IF(SUM(E10:P10)=0,\"keine Monatswerte vorhanden, Erstellung xml-Datei möglich\",IF(AND(SUM(E10:P10)>WM_AbnehmerNetzJahr*(1-Toleranz),SUM(E10:P10)<WM_AbnehmerNetzJahr*(1+Toleranz)), \"ok\",\"Summe Monatswerte ist nicht gleich wie der Jahreswert\"))))","v":""},null,null,0,0]
[null,"S Wärmem. sonstige Abnehmer am drucklosen Verteiler",null,"kWh",null,null,null,null,null,null,null,null,null,null,null,null,null,{"$f":"IF(U11=0,\"\",IF(U11<13,\"Unvollständige Eingabe\",IF(AND(SUM(E11:P11)>=Wm_SonstigeAbnehmerJahr*(1-Toleranz),SUM(E11:P11)<=Wm_SonstigeAbnehmerJahr*(1+Toleranz)),\"ok\",\"Summe Monatswerte ist nicht gleich wie der Jahreswert\")))","v":""},null,null,0,0]
[]
[]
[null,"Betrieblicher Stromverbrauch",null,"Monat",{"$f":"DATE($G$4,$L$4,1)","v":"2022-01-01"},{"$f":"IF($L$4+1>12,DATE($G$4+1,$L$4+1-12,1),DATE($G$4,$L$4+1,1))","v":"2022-02-01"},{"$f":"IF($L$4+2>12,DATE($G$4+1,$L$4+2-12,1),DATE($G$4,$L$4+2,1))","v":"2022-03-01"},{"$f":"IF($L$4+3>12,DATE($G$4+1,$L$4+3-12,1),DATE($G$4,$L$4+3,1))","v":"2022-04-01"},{"$f":"IF($L$4+4>12,DATE($G$4+1,$L$4+4-12,1),DATE($G$4,$L$4+4,1))","v":"2022-05-01"},{"$f":"IF($L$4+5>12,DATE($G$4+1,$L$4+5-12,1),DATE($G$4,$L$4+5,1))","v":"2022-06-01"},{"$f":"IF($L$4+6>12,DATE($G$4+1,$L$4+6-12,1),DATE($G$4,$L$4+6,1))","v":"2022-07-01"},{"$f":"IF($L$4+7>12,DATE($G$4+1,$L$4+7-12,1),DATE($G$4,$L$4+7,1))","v":"2022-08-01"},{"$f":"IF($L$4+8>12,DATE($G$4+1,$L$4+8-12,1),DATE($G$4,$L$4+8,1))","v":"2022-09-01"},{"$f":"IF($L$4+9>12,DATE($G$4+1,$L$4+9-12,1),DATE($G$4,$L$4+9,1))","v":"2022-10-01"},{"$f":"IF($L$4+10>12,DATE($G$4+1,$L$4+10-12,1),DATE($G$4,$L$4+10,1))","v":"2022-11-01"},{"$f":"IF($L$4+11>12,DATE($G$4+1,$L$4+11-12,1),DATE($G$4,$L$4+11,1))","v":"2022-12-01"},"Jahr","Prüfung der Monatssumme","Vergleich Einzelkomponenten mit Gesamtstromverbrauch"]
[null,null,"Komp.Nr.","Einheit",null,null,null,null,null,null,null,null,null,null,null,null,null,{"$f":"\"(Toleranz +/- \" & Hilfstabelle!Q12*100 & \"%)\"","v":"(Toleranz +/- 3%)"},{"$f":"\"(Toleranz - \" & Hilfstabelle!Q12*100 & \"%)\"","v":"(Toleranz - 3%)"}]
[null,"Biomassekessel 1",{"$f":"IF('Betriebsdaten I'!C7=\"\",\"\",'Betriebsdaten I'!C7)","v":""},"kWh",null,null,null,null,null,null,null,null,null,null,null,null,null,{"$f":"IF(U16=0,\"\",IF(U16<13,\"Unvollständige Eingabe\",IF(SUM(E16:P16)=0,\"keine Monatswerte vorhanden, Erstellung xml-Datei möglich\",IF(AND(SUM(E16:P16)>Strom1Jahr*(1-Toleranz),SUM(E16:P16)<Strom1Jahr*(1+Toleranz)), \"ok\",\"Summe Monatswerte ist nicht gleich wie der Jahreswert\"))))","v":""},{"$f":"IF(ISBLANK(Q22),\"\",IF(SUM(Q16:Q21)>Q22*(1+Hilfstabelle!Q12),\"Gesamtstromverbrauch ist niedriger als die Summe des Stromverbrauches der Einzelkomponenten\",\"ok\"))","v":""},null,{"$f":"COUNT(E16:Q16)","v":0},{"$f":"IF(OR(R16=\"ok\",SUM(E16:P16)=0),0,1)","v":0},{"$f":"IF(S16=\"ok\",0,1)","v":1}]
[null,"Biomassekessel 2",{"$f":"IF('Betriebsdaten I'!C8=\"\",\"\",'Betriebsdaten I'!C8)","v":""},"kWh",null,null,null,null,null,null,null,null,null,null,null,null,null,{"$f":"IF(U17=0,\"\",IF(U17<13,\"Unvollständige Eingabe\",IF(SUM(E17:P17)=0,\"keine Monatswerte vorhanden, Erstellung xml-Datei möglich\",IF(AND(SUM(E17:P17)>Strom2Jahr*(1-Toleranz),SUM(E17:P17)<Strom2Jahr*(1+Toleranz)), \"ok\",\"Summe Monatswerte ist nicht gleich wie der Jahreswert\"))))","v":""},null,null,{"$f":"COUNT(E17:Q17)","v":0},0]
[null,"Biomassekessel 3",{"$f":"IF('Betriebsdaten I'!C9=\"\",\"\",'Betriebsdaten I'!C9)","v":""},"kWh",null,null,null,null,null,null,null,null,null,null,null,null,null,{"$f":"IF(U18=0,\"\",IF(U18<13,\"Unvollständige Eingabe\",IF(SUM(E18:P18)=0,\"keine Monatswerte vorhanden, Erstellung xml-Datei möglich\",IF(AND(SUM(E18:P18)>Strom3Jahr*(1-Toleranz),SUM(E18:P18)<Strom3Jahr*(1+Toleranz)), \"ok\",\"Summe Monatswerte ist nicht gleich wie der Jahreswert\"))))","v":""},null,null,0,0]
[null,"Netzpumpe(n)",null,"kWh",null,null,null,null,null,null,null,null,null,null,null,null,null,{"$f":"IF(U19=0,\"\",IF(U19<13,\"Unvollständige Eingabe\",IF(SUM(E19:P19)=0,\"keine Monatswerte vorhanden, Erstellung xml-Datei möglich\",IF(AND(SUM(E19:P19)>Strom5Jahr*(1-Toleranz),SUM(E19:P19)<Strom5Jahr*(1+Toleranz)), \"ok\",\"Summe Monatswerte ist nicht gleich wie der Jahreswert\"))))","v":""},null,null,0,0]
[null,"E-Filter",null,"kWh",null,null,null,null,null,null,null,null,null,null,null,null,null,{"$f":"IF(U20=0,\"\",IF(U20<13,\"Unvollständige Eingabe\",IF(SUM(E20:P20)=0,\"keine Monatswerte vorhanden, Erstellung xml-Datei möglich\",IF(AND(SUM(E20:P20)>Strom6Jahr*(1-Toleranz),SUM(E20:P20)<Strom6Jahr*(1+Toleranz)), \"ok\",\"Summe Monatswerte ist nicht gleich wie der Jahreswert\"))))","v":""},null,null,0,0]
[null,"Sonstige",null,"kWh",null,null,null,null,null,null,null,null,null,null,null,null,null,{"$f":"IF(U21=0,\"\",IF(U21<13,\"Unvollständige Eingabe\",IF(SUM(E21:P21)=0,\"keine Monatswerte vorhanden, Erstellung xml-Datei möglich\",IF(AND(SUM(E21:P21)>Strom7Jahr*(1-Toleranz),SUM(E21:P21)<Strom7Jahr*(1+Toleranz)), \"ok\",\"Summe Monatswerte ist nicht gleich wie der Jahreswert\"))))","v":""},"Summe Komponenten [kWh/a]",{"$f":"SUM(Q16:Q21)","v":0},0,0]
[null,"Gesamtanlage",null,"kWh",null,null,null,null,null,null,null,null,null,null,null,null,null,{"$f":"IF(U22=0,\"\",IF(U22<13,\"Unvollständige Eingabe\",IF(SUM(E22:P22)=0,\"keine Monatswerte vorhanden, Erstellung xml-Datei möglich\",IF(AND(SUM(E22:P22)>Strom8Jahr*(1-Toleranz),SUM(E22:P22)<Strom8Jahr*(1+Toleranz)), \"ok\",\"Summe Monatswerte ist nicht gleich wie der Jahreswert\"))))","v":""},"Gesamtanlage [kWh/a]",{"$f":"Q22","v":0},0,0]
[]
[null,"Brennstoffeinsatz",null,"Einheit","Menge","Preis \n€/Einheit","Anmerkung zum Brennstoffeinsatz:",null,null,null,null,null,null,null,null,null,null,{"$f":"\"Wärmemengen der Abnehmer am Netz (+ sonstige Abnehmer am drucklosen Verteiler) muss gleich sein wie die Summe der Abnehmerverbräuche   (Toleranz +/- \" & Hilfstabelle!Q12*100 & \"%)\"","v":"Wärmemengen der Abnehmer am Netz (+ sonstige Abnehmer am drucklosen Verteiler) muss gleich sein wie die Summe der Abnehmerverbräuche   (Toleranz +/- 3%)"}]
[null,null,null,null,null,null,null,null,null,null,null,null,null,null,null,null,null,{"$f":"IF(ISBLANK(WM_AbnehmerNetzJahr),\"\",IF(T26=0,\"keine Abnehmerverbräuche vorhanden!\",IF(AND(T27*(1+Toleranz)>T26,T27*(1-Toleranz)<T26),\"ok\",\"Summe der Abnehmerverbräuche ist nicht gleich Abnehmer am Netz (+ druckloser Verteiler)\")))","v":""},null,null,null,{"$f":"IF(R25=\"ok\",0,1)","v":1}]
[null,null,null,null,null,null,null,null,null,null,null,null,null,null,null,null,null,"Abnehmerverbräuche: Summe der Abnehmerverbräuche [kWh/a]",null,{"$f":"SUM(Abnehmerverbräuche!C10:C1210)","v":0}]
[null,null,null,null,null,null,null,null,null,null,null,null,null,null,null,null,null,{"$f":"\"Betriebsdaten II: Abnehmer am Netz \" & IF(ISBLANK(Q10),0,Q10) & \" kWh + \" & \"druckloser Verteiler \" & IF(ISBLANK(Q11),0,Q11) & \" kWh\"","v":"Betriebsdaten II: Abnehmer am Netz 0 kWh + druckloser Verteiler 0 kWh"},null,{"$f":"Q10+Q11","v":0}]
[null,null,null,null,null,null,null,null,null,null,null,null,null,null,null,null,null,{"$f":"\"Summe der Erzeugung muss größer sein als Netzeinspeisung (+ druckloser Verteiler)   (Toleranz - \" & Hilfstabelle!Q12*100 & \"%)\"","v":"Summe der Erzeugung muss größer sein als Netzeinspeisung (+ druckloser Verteiler)   (Toleranz - 3%)"}]
[null,null,null,null,null,null,null,null,null,null,null,null,null,null,null,null,null,{"$f":"IF(ISBLANK(Q8),\"\",IF(T30>T31,\"ok\",\"Summe Erzeugung ist kleiner als Netzeinspeisung (+ druckloser Verteiler)\"))","v":""},null,null,null,{"$f":"IF(R29=\"ok\",0,1)","v":1}]
[null,null,null,null,null,null,null,null,null,null,null,null,null,null,null,null,null,"Betriebsdaten I: Summe Wärmeerzeugung [kWh/a]",null,{"$f":"SUM('Betriebsdaten I'!Q7:Q9)+SUM('Betriebsdaten I'!Q13:Q19)","v":0}]
[null,null,null,null,null,null,null,null,null,null,null,null,null,null,null,null,null,{"$f":"\"Betriebsdaten II: Netzeinspeisung \" & IF(ISBLANK(Q8),0,Q8) & \" kWh + \" & \"druckloser Verteiler \" & IF(ISBLANK(Q11),0,Q11) & \" kWh\"","v":"Betriebsdaten II: Netzeinspeisung 0 kWh + druckloser Verteiler 0 kWh"},null,{"$f":"Q8+Q11","v":0}]
[]
[]
[]
[null,"Reststoffe",null,null,"Jahresmenge"]
[null,"Asche",null,"kg/a"]
[null,"Kondensatschlamm",null,"m³/a"]
[]
[null,"Ergebnis der Wärmeträgeranalyse nach ÖNORM H5195-1"]
[null,"pH-Wert",null,"-"]
[null,"Härtegrad",null,"°dH"]
[null,"Chloride",null,"mg/ltr."]
[null,"Eisen",null,"mg/ltr."]
[null,"Kupfer",null,"mg/ltr."]
[null,"Aluminium",null,"mg/ltr."]
[null,"Ammonium",null,"mg/ltr."]
[]
[null,"Allgemeine Anmerkungen zu den Messergebnissen:"]
[]
[]
[]
[]
[]
[null,"Wärmeverkauf - Typischer Kleinkunde < 25 kW",null,null,"Anmerkung Wärmeverkauf"]
[null,"Grundpreis","€/a"]
[null,"Messpreis","€/a"]
[null,"Arbeitspreis","€/MWh"]
[null,"Bezeichnung Preisindex 1:",null,null,null,null,null,"Basisjahr",null,null,"Gewichtung",null," %"]
[null,"Bezeichnung Preisindex 2:",null,null,null,null,null,"Basisjahr",null,null,"Gewichtung",null," %"]
[]
[null,"Personalkosten / Aufwand",null,null,"Anmerkung Personalkosten"]
[null,"Heizwerkbetreuung","€/a"]
[null,"Verwaltung","€/a"]

{"sheet":"KWK","index":3,"n_rows":72,"n_cols":20,"rows_kept":72,"cut":false,"hidden":true,"merged":[[54,2,54,3],[55,2,55,3],[56,2,56,3],[50,14,56,16],[51,4,52,4],[51,5,51,6],[51,7,51,8],[51,9,52,9],[51,10,51,11],[51,12,51,13],[50,2,51,3],[50,4,50,8],[50,9,50,13],[52,1,53,1],[52,2,53,3],[48,4,48,13],[50,1,51,1],[42,1,43,1],[42,2,43,3],[44,2,44,3],[45,2,45,3],[46,2,46,3],[41,4,42,4],[41,5,41,6],[41,7,41,8],[41,9,42,9],[41,10,41,11],[37,4,39,7],[33,1,36,16],[40,1,41,1],[40,2,41,3],[40,4,40,8],[37,9,39,13],[37,8,39,8],[37,1,39,3],[0,4,0,6],[1,4,1,6],[40,9,40,13],[32,3,32,16],[28,1,28,16],[3,6,3,7],[12,1,12,16],[14,1,14,2],[14,4,15,4],[40,14,46,16],[14,5,15,5],[14,6,15,6],[14,13,15,13],[14,14,15,14],[14,8,15,8],[14,9,15,9],[18,1,18,2],[22,5,23,5],[22,6,23,6],[5,8,5,16],[13,8,13,16],[6,8,7,8],[14,12,15,12],[14,7,15,7],[6,9,7,9],[6,10,7,10],[6,16,7,16],[22,8,23,8],[22,12,23,12],[22,13,23,13],[22,10,23,10],[3,1,3,2],[10,1,10,2],[8,1,8,2],[6,5,7,5],[5,1,5,2],[6,4,7,4],[5,6,5,7],[6,6,7,6],[6,7,7,7],[6,1,6,2],[9,1,9,2],[5,4,5,5],[3,11,3,12],[22,1,22,2],[22,4,23,4],[20,1,20,16],[21,1,21,2],[21,4,21,5],[21,6,21,7],[21,8,21,16],[6,11,7,11],[6,12,7,12],[14,15,15,15],[14,10,15,10],[14,11,15,11],[13,1,13,2],[13,4,13,5],[13,6,13,7],[14,16,15,16],[16,1,16,2],[17,1,17,2],[22,14,23,14],[22,7,23,7],[6,13,7,13],[6,14,7,14],[6,15,7,15],[26,1,26,2],[22,9,23,9],[22,15,23,15],[22,16,23,16],[65,1,66,1],[65,2,66,3],[65,4,65,8],[65,9,65,13],[65,14,71,16],[66,4,67,4],[66,5,66,6],[66,7,66,8],[66,9,67,9],[66,10,66,11],[66,12,66,13],[67,1,68,1],[67,2,68,3],[69,2,69,3],[70,2,70,3],[71,2,71,3],[25,1,25,2],[24,1,24,2],[22,11,23,11],[41,12,41,13]]}
[null,null,null,null,"gelbe Felder sind Eingabefelder!"]
[null,"Betriebsdaten für KWK-Module",null,null,"Hier geht’s zur Hilfe"]
[]
[null,"Projektnummer",null,{"$f":"IF('Betriebsdaten I'!C3=\"\",\"\",'Betriebsdaten I'!C3)","v":""},null,"Betriebsjahr",{"$f":"IF('Betriebsdaten I'!G3=\"\",\"\",'Betriebsdaten I'!G3)","v":2022},null,null,null,"Anfangsmonat",{"$f":"IF('Betriebsdaten I'!L3=\"\",\"\",'Betriebsdaten I'!L3)","v":1}]
[]
[null,"KWK - Anlage #1 ",null,"Komp. Nr.",null,null,"Bezeichnung:",null,null,null,null,null,null,null,null,null,null,null,null,"Check XML"]
[null,null,null,"Monat",{"$f":"DATE($G$4,$L$4,1)","v":"2022-01-01"},{"$f":"IF($L$4+1>12,DATE($G$4+1,$L$4+1-12,1),DATE($G$4,$L$4+1,1))","v":"2022-02-01"},{"$f":"IF($L$4+2>12,DATE($G$4+1,$L$4+2-12,1),DATE($G$4,$L$4+2,1))","v":"2022-03-01"},{"$f":"IF($L$4+3>12,DATE($G$4+1,$L$4+3-12,1),DATE($G$4,$L$4+3,1))","v":"2022-04-01"},{"$f":"IF($L$4+4>12,DATE($G$4+1,$L$4+4-12,1),DATE($G$4,$L$4+4,1))","v":"2022-05-01"},{"$f":"IF($L$4+5>12,DATE($G$4+1,$L$4+5-12,1),DATE($G$4,$L$4+5,1))","v":"2022-06-01"},{"$f":"IF($L$4+6>12,DATE($G$4+1,$L$4+6-12,1),DATE($G$4,$L$4+6,1))","v":"2022-07-01"},{"$f":"IF($L$4+7>12,DATE($G$4+1,$L$4+7-12,1),DATE($G$4,$L$4+7,1))","v":"2022-08-01"},{"$f":"IF($L$4+8>12,DATE($G$4+1,$L$4+8-12,1),DATE($G$4,$L$4+8,1))","v":"2022-09-01"},{"$f":"IF($L$4+9>12,DATE($G$4+1,$L$4+9-12,1),DATE($G$4,$L$4+9,1))","v":"2022-10-01"},{"$f":"IF($L$4+10>12,DATE($G$4+1,$L$4+10-12,1),DATE($G$4,$L$4+10,1))","v":"2022-11-01"},{"$f":"IF($L$4+11>12,DATE($G$4+1,$L$4+11-12,1),DATE($G$4,$L$4+11,1))","v":"2022-12-01"},"Jahr","Prüfung der Monatssumme","Anzahl Eingabewerte",{"$f":"SUM(T9:T27)","v":0}]
[null,null,null,"Einheit",null,null,null,null,null,null,null,null,null,null,null,null,null,{"$f":"\"(Toleranz +/- \" & Hilfstabelle!Q14*100 & \"%)\"","v":"(Toleranz +/- 0%)"}]
[null,"Eingesetzte Brennstoffwärme",null,"kWh",null,null,null,null,null,null,null,null,null,null,null,null,null,{"$f":"IF(S9=0,\"\",IF(S9<13,\"Unvollständige Eingabe\",IF(AND(SUM(E9:P9)>BrstWM_KWK_1Jahr*(1-Toleranz),SUM(E9:P9)<BrstWM_KWK_1Jahr*(1+Toleranz)), \"ok\",\"Summe Monatswerte ist nicht gleich wie der Jahreswert\")))","v":""},{"$f":"COUNT(E9:Q9)","v":0},{"$f":"IF(OR(R9=\"ok\",SUM(E9:P9)=0),0,1)","v":0}]
[null,"Eingespeiste Strommenge",null,"kWh",null,null,null,null,null,null,null,null,null,null,null,null,null,{"$f":"IF(S10=0,\"\",IF(S10<13,\"Unvollständige Eingabe\",IF(AND(SUM(E10:P10)>Strom_KWK_1Jahr*(1-Toleranz),SUM(E10:P10)<Strom_KWK_1Jahr*(1+Toleranz)), \"ok\",\"Summe Monatswerte ist nicht gleich wie der Jahreswert\")))","v":""},{"$f":"COUNT(E10:Q10)","v":0},{"$f":"IF(OR(R10=\"ok\",SUM(E10:P10)=0),0,1)","v":0}]
[null,"Ausgekoppelte Wärmemenge",null,"kWh",null,null,null,null,null,null,null,null,null,null,null,null,null,{"$f":"IF(S11=0,\"\",IF(S11<13,\"Unvollständige Eingabe\",IF(AND(SUM(E11:P11)>WM_KWK_1Jahr*(1-Toleranz),SUM(E11:P11)<WM_KWK_1Jahr*(1+Toleranz)), \"ok\",\"Summe Monatswerte ist nicht gleich wie der Jahreswert\")))","v":""},0,{"$f":"IF(OR(R11=\"ok\",SUM(E11:P11)=0),0,1)","v":0}]
[]
[]
[null,"KWK - Anlage #2",null,"Komp. Nr.",null,null,"Bezeichnung:"]
[null,null,null,"Monat",{"$f":"DATE($G$4,$L$4,1)","v":"2022-01-01"},{"$f":"IF($L$4+1>12,DATE($G$4+1,$L$4+1-12,1),DATE($G$4,$L$4+1,1))","v":"2022-02-01"},{"$f":"IF($L$4+2>12,DATE($G$4+1,$L$4+2-12,1),DATE($G$4,$L$4+2,1))","v":"2022-03-01"},{"$f":"IF($L$4+3>12,DATE($G$4+1,$L$4+3-12,1),DATE($G$4,$L$4+3,1))","v":"2022-04-01"},{"$f":"IF($L$4+4>12,DATE($G$4+1,$L$4+4-12,1),DATE($G$4,$L$4+4,1))","v":"2022-05-01"},{"$f":"IF($L$4+5>12,DATE($G$4+1,$L$4+5-12,1),DATE($G$4,$L$4+5,1))","v":"2022-06-01"},{"$f":"IF($L$4+6>12,DATE($G$4+1,$L$4+6-12,1),DATE($G$4,$L$4+6,1))","v":"2022-07-01"},{"$f":"IF($L$4+7>12,DATE($G$4+1,$L$4+7-12,1),DATE($G$4,$L$4+7,1))","v":"2022-08-01"},{"$f":"IF($L$4+8>12,DATE($G$4+1,$L$4+8-12,1),DATE($G$4,$L$4+8,1))","v":"2022-09-01"},{"$f":"IF($L$4+9>12,DATE($G$4+1,$L$4+9-12,1),DATE($G$4,$L$4+9,1))","v":"2022-10-01"},{"$f":"IF($L$4+10>12,DATE($G$4+1,$L$4+10-12,1),DATE($G$4,$L$4+10,1))","v":"2022-11-01"},{"$f":"IF($L$4+11>12,DATE($G$4+1,$L$4+11-12,1),DATE($G$4,$L$4+11,1))","v":"2022-12-01"},"Jahr"]
[null,null,null,"Einheit"]
[null,"Eingesetzte Brennstoffwärme",null,"kWh",null,null,null,null,null,null,null,null,null,null,null,null,null,{"$f":"IF(S17=0,\"\",IF(S17<13,\"Unvollständige Eingabe\",IF(AND(SUM(E17:P17)>BrstWM_KWK_2Jahr*(1-Toleranz),SUM(E17:P17)<BrstWM_KWK_2Jahr*(1+Toleranz)), \"ok\",\"Summe Monatswerte ist nicht gleich wie der Jahreswert\")))","v":""},0,{"$f":"IF(OR(R17=\"ok\",SUM(E17:P17)=0),0,1)","v":0}]
[null,"Eingespeiste Strommenge",null,"kWh",null,null,null,null,null,null,null,null,null,null,null,null,null,{"$f":"IF(S18=0,\"\",IF(S18<13,\"Unvollständige Eingabe\",IF(AND(SUM(E18:P18)>Strom_KWK_2Jahr*(1-Toleranz),SUM(E18:P18)<Strom_KWK_2Jahr*(1+Toleranz)), \"ok\",\"Summe Monatswerte ist nicht gleich wie der Jahreswert\")))","v":""},0,{"$f":"IF(OR(R18=\"ok\",SUM(E18:P18)=0),0,1)","v":0}]
[null,"Ausgekoppelte Wärmemenge",null,"kWh",null,null,null,null,null,null,null,null,null,null,null,null,null,{"$f":"IF(S19=0,\"\",IF(S19<13,\"Unvollständige Eingabe\",IF(AND(SUM(E19:P19)>WM_KWK_3Jahr*(1-Toleranz),SUM(E19:P19)<WM_KWK_3Jahr*(1+Toleranz)), \"ok\",\"Summe Monatswerte ist nicht gleich wie der Jahreswert\")))","v":""},0,{"$f":"IF(OR(R19=\"ok\",SUM(E19:P19)=0),0,1)","v":0}]
[]
[]
[null,"KWK - Anlage #3",null,"Komp. Nr.",null,null,"Bezeichnung:"]
[null,null,null,"Monat",{"$f":"DATE($G$4,$L$4,1)","v":"2022-01-01"},{"$f":"IF($L$4+1>12,DATE($G$4+1,$L$4+1-12,1),DATE($G$4,$L$4+1,1))","v":"2022-02-01"},{"$f":"IF($L$4+2>12,DATE($G$4+1,$L$4+2-12,1),DATE($G$4,$L$4+2,1))","v":"2022-03-01"},{"$f":"IF($L$4+3>12,DATE($G$4+1,$L$4+3-12,1),DATE($G$4,$L$4+3,1))","v":"2022-04-01"},{"$f":"IF($L$4+4>12,DATE($G$4+1,$L$4+4-12,1),DATE($G$4,$L$4+4,1))","v":"2022-05-01"},{"$f":"IF($L$4+5>12,DATE($G$4+1,$L$4+5-12,1),DATE($G$4,$L$4+5,1))","v":"2022-06-01"},{"$f":"IF($L$4+6>12,DATE($G$4+1,$L$4+6-12,1),DATE($G$4,$L$4+6,1))","v":"2022-07-01"},{"$f":"IF($L$4+7>12,DATE($G$4+1,$L$4+7-12,1),DATE($G$4,$L$4+7,1))","v":"2022-08-01"},{"$f":"IF($L$4+8>12,DATE($G$4+1,$L$4+8-12,1),DATE($G$4,$L$4+8,1))","v":"2022-09-01"},{"$f":"IF($L$4+9>12,DATE($G$4+1,$L$4+9-12,1),DATE($G$4,$L$4+9,1))","v":"2022-10-01"},{"$f":"IF($L$4+10>12,DATE($G$4+1,$L$4+10-12,1),DATE($G$4,$L$4+10,1))","v":"2022-11-01"},{"$f":"IF($L$4+11>12,DATE($G$4+1,$L$4+11-12,1),DATE($G$4,$L$4+11,1))","v":"2022-12-01"},"Jahr"]
[null,null,null,"Einheit"]
[null,"Eingesetzte Brennstoffwärme",null,"kWh",null,null,null,null,null,null,null,null,null,null,null,null,null,{"$f":"IF(S25=0,\"\",IF(S25<13,\"Unvollständige Eingabe\",IF(AND(SUM(E25:P25)>BrstWM_KWK_3Jahr*(1-Toleranz),SUM(E25:P25)<BrstWM_KWK_3Jahr*(1+Toleranz)), \"ok\",\"Summe Monatswerte ist nicht gleich wie der Jahreswert\")))","v":""},0,{"$f":"IF(OR(R25=\"ok\",SUM(E25:P25)=0),0,1)","v":0}]
[null,"Eingespeiste Strommenge",null,"kWh",null,null,null,null,null,null,null,null,null,null,null,null,null,{"$f":"IF(S26=0,\"\",IF(S26<13,\"Unvollständige Eingabe\",IF(AND(SUM(E26:P26)>Strom_KWK_3Jahr*(1-Toleranz),SUM(E26:P26)<Strom_KWK_3Jahr*(1+Toleranz)), \"ok\",\"Summe Monatswerte ist nicht gleich wie der Jahreswert\")))","v":""},0,{"$f":"IF(OR(R26=\"ok\",SUM(E26:P26)=0),0,1)","v":0}]
[null,"Ausgekoppelte Wärmemenge",null,"kWh",null,null,null,null,null,null,null,null,null,null,null,null,null,{"$f":"IF(S27=0,\"\",IF(S27<13,\"Unvollständige Eingabe\",IF(AND(SUM(E27:P27)>WM_KWK_3Jahr*(1-Toleranz),SUM(E27:P27)<WM_KWK_3Jahr*(1+Toleranz)), \"ok\",\"Summe Monatswerte ist nicht gleich wie der Jahreswert\")))","v":""},0,{"$f":"IF(OR(R27=\"ok\",SUM(E27:P27)=0),0,1)","v":0}]
[]
[]
[]
[]
[]
[null,"Anmerkungen zum KWK - Einsatz:"]
[]
[]
[]
[]
[null,"Emissionen entsprechend Messgutachten",null,null,"Bezugssauerstoffgehalt der Eingabewerte:",null,null,null,null," Eingabemöglichkeiten: 6, 10 oder 11 Vol% O2"]
[]
[]
[null,"KWK-Anlage",null,null,"Emissionsmessung bei \"Volllast\"",null,null,null,null,"Emissionsmessung bei \"Teilllast\""]
[null,null,null,null,"O2 gemessen",{"$f":"\"Bezugsauerstoffgehalt \"","v":"Bezugsauerstoffgehalt "},null,{"$f":" BezugO2 & \" Vol%O2 trocken\"","v":" Vol%O2 trocken"},null,"O2 gemessen",{"$f":"F42","v":"Bezugsauerstoffgehalt "},null,{"$f":"H42","v":" Vol%O2 trocken"}]
[null,"Bezeichnung","Komponenten-Nr. aus QM-Datenbank",null,null,"CO","NOx","CxHy","Staub",null,"CO","NOx","CxHy","Staub"]
[null,null,null,null,"Vol%trocken","mg/m³n","mg/m³n","mg/m³n","mg/m³n","Vol%trocken","mg/m³n","mg/m³n","mg/m³n","mg/m³n"]
[null,{"$f":"IF(I6=\"\",\"\",I6)","v":""},{"$f":"IF(ISBLANK(KmpNrKWK1),\"\",KmpNrKWK1)","v":""}]
[null,{"$f":"IF(I14=\"\",\"\",I14)","v":""},{"$f":"IF(ISBLANK(KmpNrKWK2),\"\",KmpNrKWK2)","v":""}]
[null,{"$f":"IF(I22=\"\",\"\",I22)","v":""},{"$f":"IF(ISBLANK(KmpNrKWK3),\"\",KmpNrKWK3)","v":""}]
[]
[null,null,null,null,{"$f":"\"Umrechnung auf Bezugsauerstoffgehalt \" & IF(BezugO2 =6,10,6) & \" Vol%O2 trocken\"","v":"Umrechnung auf Bezugsauerstoffgehalt 6 Vol%O2 trocken"}]
[]
[null,"KWK-Anlage",null,null,"Emissionsmessung bei \"Volllast\"",null,null,null,null,"Emissionsmessung bei \"Teilllast\""]
[null,null,null,null,"O2 gemessen",{"$f":"\"Bezugsauerstoffgehalt \"","v":"Bezugsauerstoffgehalt "},null,{"$f":" IF(BezugO2 =6,10,6) & \" Vol%O2 trocken\"","v":"6 Vol%O2 trocken"},null,"O2 gemessen",{"$f":"F52","v":"Bezugsauerstoffgehalt "},null,{"$f":"H52","v":"6 Vol%O2 trocken"}]
[null,"Bezeichnung","Komponenten-Nr. aus QM-Datenbank",null,null,"CO","NOx","CxHy","Staub",null,"CO","NOx","CxHy","Staub"]
[null,null,null,null,"Vol%trocken","mg/m³n","mg/m³n","mg/m³n","mg/m³n","Vol%trocken","mg/m³n","mg/m³n","mg/m³n","mg/m³n"]
[null,{"$f":"IF(B45=\"\",\"\",B45)","v":""},{"$f":"C45","v":""},null,{"$f":"E45","v":0},{"$f":"F45*(21-IF(BezugO2KWK =11,13,11))/(21-BezugO2KWK)","v":0},0,0,0,{"$f":"J45","v":0},{"$f":"K45*(21-IF(BezugO2KWK =11,13,11))/(21-BezugO2KWK)","v":0},0,0,0]
[null,{"$f":"IF(B46=\"\",\"\",B46)","v":""},"",null,{"$f":"E46","v":0},0,0,0,0,{"$f":"J46","v":0},0,0,0,0]
[null,{"$f":"IF(B47=\"\",\"\",B47)","v":""},"",null,{"$f":"E47","v":0},0,0,0,0,{"$f":"J47","v":0},0,0,0,0]
[]
[]
[]
[]
[]
[]
[]
[null,"Nur für Umrechnung auf 13% Bezugsauerstoff und Übertragung auf Sheet DatenTransformierung"]
[null,"KWK-Anlage",null,null,"Emissionsmessung bei \"Volllast\"",null,null,null,null,"Emissionsmessung bei \"Teilllast\""]
[null,null,null,null,"O2 gemessen","Bezugsauerstoffgehalt ",null,"13 Vol%O2 trocken",null,"O2 gemessen","Bezugsauerstoffgehalt ",null,"13 Vol%O2 trocken"]
[null,"Bezeichnung","Nr.",null,null,"CO","NOx","CxHy","Staub",null,"CO","NOx","CxHy","Staub"]
[null,null,null,null,"[Vol%trocken]","[mg/m³n]","[mg/m³n]","[mg/m³n]","[mg/m³n]","[Vol%trocken]","[mg/m³n]","[mg/m³n]","[mg/m³n]","[mg/m³n]"]
[null,0,{"$f":"EM_KmpNr_1KWK","v":""},null,{"$f":"IF(ISBLANK(EM_Voll_1KWK),\"\",EM_Voll_1KWK)","v":""},{"$f":"IF(ISBLANK(F45),\"\",ROUND(F45*(21-13)/(21-BezugO2KWK),2))","v":""},"","","",{"$f":"IF(ISBLANK(EM_Teil_1KWK),\"\",EM_Teil_1KWK)","v":""},{"$f":"IF(ISBLANK(K45),\"\",ROUND(K45*(21-13)/(21-BezugO2KWK),2))","v":""},"","",""]
[null,0,{"$f":"EM_KmpNr_2KWK","v":""},null,{"$f":"IF(ISBLANK(EM_Voll_2KWK),\"\",EM_Voll_2KWK)","v":""},"","","","",{"$f":"IF(ISBLANK(EM_Teil_2KWK),\"\",EM_Teil_2KWK)","v":""},"","","",""]
[null,0,{"$f":"EM_KmpNr_3KWK","v":""},null,{"$f":"IF(ISBLANK(EM_Voll_3KWK),\"\",EM_Voll_3KWK)","v":""},"","","","",{"$f":"IF(ISBLANK(EM_Teil_3KWK),\"\",EM_Teil_3KWK)","v":""},"","","",""]

{"sheet":"Abnehmerverbräuche","index":4,"n_rows":1210,"n_cols":17,"rows_kept":1210,"cut":false,"hidden":false,"merged":[[5,5,5,6],[1,2,1,4],[0,2,0,4],[2,9,2,11]]}
[null,null,"gelbe Felder sind Eingabefelder!"]
[" Abnehmerverbräuche",null,"Hier geht’s zur Hilfe",null,null,null,null,null,null,null,null,null,null,null,null,null,"Fehlermeldungen Abnehmerverbräuche"]
[null,null,null,null,null,null,null,null,null,"Netztemperaturen Jahresmittelwert",null,null,null,null,null,null," Durch Doppelklick auf die Fehlermeldung (Zeile) springt man zur entsprechenden Eingabezelle!"]
[null,"Projektnummer",{"$f":"IF('Betriebsdaten I'!C3=\"\",\"\",'Betriebsdaten I'!C3)","v":""},null,"Betriebsjahr",{"$f":"IF('Betriebsdaten I'!G3=\"\",\"\",'Betriebsdaten I'!G3)","v":2022},null,null,null,"Vorlauf [°C]"]
[null,null,null,null,null,null,null,null,null,"Rücklauf [°C]"]
[null,null,null,null,null,"Pflichtspalte"]
[null,"Summe",{"$f":"SUM(C10:C1210)","v":0},null,{"$f":"SUM(E10:E1210)","v":0}]
["Abn.\n - Nr.","Objekt/\nLiegenschafts-bezeichnung","Verbrauch","Zählerstand","Volumen","Zählerstand \nVolumen","Änderungs- \nAblesedatum","Mittlere Vorlauftemperatur","Mittlere Rücklauftemperatur","spezifischer Volumenstrom","mittlere Spreizung","Anteil am Gesamt-wärmeverkauf",null,null,"Automatische Abnehmeranalyse"]
[null,"Text","kWh/a","kWh","m3/a","m3","TT.MM.JJJJ","°C","°C","m³/MWh","K"]
[null,null,null,null,null,null,null,{"$f":"IF(ISBLANK(A10),\"\",NetzvorlaufTemp)","v":""},{"$f":"IF(ISBLANK(A10),\"\",NetzrücklaufTemp)","v":""},{"$f":"IF(OR(ISBLANK(C10),ISBLANK(E10)),\"\",E10/C10*1000)","v":""},{"$f":"IF(OR(ISBLANK(C10),ISBLANK(E10)),\"\",C10/(4.189*978*E10/3600))","v":""},{"$f":"IF(ISBLANK(C10),\"\",C10/'Betriebsdaten II'!$T$26)","v":""},{"$f":"IF(ISERR(J10*L10),\"\",J10*L10)","v":""},{"$f":"IF(ISERR(RANK(M10,$M$10:$M$1210)),\"\",RANK(M10,$M$10:$M$1210))","v":""},{"$f":"IF(N10=\"\",\"\",IF(AND(N10<5,K10<30), \"Optimierungsmöglichkeiten prüfen!\",\"\"))","v":""}]
[null,null,null,null,null,null,null,"","","","",{"$f":"IF(ISBLANK(C11),\"\",C11/'Betriebsdaten II'!$T$26)","v":""},"",{"$f":"IF(ISERR(RANK(M11,$M$10:$M$1210)),\"\",RANK(M11,$M$10:$M$1210))","v":""},""]
[null,null,null,null,null,null,null,"","","","",{"$f":"IF(ISBLANK(C12),\"\",C12/'Betriebsdaten II'!$T$26)","v":""},"","",""]
[null,null,null,null,null,null,null,"","","","",{"$f":"IF(ISBLANK(C13),\"\",C13/'Betriebsdaten II'!$T$26)","v":""},"","",""]
[null,null,null,null,null,null,null,"","","","",{"$f":"IF(ISBLANK(C14),\"\",C14/'Betriebsdaten II'!$T$26)","v":""},"","",""]
[null,null,null,null,null,null,null,"","","","",{"$f":"IF(ISBLANK(C15),\"\",C15/'Betriebsdaten II'!$T$26)","v":""},"","",""]
[null,null,null,null,null,null,null,"","","","",{"$f":"IF(ISBLANK(C16),\"\",C16/'Betriebsdaten II'!$T$26)","v":""},"","",""]
[null,null,null,null,null,null,null,"","","","",{"$f":"IF(ISBLANK(C17),\"\",C17/'Betriebsdaten II'!$T$26)","v":""},"","",""]
[null,null,null,null,null,null,null,"","","","",{"$f":"IF(ISBLANK(C18),\"\",C18/'Betriebsdaten II'!$T$26)","v":""},"","",""]
[null,null,null,null,null,null,null,"","","","",{"$f":"IF(ISBLANK(C19),\"\",C19/'Betriebsdaten II'!$T$26)","v":""},"","",""]
[null,null,null,null,null,null,null,"","","","",{"$f":"IF(ISBLANK(C20),\"\",C20/'Betriebsdaten II'!$T$26)","v":""},"","",""]
[null,null,null,null,null,null,null,"","","","",{"$f":"IF(ISBLANK(C21),\"\",C21/'Betriebsdaten II'!$T$26)","v":""},"","",""]
[null,null,null,null,null,null,null,"","","","",{"$f":"IF(ISBLANK(C22),\"\",C22/'Betriebsdaten II'!$T$26)","v":""},"","",""]
[null,null,null,null,null,null,null,"","","","",{"$f":"IF(ISBLANK(C23),\"\",C23/'Betriebsdaten II'!$T$26)","v":""},"","",""]
[null,null,null,null,null,null,null,"","","","",{"$f":"IF(ISBLANK(C24),\"\",C24/'Betriebsdaten II'!$T$26)","v":""},"","",""]
[null,null,null,null,null,null,null,"","","","",{"$f":"IF(ISBLANK(C25),\"\",C25/'Betriebsdaten II'!$T$26)","v":""},"","",""]
[null,null,null,null,null,null,null,"","","","",{"$f":"IF(ISBLANK(C26),\"\",C26/'Betriebsdaten II'!$T$26)","v":""},"","",""]
[null,null,null,null,null,null,null,"","","","",{"$f":"IF(ISBLANK(C27),\"\",C27/'Betriebsdaten II'!$T$26)","v":""},"","",""]
[null,null,null,null,null,null,null,"","","","",{"$f":"IF(ISBLANK(C28),\"\",C28/'Betriebsdaten II'!$T$26)","v":""},"","",""]
[null,null,null,null,null,null,null,"","","","",{"$f":"IF(ISBLANK(C29),\"\",C29/'Betriebsdaten II'!$T$26)","v":""},"","",""]
[null,null,null,null,null,null,null,"","","","",{"$f":"IF(ISBLANK(C30),\"\",C30/'Betriebsdaten II'!$T$26)","v":""},"","",""]
[null,null,null,null,null,null,null,"","","","",{"$f":"IF(ISBLANK(C31),\"\",C31/'Betriebsdaten II'!$T$26)","v":""},"","",""]
[null,null,null,null,null,null,null,"","","","",{"$f":"IF(ISBLANK(C32),\"\",C32/'Betriebsdaten II'!$T$26)","v":""},"","",""]
[null,null,null,null,null,null,null,"","","","",{"$f":"IF(ISBLANK(C33),\"\",C33/'Betriebsdaten II'!$T$26)","v":""},"","",""]
[null,null,null,null,null,null,null,"","","","",{"$f":"IF(ISBLANK(C34),\"\",C34/'Betriebsdaten II'!$T$26)","v":""},"","",""]
[null,null,null,null,null,null,null,"","","","",{"$f":"IF(ISBLANK(C35),\"\",C35/'Betriebsdaten II'!$T$26)","v":""},"","",""]
[null,null,null,null,null,null,null,"","","","",{"$f":"IF(ISBLANK(C36),\"\",C36/'Betriebsdaten II'!$T$26)","v":""},"","",""]
[null,null,null,null,null,null,null,"","","","",{"$f":"IF(ISBLANK(C37),\"\",C37/'Betriebsdaten II'!$T$26)","v":""},"","",""]
[null,null,null,null,null,null,null,"","","","",{"$f":"IF(ISBLANK(C38),\"\",C38/'Betriebsdaten II'!$T$26)","v":""},"","",""]
[null,null,null,null,null,null,null,"","","","",{"$f":"IF(ISBLANK(C39),\"\",C39/'Betriebsdaten II'!$T$26)","v":""},"","",""]
[null,null,null,null,null,null,null,"","","","",{"$f":"IF(ISBLANK(C40),\"\",C40/'Betriebsdaten II'!$T$26)","v":""},"","",""]
[null,null,null,null,null,null,null,"","","","",{"$f":"IF(ISBLANK(C41),\"\",C41/'Betriebsdaten II'!$T$26)","v":""},"","",""]
[null,null,null,null,null,null,null,"","","","",{"$f":"IF(ISBLANK(C42),\"\",C42/'Betriebsdaten II'!$T$26)","v":""},"","",""]
[null,null,null,null,null,null,null,"","","","",{"$f":"IF(ISBLANK(C43),\"\",C43/'Betriebsdaten II'!$T$26)","v":""},"","",""]
[null,null,null,null,null,null,null,"","","","",{"$f":"IF(ISBLANK(C44),\"\",C44/'Betriebsdaten II'!$T$26)","v":""},"","",""]
[null,null,null,null,null,null,null,"","","","",{"$f":"IF(ISBLANK(C45),\"\",C45/'Betriebsdaten II'!$T$26)","v":""},"","",""]
[null,null,null,null,null,null,null,"","","","",{"$f":"IF(ISBLANK(C46),\"\",C46/'Betriebsdaten II'!$T$26)","v":""},"","",""]
[null,null,null,null,null,null,null,"","","","",{"$f":"IF(ISBLANK(C47),\"\",C47/'Betriebsdaten II'!$T$26)","v":""},"","",""]
[null,null,null,null,null,null,null,"","","","",{"$f":"IF(ISBLANK(C48),\"\",C48/'Betriebsdaten II'!$T$26)","v":""},"","",""]
[null,null,null,null,null,null,null,"","","","",{"$f":"IF(ISBLANK(C49),\"\",C49/'Betriebsdaten II'!$T$26)","v":""},"","",""]
[null,null,null,null,null,null,null,"","","","",{"$f":"IF(ISBLANK(C50),\"\",C50/'Betriebsdaten II'!$T$26)","v":""},"","",""]
[null,null,null,null,null,null,null,"","","","",{"$f":"IF(ISBLANK(C51),\"\",C51/'Betriebsdaten II'!$T$26)","v":""},"","",""]
[null,null,null,null,null,null,null,"","","","",{"$f":"IF(ISBLANK(C52),\"\",C52/'Betriebsdaten II'!$T$26)","v":""},"","",""]
[null,null,null,null,null,null,null,"","","","",{"$f":"IF(ISBLANK(C53),\"\",C53/'Betriebsdaten II'!$T$26)","v":""},"","",""]
[null,null,null,null,null,null,null,"","","","",{"$f":"IF(ISBLANK(C54),\"\",C54/'Betriebsdaten II'!$T$26)","v":""},"","",""]
[null,null,null,null,null,null,null,"","","","",{"$f":"IF(ISBLANK(C55),\"\",C55/'Betriebsdaten II'!$T$26)","v":""},"","",""]
[null,null,null,null,null,null,null,"","","","",{"$f":"IF(ISBLANK(C56),\"\",C56/'Betriebsdaten II'!$T$26)","v":""},"","",""]
[null,null,null,null,null,null,null,"","","","",{"$f":"IF(ISBLANK(C57),\"\",C57/'Betriebsdaten II'!$T$26)","v":""},"","",""]
[null,null,null,null,null,null,null,"","","","",{"$f":"IF(ISBLANK(C58),\"\",C58/'Betriebsdaten II'!$T$26)","v":""},"","",""]
[null,null,null,null,null,null,null,"","","","",{"$f":"IF(ISBLANK(C59),\"\",C59/'Betriebsdaten II'!$T$26)","v":""},"","",""]
[null,null,null,null,null,null,null,"","","","",{"$f":"IF(ISBLANK(C60),\"\",C60/'Betriebsdaten II'!$T$26)","v":""},"","",""]
[null,null,null,null,null,null,null,"","","","",{"$f":"IF(ISBLANK(C61),\"\",C61/'Betriebsdaten II'!$T$26)","v":""},"","",""]
[null,null,null,null,null,null,null,"","","","",{"$f":"IF(ISBLANK(C62),\"\",C62/'Betriebsdaten II'!$T$26)","v":""},"","",""]
[null,null,null,null,null,null,null,"","","","",{"$f":"IF(ISBLANK(C63),\"\",C63/'Betriebsdaten II'!$T$26)","v":""},"","",""]
[null,null,null,null,null,null,null,"","","","",{"$f":"IF(ISBLANK(C64),\"\",C64/'Betriebsdaten II'!$T$26)","v":""},"","",""]
[null,null,null,null,null,null,null,"","","","",{"$f":"IF(ISBLANK(C65),\"\",C65/'Betriebsdaten II'!$T$26)","v":""},"","",""]
[null,null,null,null,null,null,null,"","","","",{"$f":"IF(ISBLANK(C66),\"\",C66/'Betriebsdaten II'!$T$26)","v":""},"","",""]
[null,null,null,null,null,null,null,"","","","",{"$f":"IF(ISBLANK(C67),\"\",C67/'Betriebsdaten II'!$T$26)","v":""},"","",""]
[null,null,null,null,null,null,null,"","","","",{"$f":"IF(ISBLANK(C68),\"\",C68/'Betriebsdaten II'!$T$26)","v":""},"","",""]
[null,null,null,null,null,null,null,"","","","",{"$f":"IF(ISBLANK(C69),\"\",C69/'Betriebsdaten II'!$T$26)","v":""},"","",""]
[null,null,null,null,null,null,null,"","","","",{"$f":"IF(ISBLANK(C70),\"\",C70/'Betriebsdaten II'!$T$26)","v":""},"","",""]
[null,null,null,null,null,null,null,"","","","",{"$f":"IF(ISBLANK(C71),\"\",C71/'Betriebsdaten II'!$T$26)","v":""},"","",""]
[null,null,null,null,null,null,null,"","","","",{"$f":"IF(ISBLANK(C72),\"\",C72/'Betriebsdaten II'!$T$26)","v":""},"","",""]
[null,null,null,null,null,null,null,"","","","",{"$f":"IF(ISBLANK(C73),\"\",C73/'Betriebsdaten II'!$T$26)","v":""},"","",""]
[null,null,null,null,null,null,null,{"$f":"IF(ISBLANK(A74),\"\",NetzvorlaufTemp)","v":""},{"$f":"IF(ISBLANK(A74),\"\",NetzrücklaufTemp)","v":""},{"$f":"IF(OR(ISBLANK(C74),ISBLANK(E74)),\"\",E74/C74*1000)","v":""},{"$f":"IF(OR(ISBLANK(C74),ISBLANK(E74)),\"\",C74/(4.189*978*E74/3600))","v":""},{"$f":"IF(ISBLANK(C74),\"\",C74/'Betriebsdaten II'!$T$26)","v":""},{"$f":"IF(ISERR(J74*L74),\"\",J74*L74)","v":""},"",{"$f":"IF(N74=\"\",\"\",IF(AND(N74<5,K74<30), \"Optimierungsmöglichkeiten prüfen!\",\"\"))","v":""}]
[null,null,null,null,null,null,null,"","","","",{"$f":"IF(ISBLANK(C75),\"\",C75/'Betriebsdaten II'!$T$26)","v":""},"",{"$f":"IF(ISERR(RANK(M75,$M$10:$M$1210)),\"\",RANK(M75,$M$10:$M$1210))","v":""},""]
[null,null,null,null,null,null,null,"","","","",{"$f":"IF(ISBLANK(C76),\"\",C76/'Betriebsdaten II'!$T$26)","v":""},"","",""]
[null,null,null,null,null,null,null,"","","","",{"$f":"IF(ISBLANK(C77),\"\",C77/'Betriebsdaten II'!$T$26)","v":""},"","",""]
[null,null,null,null,null,null,null,"","","","",{"$f":"IF(ISBLANK(C78),\"\",C78/'Betriebsdaten II'!$T$26)","v":""},"","",""]
[null,null,null,null,null,null,null,"","","","",{"$f":"IF(ISBLANK(C79),\"\",C79/'Betriebsdaten II'!$T$26)","v":""},"","",""]
[null,null,null,null,null,null,null,"","","","",{"$f":"IF(ISBLANK(C80),\"\",C80/'Betriebsdaten II'!$T$26)","v":""},"","",""]
[null,null,null,null,null,null,null,"","","","",{"$f":"IF(ISBLANK(C81),\"\",C81/'Betriebsdaten II'!$T$26)","v":""},"","",""]
[null,null,null,null,null,null,null,"","","","",{"$f":"IF(ISBLANK(C82),\"\",C82/'Betriebsdaten II'!$T$26)","v":""},"","",""]
[null,null,null,null,null,null,null,"","","","",{"$f":"IF(ISBLANK(C83),\"\",C83/'Betriebsdaten II'!$T$26)","v":""},"","",""]
[null,null,null,null,null,null,null,"","","","",{"$f":"IF(ISBLANK(C84),\"\",C84/'Betriebsdaten II'!$T$26)","v":""},"","",""]
[null,null,null,null,null,null,null,"","","","",{"$f":"IF(ISBLANK(C85),\"\",C85/'Betriebsdaten II'!$T$26)","v":""},"","",""]
[null,null,null,null,null,null,null,"","","","",{"$f":"IF(ISBLANK(C86),\"\",C86/'Betriebsdaten II'!$T$26)","v":""},"","",""]
[null,null,null,null,null,null,null,"","","","",{"$f":"IF(ISBLANK(C87),\"\",C87/'Betriebsdaten II'!$T$26)","v":""},"","",""]
[null,null,null,null,null,null,null,"","","","",{"$f":"IF(ISBLANK(C88),\"\",C88/'Betriebsdaten II'!$T$26)","v":""},"","",""]
[null,null,null,null,null,null,null,"","","","",{"$f":"IF(ISBLANK(C89),\"\",C89/'Betriebsdaten II'!$T$26)","v":""},"","",""]
[null,null,null,null,null,null,null,"","","","",{"$f":"IF(ISBLANK(C90),\"\",C90/'Betriebsdaten II'!$T$26)","v":""},"","",""]
[null,null,null,null,null,null,null,"","","","",{"$f":"IF(ISBLANK(C91),\"\",C91/'Betriebsdaten II'!$T$26)","v":""},"","",""]
[null,null,null,null,null,null,null,"","","","",{"$f":"IF(ISBLANK(C92),\"\",C92/'Betriebsdaten II'!$T$26)","v":""},"","",""]
[null,null,null,null,null,null,null,"","","","",{"$f":"IF(ISBLANK(C93),\"\",C93/'Betriebsdaten II'!$T$26)","v":""},"","",""]
[null,null,null,null,null,null,null,"","","","",{"$f":"IF(ISBLANK(C94),\"\",C94/'Betriebsdaten II'!$T$26)","v":""},"","",""]
[null,null,null,null,null,null,null,"","","","",{"$f":"IF(ISBLANK(C95),\"\",C95/'Betriebsdaten II'!$T$26)","v":""},"","",""]
[null,null,null,null,null,null,null,"","","","",{"$f":"IF(ISBLANK(C96),\"\",C96/'Betriebsdaten II'!$T$26)","v":""},"","",""]
[null,null,null,null,null,null,null,"","","","",{"$f":"IF(ISBLANK(C97),\"\",C97/'Betriebsdaten II'!$T$26)","v":""},"","",""]
[null,null,null,null,null,null,null,"","","","",{"$f":"IF(ISBLANK(C98),\"\",C98/'Betriebsdaten II'!$T$26)","v":""},"","",""]
[null,null,null,null,null,null,null,"","","","",{"$f":"IF(ISBLANK(C99),\"\",C99/'Betriebsdaten II'!$T$26)","v":""},"","",""]
[null,null,null,null,null,null,null,"","","","",{"$f":"IF(ISBLANK(C100),\"\",C100/'Betriebsdaten II'!$T$26)","v":""},"","",""]
[null,null,null,null,null,null,null,"","","","",{"$f":"IF(ISBLANK(C101),\"\",C101/'Betriebsdaten II'!$T$26)","v":""},"","",""]
[null,null,null,null,null,null,null,"","","","",{"$f":"IF(ISBLANK(C102),\"\",C102/'Betriebsdaten II'!$T$26)","v":""},"","",""]
[null,null,null,null,null,null,null,"","","","",{"$f":"IF(ISBLANK(C103),\"\",C103/'Betriebsdaten II'!$T$26)","v":""},"","",""]
[null,null,null,null,null,null,null,"","","","",{"$f":"IF(ISBLANK(C104),\"\",C104/'Betriebsdaten II'!$T$26)","v":""},"","",""]
[null,null,null,null,null,null,null,"","","","",{"$f":"IF(ISBLANK(C105),\"\",C105/'Betriebsdaten II'!$T$26)","v":""},"","",""]
[null,null,null,null,null,null,null,"","","","",{"$f":"IF(ISBLANK(C106),\"\",C106/'Betriebsdaten II'!$T$26)","v":""},"","",""]
[null,null,null,null,null,null,null,"","","","",{"$f":"IF(ISBLANK(C107),\"\",C107/'Betriebsdaten II'!$T$26)","v":""},"","",""]
[null,null,null,null,null,null,null,"","","","",{"$f":"IF(ISBLANK(C108),\"\",C108/'Betriebsdaten II'!$T$26)","v":""},"","",""]
[null,null,null,null,null,null,null,"","","","",{"$f":"IF(ISBLANK(C109),\"\",C109/'Betriebsdaten II'!$T$26)","v":""},"","",""]
[null,null,null,null,null,null,null,"","","","",{"$f":"IF(ISBLANK(C110),\"\",C110/'Betriebsdaten II'!$T$26)","v":""},"","",""]
[null,null,null,null,null,null,null,"","","","",{"$f":"IF(ISBLANK(C111),\"\",C111/'Betriebsdaten II'!$T$26)","v":""},"","",""]
[null,null,null,null,null,null,null,"","","","",{"$f":"IF(ISBLANK(C112),\"\",C112/'Betriebsdaten II'!$T$26)","v":""},"","",""]
[null,null,null,null,null,null,null,"","","","",{"$f":"IF(ISBLANK(C113),\"\",C113/'Betriebsdaten II'!$T$26)","v":""},"","",""]
[null,null,null,null,null,null,null,"","","","",{"$f":"IF(ISBLANK(C114),\"\",C114/'Betriebsdaten II'!$T$26)","v":""},"","",""]
[null,null,null,null,null,null,null,"","","","",{"$f":"IF(ISBLANK(C115),\"\",C115/'Betriebsdaten II'!$T$26)","v":""},"","",""]
[null,null,null,null,null,null,null,"","","","",{"$f":"IF(ISBLANK(C116),\"\",C116/'Betriebsdaten II'!$T$26)","v":""},"","",""]
[null,null,null,null,null,null,null,"","","","",{"$f":"IF(ISBLANK(C117),\"\",C117/'Betriebsdaten II'!$T$26)","v":""},"","",""]
[null,null,null,null,null,null,null,"","","","",{"$f":"IF(ISBLANK(C118),\"\",C118/'Betriebsdaten II'!$T$26)","v":""},"","",""]
[null,null,null,null,null,null,null,"","","","",{"$f":"IF(ISBLANK(C119),\"\",C119/'Betriebsdaten II'!$T$26)","v":""},"","",""]
[null,null,null,null,null,null,null,"","","","",{"$f":"IF(ISBLANK(C120),\"\",C120/'Betriebsdaten II'!$T$26)","v":""},"","",""]
[null,null,null,null,null,null,null,"","","","",{"$f":"IF(ISBLANK(C121),\"\",C121/'Betriebsdaten II'!$T$26)","v":""},"","",""]
[null,null,null,null,null,null,null,"","","","",{"$f":"IF(ISBLANK(C122),\"\",C122/'Betriebsdaten II'!$T$26)","v":""},"","",""]
[null,null,null,null,null,null,null,"","","","",{"$f":"IF(ISBLANK(C123),\"\",C123/'Betriebsdaten II'!$T$26)","v":""},"","",""]
[null,null,null,null,null,null,null,"","","","",{"$f":"IF(ISBLANK(C124),\"\",C124/'Betriebsdaten II'!$T$26)","v":""},"","",""]
[null,null,null,null,null,null,null,"","","","",{"$f":"IF(ISBLANK(C125),\"\",C125/'Betriebsdaten II'!$T$26)","v":""},"","",""]
[null,null,null,null,null,null,null,"","","","",{"$f":"IF(ISBLANK(C126),\"\",C126/'Betriebsdaten II'!$T$26)","v":""},"","",""]
[null,null,null,null,null,null,null,"","","","",{"$f":"IF(ISBLANK(C127),\"\",C127/'Betriebsdaten II'!$T$26)","v":""},"","",""]
[null,null,null,null,null,null,null,"","","","",{"$f":"IF(ISBLANK(C128),\"\",C128/'Betriebsdaten II'!$T$26)","v":""},"","",""]
[null,null,null,null,null,null,null,"","","","",{"$f":"IF(ISBLANK(C129),\"\",C129/'Betriebsdaten II'!$T$26)","v":""},"","",""]
[null,null,null,null,null,null,null,"","","","",{"$f":"IF(ISBLANK(C130),\"\",C130/'Betriebsdaten II'!$T$26)","v":""},"","",""]
[null,null,null,null,null,null,null,"","","","",{"$f":"IF(ISBLANK(C131),\"\",C131/'Betriebsdaten II'!$T$26)","v":""},"","",""]
[null,null,null,null,null,null,null,"","","","",{"$f":"IF(ISBLANK(C132),\"\",C132/'Betriebsdaten II'!$T$26)","v":""},"","",""]
[null,null,null,null,null,null,null,"","","","",{"$f":"IF(ISBLANK(C133),\"\",C133/'Betriebsdaten II'!$T$26)","v":""},"","",""]
[null,null,null,null,null,null,null,"","","","",{"$f":"IF(ISBLANK(C134),\"\",C134/'Betriebsdaten II'!$T$26)","v":""},"","",""]
[null,null,null,null,null,null,null,"","","","",{"$f":"IF(ISBLANK(C135),\"\",C135/'Betriebsdaten II'!$T$26)","v":""},"","",""]
[null,null,null,null,null,null,null,"","","","",{"$f":"IF(ISBLANK(C136),\"\",C136/'Betriebsdaten II'!$T$26)","v":""},"","",""]
[null,null,null,null,null,null,null,"","","","",{"$f":"IF(ISBLANK(C137),\"\",C137/'Betriebsdaten II'!$T$26)","v":""},"","",""]
[null,null,null,null,null,null,null,{"$f":"IF(ISBLANK(A138),\"\",NetzvorlaufTemp)","v":""},{"$f":"IF(ISBLANK(A138),\"\",NetzrücklaufTemp)","v":""},{"$f":"IF(OR(ISBLANK(C138),ISBLANK(E138)),\"\",E138/C138*1000)","v":""},{"$f":"IF(OR(ISBLANK(C138),ISBLANK(E138)),\"\",C138/(4.189*978*E138/3600))","v":""},{"$f":"IF(ISBLANK(C138),\"\",C138/'Betriebsdaten II'!$T$26)","v":""},{"$f":"IF(ISERR(J138*L138),\"\",J138*L138)","v":""},"",{"$f":"IF(N138=\"\",\"\",IF(AND(N138<5,K138<30), \"Optimierungsmöglichkeiten prüfen!\",\"\"))","v":""}]
[null,null,null,null,null,null,null,"","","","",{"$f":"IF(ISBLANK(C139),\"\",C139/'Betriebsdaten II'!$T$26)","v":""},"",{"$f":"IF(ISERR(RANK(M139,$M$10:$M$1210)),\"\",RANK(M139,$M$10:$M$1210))","v":""},""]
[null,null,null,null,null,null,null,"","","","",{"$f":"IF(ISBLANK(C140),\"\",C140/'Betriebsdaten II'!$T$26)","v":""},"","",""]
[null,null,null,null,null,null,null,"","","","",{"$f":"IF(ISBLANK(C141),\"\",C141/'Betriebsdaten II'!$T$26)","v":""},"","",""]
[null,null,null,null,null,null,null,"","","","",{"$f":"IF(ISBLANK(C142),\"\",C142/'Betriebsdaten II'!$T$26)","v":""},"","",""]
[null,null,null,null,null,null,null,"","","","",{"$f":"IF(ISBLANK(C143),\"\",C143/'Betriebsdaten II'!$T$26)","v":""},"","",""]
[null,null,null,null,null,null,null,"","","","",{"$f":"IF(ISBLANK(C144),\"\",C144/'Betriebsdaten II'!$T$26)","v":""},"","",""]
[null,null,null,null,null,null,null,"","","","",{"$f":"IF(ISBLANK(C145),\"\",C145/'Betriebsdaten II'!$T$26)","v":""},"","",""]
[null,null,null,null,null,null,null,"","","","",{"$f":"IF(ISBLANK(C146),\"\",C146/'Betriebsdaten II'!$T$26)","v":""},"","",""]
[null,null,null,null,null,null,null,"","","","",{"$f":"IF(ISBLANK(C147),\"\",C147/'Betriebsdaten II'!$T$26)","v":""},"","",""]
[null,null,null,null,null,null,null,"","","","",{"$f":"IF(ISBLANK(C148),\"\",C148/'Betriebsdaten II'!$T$26)","v":""},"","",""]
[null,null,null,null,null,null,null,"","","","",{"$f":"IF(ISBLANK(C149),\"\",C149/'Betriebsdaten II'!$T$26)","v":""},"","",""]
[null,null,null,null,null,null,null,"","","","",{"$f":"IF(ISBLANK(C150),\"\",C150/'Betriebsdaten II'!$T$26)","v":""},"","",""]
[null,null,null,null,null,null,null,"","","","",{"$f":"IF(ISBLANK(C151),\"\",C151/'Betriebsdaten II'!$T$26)","v":""},"","",""]
[null,null,null,null,null,null,null,"","","","",{"$f":"IF(ISBLANK(C152),\"\",C152/'Betriebsdaten II'!$T$26)","v":""},"","",""]
[null,null,null,null,null,null,null,"","","","",{"$f":"IF(ISBLANK(C153),\"\",C153/'Betriebsdaten II'!$T$26)","v":""},"","",""]
[null,null,null,null,null,null,null,"","","","",{"$f":"IF(ISBLANK(C154),\"\",C154/'Betriebsdaten II'!$T$26)","v":""},"","",""]
[null,null,null,null,null,null,null,"","","","",{"$f":"IF(ISBLANK(C155),\"\",C155/'Betriebsdaten II'!$T$26)","v":""},"","",""]
[null,null,null,null,null,null,null,"","","","",{"$f":"IF(ISBLANK(C156),\"\",C156/'Betriebsdaten II'!$T$26)","v":""},"","",""]
[null,null,null,null,null,null,null,"","","","",{"$f":"IF(ISBLANK(C157),\"\",C157/'Betriebsdaten II'!$T$26)","v":""},"","",""]
[null,null,null,null,null,null,null,"","","","",{"$f":"IF(ISBLANK(C158),\"\",C158/'Betriebsdaten II'!$T$26)","v":""},"","",""]
[null,null,null,null,null,null,null,"","","","",{"$f":"IF(ISBLANK(C159),\"\",C159/'Betriebsdaten II'!$T$26)","v":""},"","",""]
[null,null,null,null,null,null,null,"","","","",{"$f":"IF(ISBLANK(C160),\"\",C160/'Betriebsdaten II'!$T$26)","v":""},"","",""]
[null,null,null,null,null,null,null,"","","","",{"$f":"IF(ISBLANK(C161),\"\",C161/'Betriebsdaten II'!$T$26)","v":""},"","",""]
[null,null,null,null,null,null,null,"","","","",{"$f":"IF(ISBLANK(C162),\"\",C162/'Betriebsdaten II'!$T$26)","v":""},"","",""]
[null,null,null,null,null,null,null,"","","","",{"$f":"IF(ISBLANK(C163),\"\",C163/'Betriebsdaten II'!$T$26)","v":""},"","",""]
[null,null,null,null,null,null,null,"","","","",{"$f":"IF(ISBLANK(C164),\"\",C164/'Betriebsdaten II'!$T$26)","v":""},"","",""]
[null,null,null,null,null,null,null,"","","","",{"$f":"IF(ISBLANK(C165),\"\",C165/'Betriebsdaten II'!$T$26)","v":""},"","",""]
[null,null,null,null,null,null,null,"","","","",{"$f":"IF(ISBLANK(C166),\"\",C166/'Betriebsdaten II'!$T$26)","v":""},"","",""]
[null,null,null,null,null,null,null,"","","","",{"$f":"IF(ISBLANK(C167),\"\",C167/'Betriebsdaten II'!$T$26)","v":""},"","",""]
[null,null,null,null,null,null,null,"","","","",{"$f":"IF(ISBLANK(C168),\"\",C168/'Betriebsdaten II'!$T$26)","v":""},"","",""]
[null,null,null,null,null,null,null,"","","","",{"$f":"IF(ISBLANK(C169),\"\",C169/'Betriebsdaten II'!$T$26)","v":""},"","",""]
[null,null,null,null,null,null,null,"","","","",{"$f":"IF(ISBLANK(C170),\"\",C170/'Betriebsdaten II'!$T$26)","v":""},"","",""]
[null,null,null,null,null,null,null,"","","","",{"$f":"IF(ISBLANK(C171),\"\",C171/'Betriebsdaten II'!$T$26)","v":""},"","",""]
[null,null,null,null,null,null,null,"","","","",{"$f":"IF(ISBLANK(C172),\"\",C172/'Betriebsdaten II'!$T$26)","v":""},"","",""]
[null,null,null,null,null,null,null,"","","","",{"$f":"IF(ISBLANK(C173),\"\",C173/'Betriebsdaten II'!$T$26)","v":""},"","",""]
[null,null,null,null,null,null,null,"","","","",{"$f":"IF(ISBLANK(C174),\"\",C174/'Betriebsdaten II'!$T$26)","v":""},"","",""]
[null,null,null,null,null,null,null,"","","","",{"$f":"IF(ISBLANK(C175),\"\",C175/'Betriebsdaten II'!$T$26)","v":""},"","",""]
[null,null,null,null,null,null,null,"","","","",{"$f":"IF(ISBLANK(C176),\"\",C176/'Betriebsdaten II'!$T$26)","v":""},"","",""]
[null,null,null,null,null,null,null,"","","","",{"$f":"IF(ISBLANK(C177),\"\",C177/'Betriebsdaten II'!$T$26)","v":""},"","",""]
[null,null,null,null,null,null,null,"","","","",{"$f":"IF(ISBLANK(C178),\"\",C178/'Betriebsdaten II'!$T$26)","v":""},"","",""]
[null,null,null,null,null,null,null,"","","","",{"$f":"IF(ISBLANK(C179),\"\",C179/'Betriebsdaten II'!$T$26)","v":""},"","",""]
[null,null,null,null,null,null,null,"","","","",{"$f":"IF(ISBLANK(C180),\"\",C180/'Betriebsdaten II'!$T$26)","v":""},"","",""]
[null,null,null,null,null,null,null,"","","","",{"$f":"IF(ISBLANK(C181),\"\",C181/'Betriebsdaten II'!$T$26)","v":""},"","",""]
[null,null,null,null,null,null,null,"","","","",{"$f":"IF(ISBLANK(C182),\"\",C182/'Betriebsdaten II'!$T$26)","v":""},"","",""]
[null,null,null,null,null,null,null,"","","","",{"$f":"IF(ISBLANK(C183),\"\",C183/'Betriebsdaten II'!$T$26)","v":""},"","",""]
[null,null,null,null,null,null,null,"","","","",{"$f":"IF(ISBLANK(C184),\"\",C184/'Betriebsdaten II'!$T$26)","v":""},"","",""]
[null,null,null,null,null,null,null,"","","","",{"$f":"IF(ISBLANK(C185),\"\",C185/'Betriebsdaten II'!$T$26)","v":""},"","",""]
[null,null,null,null,null,null,null,"","","","",{"$f":"IF(ISBLANK(C186),\"\",C186/'Betriebsdaten II'!$T$26)","v":""},"","",""]
[null,null,null,null,null,null,null,"","","","",{"$f":"IF(ISBLANK(C187),\"\",C187/'Betriebsdaten II'!$T$26)","v":""},"","",""]
[null,null,null,null,null,null,null,"","","","",{"$f":"IF(ISBLANK(C188),\"\",C188/'Betriebsdaten II'!$T$26)","v":""},"","",""]
[null,null,null,null,null,null,null,"","","","",{"$f":"IF(ISBLANK(C189),\"\",C189/'Betriebsdaten II'!$T$26)","v":""},"","",""]
[null,null,null,null,null,null,null,"","","","",{"$f":"IF(ISBLANK(C190),\"\",C190/'Betriebsdaten II'!$T$26)","v":""},"","",""]
[null,null,null,null,null,null,null,"","","","",{"$f":"IF(ISBLANK(C191),\"\",C191/'Betriebsdaten II'!$T$26)","v":""},"","",""]
[null,null,null,null,null,null,null,"","","","",{"$f":"IF(ISBLANK(C192),\"\",C192/'Betriebsdaten II'!$T$26)","v":""},"","",""]
[null,null,null,null,null,null,null,"","","","",{"$f":"IF(ISBLANK(C193),\"\",C193/'Betriebsdaten II'!$T$26)","v":""},"","",""]
[null,null,null,null,null,null,null,"","","","",{"$f":"IF(ISBLANK(C194),\"\",C194/'Betriebsdaten II'!$T$26)","v":""},"","",""]
[null,null,null,null,null,null,null,"","","","",{"$f":"IF(ISBLANK(C195),\"\",C195/'Betriebsdaten II'!$T$26)","v":""},"","",""]
[null,null,null,null,null,null,null,"","","","",{"$f":"IF(ISBLANK(C196),\"\",C196/'Betriebsdaten II'!$T$26)","v":""},"","",""]
[null,null,null,null,null,null,null,"","","","",{"$f":"IF(ISBLANK(C197),\"\",C197/'Betriebsdaten II'!$T$26)","v":""},"","",""]
[null,null,null,null,null,null,null,"","","","",{"$f":"IF(ISBLANK(C198),\"\",C198/'Betriebsdaten II'!$T$26)","v":""},"","",""]
[null,null,null,null,null,null,null,"","","","",{"$f":"IF(ISBLANK(C199),\"\",C199/'Betriebsdaten II'!$T$26)","v":""},"","",""]
[null,null,null,null,null,null,null,"","","","",{"$f":"IF(ISBLANK(C200),\"\",C200/'Betriebsdaten II'!$T$26)","v":""},"","",""]
[null,null,null,null,null,null,null,"","","","",{"$f":"IF(ISBLANK(C201),\"\",C201/'Betriebsdaten II'!$T$26)","v":""},"","",""]
[null,null,null,null,null,null,null,{"$f":"IF(ISBLANK(A202),\"\",NetzvorlaufTemp)","v":""},{"$f":"IF(ISBLANK(A202),\"\",NetzrücklaufTemp)","v":""},{"$f":"IF(OR(ISBLANK(C202),ISBLANK(E202)),\"\",E202/C202*1000)","v":""},{"$f":"IF(OR(ISBLANK(C202),ISBLANK(E202)),\"\",C202/(4.189*978*E202/3600))","v":""},{"$f":"IF(ISBLANK(C202),\"\",C202/'Betriebsdaten II'!$T$26)","v":""},{"$f":"IF(ISERR(J202*L202),\"\",J202*L202)","v":""},"",{"$f":"IF(N202=\"\",\"\",IF(AND(N202<5,K202<30), \"Optimierungsmöglichkeiten prüfen!\",\"\"))","v":""}]
[null,null,null,null,null,null,null,"","","","",{"$f":"IF(ISBLANK(C203),\"\",C203/'Betriebsdaten II'!$T$26)","v":""},"",{"$f":"IF(ISERR(RANK(M203,$M$10:$M$1210)),\"\",RANK(M203,$M$10:$M$1210))","v":""},""]
[null,null,null,null,null,null,null,"","","","",{"$f":"IF(ISBLANK(C204),\"\",C204/'Betriebsdaten II'!$T$26)","v":""},"","",""]
[null,null,null,null,null,null,null,"","","","",{"$f":"IF(ISBLANK(C205),\"\",C205/'Betriebsdaten II'!$T$26)","v":""},"","",""]
[null,null,null,null,null,null,null,"","","","",{"$f":"IF(ISBLANK(C206),\"\",C206/'Betriebsdaten II'!$T$26)","v":""},"","",""]
[null,null,null,null,null,null,null,"","","","",{"$f":"IF(ISBLANK(C207),\"\",C207/'Betriebsdaten II'!$T$26)","v":""},"","",""]
[null,null,null,null,null,null,null,"","","","",{"$f":"IF(ISBLANK(C208),\"\",C208/'Betriebsdaten II'!$T$26)","v":""},"","",""]
[null,null,null,null,null,null,null,"","","","",{"$f":"IF(ISBLANK(C209),\"\",C209/'Betriebsdaten II'!$T$26)","v":""},"","",""]
[null,null,null,null,null,null,null,"","","","",{"$f":"IF(ISBLANK(C210),\"\",C210/'Betriebsdaten II'!$T$26)","v":""},"","",""]
[null,null,null,null,null,null,null,"","","","",{"$f":"IF(ISBLANK(C211),\"\",C211/'Betriebsdaten II'!$T$26)","v":""},"","",""]
[null,null,null,null,null,null,null,"","","","",{"$f":"IF(ISBLANK(C212),\"\",C212/'Betriebsdaten II'!$T$26)","v":""},"","",""]
[null,null,null,null,null,null,null,"","","","",{"$f":"IF(ISBLANK(C213),\"\",C213/'Betriebsdaten II'!$T$26)","v":""},"","",""]
[null,null,null,null,null,null,null,"","","","",{"$f":"IF(ISBLANK(C214),\"\",C214/'Betriebsdaten II'!$T$26)","v":""},"","",""]
[null,null,null,null,null,null,null,"","","","",{"$f":"IF(ISBLANK(C215),\"\",C215/'Betriebsdaten II'!$T$26)","v":""},"","",""]
[null,null,null,null,null,null,null,"","","","",{"$f":"IF(ISBLANK(C216),\"\",C216/'Betriebsdaten II'!$T$26)","v":""},"","",""]
[null,null,null,null,null,null,null,"","","","",{"$f":"IF(ISBLANK(C217),\"\",C217/'Betriebsdaten II'!$T$26)","v":""},"","",""]
[null,null,null,null,null,null,null,"","","","",{"$f":"IF(ISBLANK(C218),\"\",C218/'Betriebsdaten II'!$T$26)","v":""},"","",""]
[null,null,null,null,null,null,null,"","","","",{"$f":"IF(ISBLANK(C219),\"\",C219/'Betriebsdaten II'!$T$26)","v":""},"","",""]
[null,null,null,null,null,null,null,"","","","",{"$f":"IF(ISBLANK(C220),\"\",C220/'Betriebsdaten II'!$T$26)","v":""},"","",""]
[null,null,null,null,null,null,null,"","","","",{"$f":"IF(ISBLANK(C221),\"\",C221/'Betriebsdaten II'!$T$26)","v":""},"","",""]
[null,null,null,null,null,null,null,"","","","",{"$f":"IF(ISBLANK(C222),\"\",C222/'Betriebsdaten II'!$T$26)","v":""},"","",""]
[null,null,null,null,null,null,null,"","","","",{"$f":"IF(ISBLANK(C223),\"\",C223/'Betriebsdaten II'!$T$26)","v":""},"","",""]
[null,null,null,null,null,null,null,"","","","",{"$f":"IF(ISBLANK(C224),\"\",C224/'Betriebsdaten II'!$T$26)","v":""},"","",""]
[null,null,null,null,null,null,null,"","","","",{"$f":"IF(ISBLANK(C225),\"\",C225/'Betriebsdaten II'!$T$26)","v":""},"","",""]
[null,null,null,null,null,null,null,"","","","",{"$f":"IF(ISBLANK(C226),\"\",C226/'Betriebsdaten II'!$T$26)","v":""},"","",""]
[null,null,null,null,null,null,null,"","","","",{"$f":"IF(ISBLANK(C227),\"\",C227/'Betriebsdaten II'!$T$26)","v":""},"","",""]
[null,null,null,null,null,null,null,"","","","",{"$f":"IF(ISBLANK(C228),\"\",C228/'Betriebsdaten II'!$T$26)","v":""},"","",""]
[null,null,null,null,null,null,null,"","","","",{"$f":"IF(ISBLANK(C229),\"\",C229/'Betriebsdaten II'!$T$26)","v":""},"","",""]
[null,null,null,null,null,null,null,"","","","",{"$f":"IF(ISBLANK(C230),\"\",C230/'Betriebsdaten II'!$T$26)","v":""},"","",""]
[null,null,null,null,null,null,null,"","","","",{"$f":"IF(ISBLANK(C231),\"\",C231/'Betriebsdaten II'!$T$26)","v":""},"","",""]
[null,null,null,null,null,null,null,"","","","",{"$f":"IF(ISBLANK(C232),\"\",C232/'Betriebsdaten II'!$T$26)","v":""},"","",""]
[null,null,null,null,null,null,null,"","","","",{"$f":"IF(ISBLANK(C233),\"\",C233/'Betriebsdaten II'!$T$26)","v":""},"","",""]
[null,null,null,null,null,null,null,"","","","",{"$f":"IF(ISBLANK(C234),\"\",C234/'Betriebsdaten II'!$T$26)","v":""},"","",""]
[null,null,null,null,null,null,null,"","","","",{"$f":"IF(ISBLANK(C235),\"\",C235/'Betriebsdaten II'!$T$26)","v":""},"","",""]
[null,null,null,null,null,null,null,"","","","",{"$f":"IF(ISBLANK(C236),\"\",C236/'Betriebsdaten II'!$T$26)","v":""},"","",""]
[null,null,null,null,null,null,null,"","","","",{"$f":"IF(ISBLANK(C237),\"\",C237/'Betriebsdaten II'!$T$26)","v":""},"","",""]
[null,null,null,null,null,null,null,"","","","",{"$f":"IF(ISBLANK(C238),\"\",C238/'Betriebsdaten II'!$T$26)","v":""},"","",""]
[null,null,null,null,null,null,null,"","","","",{"$f":"IF(ISBLANK(C239),\"\",C239/'Betriebsdaten II'!$T$26)","v":""},"","",""]
[null,null,null,null,null,null,null,"","","","",{"$f":"IF(ISBLANK(C240),\"\",C240/'Betriebsdaten II'!$T$26)","v":""},"","",""]
[null,null,null,null,null,null,null,"","","","",{"$f":"IF(ISBLANK(C241),\"\",C241/'Betriebsdaten II'!$T$26)","v":""},"","",""]
[null,null,null,null,null,null,null,"","","","",{"$f":"IF(ISBLANK(C242),\"\",C242/'Betriebsdaten II'!$T$26)","v":""},"","",""]
[null,null,null,null,null,null,null,"","","","",{"$f":"IF(ISBLANK(C243),\"\",C243/'Betriebsdaten II'!$T$26)","v":""},"","",""]
[null,null,null,null,null,null,null,"","","","",{"$f":"IF(ISBLANK(C244),\"\",C244/'Betriebsdaten II'!$T$26)","v":""},"","",""]
[null,null,null,null,null,null,null,"","","","",{"$f":"IF(ISBLANK(C245),\"\",C245/'Betriebsdaten II'!$T$26)","v":""},"","",""]
[null,null,null,null,null,null,null,"","","","",{"$f":"IF(ISBLANK(C246),\"\",C246/'Betriebsdaten II'!$T$26)","v":""},"","",""]
[null,null,null,null,null,null,null,"","","","",{"$f":"IF(ISBLANK(C247),\"\",C247/'Betriebsdaten II'!$T$26)","v":""},"","",""]
[null,null,null,null,null,null,null,"","","","",{"$f":"IF(ISBLANK(C248),\"\",C248/'Betriebsdaten II'!$T$26)","v":""},"","",""]
[null,null,null,null,null,null,null,"","","","",{"$f":"IF(ISBLANK(C249),\"\",C249/'Betriebsdaten II'!$T$26)","v":""},"","",""]
[null,null,null,null,null,null,null,"","","","",{"$f":"IF(ISBLANK(C250),\"\",C250/'Betriebsdaten II'!$T$26)","v":""},"","",""]
[null,null,null,null,null,null,null,"","","","",{"$f":"IF(ISBLANK(C251),\"\",C251/'Betriebsdaten II'!$T$26)","v":""},"","",""]
[null,null,null,null,null,null,null,"","","","",{"$f":"IF(ISBLANK(C252),\"\",C252/'Betriebsdaten II'!$T$26)","v":""},"","",""]
[null,null,null,null,null,null,null,"","","","",{"$f":"IF(ISBLANK(C253),\"\",C253/'Betriebsdaten II'!$T$26)","v":""},"","",""]
[null,null,null,null,null,null,null,"","","","",{"$f":"IF(ISBLANK(C254),\"\",C254/'Betriebsdaten II'!$T$26)","v":""},"","",""]
[null,null,null,null,null,null,null,"","","","",{"$f":"IF(ISBLANK(C255),\"\",C255/'Betriebsdaten II'!$T$26)","v":""},"","",""]
[null,null,null,null,null,null,null,"","","","",{"$f":"IF(ISBLANK(C256),\"\",C256/'Betriebsdaten II'!$T$26)","v":""},"","",""]
[null,null,null,null,null,null,null,"","","","",{"$f":"IF(ISBLANK(C257),\"\",C257/'Betriebsdaten II'!$T$26)","v":""},"","",""]
[null,null,null,null,null,null,null,"","","","",{"$f":"IF(ISBLANK(C258),\"\",C258/'Betriebsdaten II'!$T$26)","v":""},"","",""]
[null,null,null,null,null,null,null,"","","","",{"$f":"IF(ISBLANK(C259),\"\",C259/'Betriebsdaten II'!$T$26)","v":""},"","",""]
[null,null,null,null,null,null,null,"","","","",{"$f":"IF(ISBLANK(C260),\"\",C260/'Betriebsdaten II'!$T$26)","v":""},"","",""]
[null,null,null,null,null,null,null,"","","","",{"$f":"IF(ISBLANK(C261),\"\",C261/'Betriebsdaten II'!$T$26)","v":""},"","",""]
[null,null,null,null,null,null,null,"","","","",{"$f":"IF(ISBLANK(C262),\"\",C262/'Betriebsdaten II'!$T$26)","v":""},"","",""]
[null,null,null,null,null,null,null,"","","","",{"$f":"IF(ISBLANK(C263),\"\",C263/'Betriebsdaten II'!$T$26)","v":""},"","",""]
[null,null,null,null,null,null,null,"","","","",{"$f":"IF(ISBLANK(C264),\"\",C264/'Betriebsdaten II'!$T$26)","v":""},"","",""]
[null,null,null,null,null,null,null,"","","","",{"$f":"IF(ISBLANK(C265),\"\",C265/'Betriebsdaten II'!$T$26)","v":""},"","",""]
[null,null,null,null,null,null,null,{"$f":"IF(ISBLANK(A266),\"\",NetzvorlaufTemp)","v":""},{"$f":"IF(ISBLANK(A266),\"\",NetzrücklaufTemp)","v":""},{"$f":"IF(OR(ISBLANK(C266),ISBLANK(E266)),\"\",E266/C266*1000)","v":""},{"$f":"IF(OR(ISBLANK(C266),ISBLANK(E266)),\"\",C266/(4.189*978*E266/3600))","v":""},{"$f":"IF(ISBLANK(C266),\"\",C266/'Betriebsdaten II'!$T$26)","v":""},{"$f":"IF(ISERR(J266*L266),\"\",J266*L266)","v":""},"",{"$f":"IF(N266=\"\",\"\",IF(AND(N266<5,K266<30), \"Optimierungsmöglichkeiten prüfen!\",\"\"))","v":""}]
[null,null,null,null,null,null,null,"","","","",{"$f":"IF(ISBLANK(C267),\"\",C267/'Betriebsdaten II'!$T$26)","v":""},"",{"$f":"IF(ISERR(RANK(M267,$M$10:$M$1210)),\"\",RANK(M267,$M$10:$M$1210))","v":""},""]
[null,null,null,null,null,null,null,"","","","",{"$f":"IF(ISBLANK(C268),\"\",C268/'Betriebsdaten II'!$T$26)","v":""},"","",""]
[null,null,null,null,null,null,null,"","","","",{"$f":"IF(ISBLANK(C269),\"\",C269/'Betriebsdaten II'!$T$26)","v":""},"","",""]
[null,null,null,null,null,null,null,"","","","",{"$f":"IF(ISBLANK(C270),\"\",C270/'Betriebsdaten II'!$T$26)","v":""},"","",""]
[null,null,null,null,null,null,null,"","","","",{"$f":"IF(ISBLANK(C271),\"\",C271/'Betriebsdaten II'!$T$26)","v":""},"","",""]
[null,null,null,null,null,null,null,"","","","",{"$f":"IF(ISBLANK(C272),\"\",C272/'Betriebsdaten II'!$T$26)","v":""},"","",""]
[null,null,null,null,null,null,null,"","","","",{"$f":"IF(ISBLANK(C273),\"\",C273/'Betriebsdaten II'!$T$26)","v":""},"","",""]
[null,null,null,null,null,null,null,"","","","",{"$f":"IF(ISBLANK(C274),\"\",C274/'Betriebsdaten II'!$T$26)","v":""},"","",""]
[null,null,null,null,null,null,null,"","","","",{"$f":"IF(ISBLANK(C275),\"\",C275/'Betriebsdaten II'!$T$26)","v":""},"","",""]
[null,null,null,null,null,null,null,"","","","",{"$f":"IF(ISBLANK(C276),\"\",C276/'Betriebsdaten II'!$T$26)","v":""},"","",""]
[null,null,null,null,null,null,null,"","","","",{"$f":"IF(ISBLANK(C277),\"\",C277/'Betriebsdaten II'!$T$26)","v":""},"","",""]
[null,null,null,null,null,null,null,"","","","",{"$f":"IF(ISBLANK(C278),\"\",C278/'Betriebsdaten II'!$T$26)","v":""},"","",""]
[null,null,null,null,null,null,null,"","","","",{"$f":"IF(ISBLANK(C279),\"\",C279/'Betriebsdaten II'!$T$26)","v":""},"","",""]
[null,null,null,null,null,null,null,"","","","",{"$f":"IF(ISBLANK(C280),\"\",C280/'Betriebsdaten II'!$T$26)","v":""},"","",""]
[null,null,null,null,null,null,null,"","","","",{"$f":"IF(ISBLANK(C281),\"\",C281/'Betriebsdaten II'!$T$26)","v":""},"","",""]
[null,null,null,null,null,null,null,"","","","",{"$f":"IF(ISBLANK(C282),\"\",C282/'Betriebsdaten II'!$T$26)","v":""},"","",""]
[null,null,null,null,null,null,null,"","","","",{"$f":"IF(ISBLANK(C283),\"\",C283/'Betriebsdaten II'!$T$26)","v":""},"","",""]
[null,null,null,null,null,null,null,"","","","",{"$f":"IF(ISBLANK(C284),\"\",C284/'Betriebsdaten II'!$T$26)","v":""},"","",""]
[null,null,null,null,null,null,null,"","","","",{"$f":"IF(ISBLANK(C285),\"\",C285/'Betriebsdaten II'!$T$26)","v":""},"","",""]
[null,null,null,null,null,null,null,"","","","",{"$f":"IF(ISBLANK(C286),\"\",C286/'Betriebsdaten II'!$T$26)","v":""},"","",""]
[null,null,null,null,null,null,null,"","","","",{"$f":"IF(ISBLANK(C287),\"\",C287/'Betriebsdaten II'!$T$26)","v":""},"","",""]
[null,null,null,null,null,null,null,"","","","",{"$f":"IF(ISBLANK(C288),\"\",C288/'Betriebsdaten II'!$T$26)","v":""},"","",""]
[null,null,null,null,null,null,null,"","","","",{"$f":"IF(ISBLANK(C289),\"\",C289/'Betriebsdaten II'!$T$26)","v":""},"","",""]
[null,null,null,null,null,null,null,"","","","",{"$f":"IF(ISBLANK(C290),\"\",C290/'Betriebsdaten II'!$T$26)","v":""},"","",""]
[null,null,null,null,null,null,null,"","","","",{"$f":"IF(ISBLANK(C291),\"\",C291/'Betriebsdaten II'!$T$26)","v":""},"","",""]
[null,null,null,null,null,null,null,"","","","",{"$f":"IF(ISBLANK(C292),\"\",C292/'Betriebsdaten II'!$T$26)","v":""},"","",""]
[null,null,null,null,null,null,null,"","","","",{"$f":"IF(ISBLANK(C293),\"\",C293/'Betriebsdaten II'!$T$26)","v":""},"","",""]
[null,null,null,null,null,null,null,"","","","",{"$f":"IF(ISBLANK(C294),\"\",C294/'Betriebsdaten II'!$T$26)","v":""},"","",""]
[null,null,null,null,null,null,null,"","","","",{"$f":"IF(ISBLANK(C295),\"\",C295/'Betriebsdaten II'!$T$26)","v":""},"","",""]
[null,null,null,null,null,null,null,"","","","",{"$f":"IF(ISBLANK(C296),\"\",C296/'Betriebsdaten II'!$T$26)","v":""},"","",""]
[null,null,null,null,null,null,null,"","","","",{"$f":"IF(ISBLANK(C297),\"\",C297/'Betriebsdaten II'!$T$26)","v":""},"","",""]
[null,null,null,null,null,null,null,"","","","",{"$f":"IF(ISBLANK(C298),\"\",C298/'Betriebsdaten II'!$T$26)","v":""},"","",""]
[null,null,null,null,null,null,null,"","","","",{"$f":"IF(ISBLANK(C299),\"\",C299/'Betriebsdaten II'!$T$26)","v":""},"","",""]
[null,null,null,null,null,null,null,"","","","",{"$f":"IF(ISBLANK(C300),\"\",C300/'Betriebsdaten II'!$T$26)","v":""},"","",""]
[null,null,null,null,null,null,null,"","","","",{"$f":"IF(ISBLANK(C301),\"\",C301/'Betriebsdaten II'!$T$26)","v":""},"","",""]
[null,null,null,null,null,null,null,"","","","",{"$f":"IF(ISBLANK(C302),\"\",C302/'Betriebsdaten II'!$T$26)","v":""},"","",""]
[null,null,null,null,null,null,null,"","","","",{"$f":"IF(ISBLANK(C303),\"\",C303/'Betriebsdaten II'!$T$26)","v":""},"","",""]
[null,null,null,null,null,null,null,"","","","",{"$f":"IF(ISBLANK(C304),\"\",C304/'Betriebsdaten II'!$T$26)","v":""},"","",""]
[null,null,null,null,null,null,null,"","","","",{"$f":"IF(ISBLANK(C305),\"\",C305/'Betriebsdaten II'!$T$26)","v":""},"","",""]
[null,null,null,null,null,null,null,"","","","",{"$f":"IF(ISBLANK(C306),\"\",C306/'Betriebsdaten II'!$T$26)","v":""},"","",""]
[null,null,null,null,null,null,null,"","","","",{"$f":"IF(ISBLANK(C307),\"\",C307/'Betriebsdaten II'!$T$26)","v":""},"","",""]
[null,null,null,null,null,null,null,"","","","",{"$f":"IF(ISBLANK(C308),\"\",C308/'Betriebsdaten II'!$T$26)","v":""},"","",""]
[null,null,null,null,null,null,null,"","","","",{"$f":"IF(ISBLANK(C309),\"\",C309/'Betriebsdaten II'!$T$26)","v":""},"","",""]
[null,null,null,null,null,null,null,"","","","",{"$f":"IF(ISBLANK(C310),\"\",C310/'Betriebsdaten II'!$T$26)","v":""},"","",""]
[null,null,null,null,null,null,null,"","","","",{"$f":"IF(ISBLANK(C311),\"\",C311/'Betriebsdaten II'!$T$26)","v":""},"","",""]
[null,null,null,null,null,null,null,"","","","",{"$f":"IF(ISBLANK(C312),\"\",C312/'Betriebsdaten II'!$T$26)","v":""},"","",""]
[null,null,null,null,null,null,null,"","","","",{"$f":"IF(ISBLANK(C313),\"\",C313/'Betriebsdaten II'!$T$26)","v":""},"","",""]
[null,null,null,null,null,null,null,"","","","",{"$f":"IF(ISBLANK(C314),\"\",C314/'Betriebsdaten II'!$T$26)","v":""},"","",""]
[null,null,null,null,null,null,null,"","","","",{"$f":"IF(ISBLANK(C315),\"\",C315/'Betriebsdaten II'!$T$26)","v":""},"","",""]
[null,null,null,null,null,null,null,"","","","",{"$f":"IF(ISBLANK(C316),\"\",C316/'Betriebsdaten II'!$T$26)","v":""},"","",""]
[null,null,null,null,null,null,null,"","","","",{"$f":"IF(ISBLANK(C317),\"\",C317/'Betriebsdaten II'!$T$26)","v":""},"","",""]
[null,null,null,null,null,null,null,"","","","",{"$f":"IF(ISBLANK(C318),\"\",C318/'Betriebsdaten II'!$T$26)","v":""},"","",""]
[null,null,null,null,null,null,null,"","","","",{"$f":"IF(ISBLANK(C319),\"\",C319/'Betriebsdaten II'!$T$26)","v":""},"","",""]
[null,null,null,null,null,null,null,"","","","",{"$f":"IF(ISBLANK(C320),\"\",C320/'Betriebsdaten II'!$T$26)","v":""},"","",""]
[null,null,null,null,null,null,null,"","","","",{"$f":"IF(ISBLANK(C321),\"\",C321/'Betriebsdaten II'!$T$26)","v":""},"","",""]
[null,null,null,null,null,null,null,"","","","",{"$f":"IF(ISBLANK(C322),\"\",C322/'Betriebsdaten II'!$T$26)","v":""},"","",""]
[null,null,null,null,null,null,null,"","","","",{"$f":"IF(ISBLANK(C323),\"\",C323/'Betriebsdaten II'!$T$26)","v":""},"","",""]
[null,null,null,null,null,null,null,"","","","",{"$f":"IF(ISBLANK(C324),\"\",C324/'Betriebsdaten II'!$T$26)","v":""},"","",""]
[null,null,null,null,null,null,null,"","","","",{"$f":"IF(ISBLANK(C325),\"\",C325/'Betriebsdaten II'!$T$26)","v":""},"","",""]
[null,null,null,null,null,null,null,"","","","",{"$f":"IF(ISBLANK(C326),\"\",C326/'Betriebsdaten II'!$T$26)","v":""},"","",""]
[null,null,null,null,null,null,null,"","","","",{"$f":"IF(ISBLANK(C327),\"\",C327/'Betriebsdaten II'!$T$26)","v":""},"","",""]
[null,null,null,null,null,null,null,"","","","",{"$f":"IF(ISBLANK(C328),\"\",C328/'Betriebsdaten II'!$T$26)","v":""},"","",""]
[null,null,null,null,null,null,null,"","","","",{"$f":"IF(ISBLANK(C329),\"\",C329/'Betriebsdaten II'!$T$26)","v":""},"","",""]
[null,null,null,null,null,null,null,{"$f":"IF(ISBLANK(A330),\"\",NetzvorlaufTemp)","v":""},{"$f":"IF(ISBLANK(A330),\"\",NetzrücklaufTemp)","v":""},{"$f":"IF(OR(ISBLANK(C330),ISBLANK(E330)),\"\",E330/C330*1000)","v":""},{"$f":"IF(OR(ISBLANK(C330),ISBLANK(E330)),\"\",C330/(4.189*978*E330/3600))","v":""},{"$f":"IF(ISBLANK(C330),\"\",C330/'Betriebsdaten II'!$T$26)","v":""},{"$f":"IF(ISERR(J330*L330),\"\",J330*L330)","v":""},"",{"$f":"IF(N330=\"\",\"\",IF(AND(N330<5,K330<30), \"Optimierungsmöglichkeiten prüfen!\",\"\"))","v":""}]
[null,null,null,null,null,null,null,"","","","",{"$f":"IF(ISBLANK(C331),\"\",C331/'Betriebsdaten II'!$T$26)","v":""},"",{"$f":"IF(ISERR(RANK(M331,$M$10:$M$1210)),\"\",RANK(M331,$M$10:$M$1210))","v":""},""]
[null,null,null,null,null,null,null,"","","","",{"$f":"IF(ISBLANK(C332),\"\",C332/'Betriebsdaten II'!$T$26)","v":""},"","",""]
[null,null,null,null,null,null,null,"","","","",{"$f":"IF(ISBLANK(C333),\"\",C333/'Betriebsdaten II'!$T$26)","v":""},"","",""]
[null,null,null,null,null,null,null,"","","","",{"$f":"IF(ISBLANK(C334),\"\",C334/'Betriebsdaten II'!$T$26)","v":""},"","",""]
[null,null,null,null,null,null,null,"","","","",{"$f":"IF(ISBLANK(C335),\"\",C335/'Betriebsdaten II'!$T$26)","v":""},"","",""]
[null,null,null,null,null,null,null,"","","","",{"$f":"IF(ISBLANK(C336),\"\",C336/'Betriebsdaten II'!$T$26)","v":""},"","",""]
[null,null,null,null,null,null,null,"","","","",{"$f":"IF(ISBLANK(C337),\"\",C337/'Betriebsdaten II'!$T$26)","v":""},"","",""]
[null,null,null,null,null,null,null,"","","","",{"$f":"IF(ISBLANK(C338),\"\",C338/'Betriebsdaten II'!$T$26)","v":""},"","",""]
[null,null,null,null,null,null,null,"","","","",{"$f":"IF(ISBLANK(C339),\"\",C339/'Betriebsdaten II'!$T$26)","v":""},"","",""]
[null,null,null,null,null,null,null,"","","","",{"$f":"IF(ISBLANK(C340),\"\",C340/'Betriebsdaten II'!$T$26)","v":""},"","",""]
[null,null,null,null,null,null,null,"","","","",{"$f":"IF(ISBLANK(C341),\"\",C341/'Betriebsdaten II'!$T$26)","v":""},"","",""]
[null,null,null,null,null,null,null,"","","","",{"$f":"IF(ISBLANK(C342),\"\",C342/'Betriebsdaten II'!$T$26)","v":""},"","",""]
[null,null,null,null,null,null,null,"","","","",{"$f":"IF(ISBLANK(C343),\"\",C343/'Betriebsdaten II'!$T$26)","v":""},"","",""]
[null,null,null,null,null,null,null,"","","","",{"$f":"IF(ISBLANK(C344),\"\",C344/'Betriebsdaten II'!$T$26)","v":""},"","",""]
[null,null,null,null,null,null,null,"","","","",{"$f":"IF(ISBLANK(C345),\"\",C345/'Betriebsdaten II'!$T$26)","v":""},"","",""]
[null,null,null,null,null,null,null,"","","","",{"$f":"IF(ISBLANK(C346),\"\",C346/'Betriebsdaten II'!$T$26)","v":""},"","",""]
[null,null,null,null,null,null,null,"","","","",{"$f":"IF(ISBLANK(C347),\"\",C347/'Betriebsdaten II'!$T$26)","v":""},"","",""]
[null,null,null,null,null,null,null,"","","","",{"$f":"IF(ISBLANK(C348),\"\",C348/'Betriebsdaten II'!$T$26)","v":""},"","",""]
[null,null,null,null,null,null,null,"","","","",{"$f":"IF(ISBLANK(C349),\"\",C349/'Betriebsdaten II'!$T$26)","v":""},"","",""]
[null,null,null,null,null,null,null,"","","","",{"$f":"IF(ISBLANK(C350),\"\",C350/'Betriebsdaten II'!$T$26)","v":""},"","",""]
[null,null,null,null,null,null,null,"","","","",{"$f":"IF(ISBLANK(C351),\"\",C351/'Betriebsdaten II'!$T$26)","v":""},"","",""]
[null,null,null,null,null,null,null,"","","","",{"$f":"IF(ISBLANK(C352),\"\",C352/'Betriebsdaten II'!$T$26)","v":""},"","",""]
[null,null,null,null,null,null,null,"","","","",{"$f":"IF(ISBLANK(C353),\"\",C353/'Betriebsdaten II'!$T$26)","v":""},"","",""]
[null,null,null,null,null,null,null,"","","","",{"$f":"IF(ISBLANK(C354),\"\",C354/'Betriebsdaten II'!$T$26)","v":""},"","",""]
[null,null,null,null,null,null,null,"","","","",{"$f":"IF(ISBLANK(C355),\"\",C355/'Betriebsdaten II'!$T$26)","v":""},"","",""]
[null,null,null,null,null,null,null,"","","","",{"$f":"IF(ISBLANK(C356),\"\",C356/'Betriebsdaten II'!$T$26)","v":""},"","",""]
[null,null,null,null,null,null,null,"","","","",{"$f":"IF(ISBLANK(C357),\"\",C357/'Betriebsdaten II'!$T$26)","v":""},"","",""]
[null,null,null,null,null,null,null,"","","","",{"$f":"IF(ISBLANK(C358),\"\",C358/'Betriebsdaten II'!$T$26)","v":""},"","",""]
[null,null,null,null,null,null,null,"","","","",{"$f":"IF(ISBLANK(C359),\"\",C359/'Betriebsdaten II'!$T$26)","v":""},"","",""]
[null,null,null,null,null,null,null,"","","","",{"$f":"IF(ISBLANK(C360),\"\",C360/'Betriebsdaten II'!$T$26)","v":""},"","",""]
[null,null,null,null,null,null,null,"","","","",{"$f":"IF(ISBLANK(C361),\"\",C361/'Betriebsdaten II'!$T$26)","v":""},"","",""]
[null,null,null,null,null,null,null,"","","","",{"$f":"IF(ISBLANK(C362),\"\",C362/'Betriebsdaten II'!$T$26)","v":""},"","",""]
[null,null,null,null,null,null,null,"","","","",{"$f":"IF(ISBLANK(C363),\"\",C363/'Betriebsdaten II'!$T$26)","v":""},"","",""]
[null,null,null,null,null,null,null,"","","","",{"$f":"IF(ISBLANK(C364),\"\",C364/'Betriebsdaten II'!$T$26)","v":""},"","",""]
[null,null,null,null,null,null,null,"","","","",{"$f":"IF(ISBLANK(C365),\"\",C365/'Betriebsdaten II'!$T$26)","v":""},"","",""]
[null,null,null,null,null,null,null,"","","","",{"$f":"IF(ISBLANK(C366),\"\",C366/'Betriebsdaten II'!$T$26)","v":""},"","",""]
[null,null,null,null,null,null,null,"","","","",{"$f":"IF(ISBLANK(C367),\"\",C367/'Betriebsdaten II'!$T$26)","v":""},"","",""]
[null,null,null,null,null,null,null,"","","","",{"$f":"IF(ISBLANK(C368),\"\",C368/'Betriebsdaten II'!$T$26)","v":""},"","",""]
[null,null,null,null,null,null,null,"","","","",{"$f":"IF(ISBLANK(C369),\"\",C369/'Betriebsdaten II'!$T$26)","v":""},"","",""]
[null,null,null,null,null,null,null,"","","","",{"$f":"IF(ISBLANK(C370),\"\",C370/'Betriebsdaten II'!$T$26)","v":""},"","",""]
[null,null,null,null,null,null,null,"","","","",{"$f":"IF(ISBLANK(C371),\"\",C371/'Betriebsdaten II'!$T$26)","v":""},"","",""]
[null,null,null,null,null,null,null,"","","","",{"$f":"IF(ISBLANK(C372),\"\",C372/'Betriebsdaten II'!$T$26)","v":""},"","",""]
[null,null,null,null,null,null,null,"","","","",{"$f":"IF(ISBLANK(C373),\"\",C373/'Betriebsdaten II'!$T$26)","v":""},"","",""]
[null,null,null,null,null,null,null,"","","","",{"$f":"IF(ISBLANK(C374),\"\",C374/'Betriebsdaten II'!$T$26)","v":""},"","",""]
[null,null,null,null,null,null,null,"","","","",{"$f":"IF(ISBLANK(C375),\"\",C375/'Betriebsdaten II'!$T$26)","v":""},"","",""]
[null,null,null,null,null,null,null,"","","","",{"$f":"IF(ISBLANK(C376),\"\",C376/'Betriebsdaten II'!$T$26)","v":""},"","",""]
[null,null,null,null,null,null,null,"","","","",{"$f":"IF(ISBLANK(C377),\"\",C377/'Betriebsdaten II'!$T$26)","v":""},"","",""]
[null,null,null,null,null,null,null,"","","","",{"$f":"IF(ISBLANK(C378),\"\",C378/'Betriebsdaten II'!$T$26)","v":""},"","",""]
[null,null,null,null,null,null,null,"","","","",{"$f":"IF(ISBLANK(C379),\"\",C379/'Betriebsdaten II'!$T$26)","v":""},"","",""]
[null,null,null,null,null,null,null,"","","","",{"$f":"IF(ISBLANK(C380),\"\",C380/'Betriebsdaten II'!$T$26)","v":""},"","",""]
[null,null,null,null,null,null,null,"","","","",{"$f":"IF(ISBLANK(C381),\"\",C381/'Betriebsdaten II'!$T$26)","v":""},"","",""]
[null,null,null,null,null,null,null,"","","","",{"$f":"IF(ISBLANK(C382),\"\",C382/'Betriebsdaten II'!$T$26)","v":""},"","",""]
[null,null,null,null,null,null,null,"","","","",{"$f":"IF(ISBLANK(C383),\"\",C383/'Betriebsdaten II'!$T$26)","v":""},"","",""]
[null,null,null,null,null,null,null,"","","","",{"$f":"IF(ISBLANK(C384),\"\",C384/'Betriebsdaten II'!$T$26)","v":""},"","",""]
[null,null,null,null,null,null,null,"","","","",{"$f":"IF(ISBLANK(C385),\"\",C385/'Betriebsdaten II'!$T$26)","v":""},"","",""]
[null,null,null,null,null,null,null,"","","","",{"$f":"IF(ISBLANK(C386),\"\",C386/'Betriebsdaten II'!$T$26)","v":""},"","",""]
[null,null,null,null,null,null,null,"","","","",{"$f":"IF(ISBLANK(C387),\"\",C387/'Betriebsdaten II'!$T$26)","v":""},"","",""]
[null,null,null,null,null,null,null,"","","","",{"$f":"IF(ISBLANK(C388),\"\",C388/'Betriebsdaten II'!$T$26)","v":""},"","",""]
[null,null,null,null,null,null,null,"","","","",{"$f":"IF(ISBLANK(C389),\"\",C389/'Betriebsdaten II'!$T$26)","v":""},"","",""]
[null,null,null,null,null,null,null,"","","","",{"$f":"IF(ISBLANK(C390),\"\",C390/'Betriebsdaten II'!$T$26)","v":""},"","",""]
[null,null,null,null,null,null,null,"","","","",{"$f":"IF(ISBLANK(C391),\"\",C391/'Betriebsdaten II'!$T$26)","v":""},"","",""]
[null,null,null,null,null,null,null,"","","","",{"$f":"IF(ISBLANK(C392),\"\",C392/'Betriebsdaten II'!$T$26)","v":""},"","",""]
[null,null,null,null,null,null,null,"","","","",{"$f":"IF(ISBLANK(C393),\"\",C393/'Betriebsdaten II'!$T$26)","v":""},"","",""]
[null,null,null,null,null,null,null,{"$f":"IF(ISBLANK(A394),\"\",NetzvorlaufTemp)","v":""},{"$f":"IF(ISBLANK(A394),\"\",NetzrücklaufTemp)","v":""},{"$f":"IF(OR(ISBLANK(C394),ISBLANK(E394)),\"\",E394/C394*1000)","v":""},{"$f":"IF(OR(ISBLANK(C394),ISBLANK(E394)),\"\",C394/(4.189*978*E394/3600))","v":""},{"$f":"IF(ISBLANK(C394),\"\",C394/'Betriebsdaten II'!$T$26)","v":""},{"$f":"IF(ISERR(J394*L394),\"\",J394*L394)","v":""},"",{"$f":"IF(N394=\"\",\"\",IF(AND(N394<5,K394<30), \"Optimierungsmöglichkeiten prüfen!\",\"\"))","v":""}]
[null,null,null,null,null,null,null,"","","","",{"$f":"IF(ISBLANK(C395),\"\",C395/'Betriebsdaten II'!$T$26)","v":""},"",{"$f":"IF(ISERR(RANK(M395,$M$10:$M$1210)),\"\",RANK(M395,$M$10:$M$1210))","v":""},""]
[null,null,null,null,null,null,null,"","","","",{"$f":"IF(ISBLANK(C396),\"\",C396/'Betriebsdaten II'!$T$26)","v":""},"","",""]
[null,null,null,null,null,null,null,"","","","",{"$f":"IF(ISBLANK(C397),\"\",C397/'Betriebsdaten II'!$T$26)","v":""},"","",""]
[null,null,null,null,null,null,null,"","","","",{"$f":"IF(ISBLANK(C398),\"\",C398/'Betriebsdaten II'!$T$26)","v":""},"","",""]
[null,null,null,null,null,null,null,"","","","",{"$f":"IF(ISBLANK(C399),\"\",C399/'Betriebsdaten II'!$T$26)","v":""},"","",""]
[null,null,null,null,null,null,null,"","","","",{"$f":"IF(ISBLANK(C400),\"\",C400/'Betriebsdaten II'!$T$26)","v":""},"","",""]
[null,null,null,null,null,null,null,"","","","",{"$f":"IF(ISBLANK(C401),\"\",C401/'Betriebsdaten II'!$T$26)","v":""},"","",""]
[null,null,null,null,null,null,null,"","","","",{"$f":"IF(ISBLANK(C402),\"\",C402/'Betriebsdaten II'!$T$26)","v":""},"","",""]
[null,null,null,null,null,null,null,"","","","",{"$f":"IF(ISBLANK(C403),\"\",C403/'Betriebsdaten II'!$T$26)","v":""},"","",""]
[null,null,null,null,null,null,null,"","","","",{"$f":"IF(ISBLANK(C404),\"\",C404/'Betriebsdaten II'!$T$26)","v":""},"","",""]
[null,null,null,null,null,null,null,"","","","",{"$f":"IF(ISBLANK(C405),\"\",C405/'Betriebsdaten II'!$T$26)","v":""},"","",""]
[null,null,null,null,null,null,null,"","","","",{"$f":"IF(ISBLANK(C406),\"\",C406/'Betriebsdaten II'!$T$26)","v":""},"","",""]
[null,null,null,null,null,null,null,"","","","",{"$f":"IF(ISBLANK(C407),\"\",C407/'Betriebsdaten II'!$T$26)","v":""},"","",""]
[null,null,null,null,null,null,null,"","","","",{"$f":"IF(ISBLANK(C408),\"\",C408/'Betriebsdaten II'!$T$26)","v":""},"","",""]
[null,null,null,null,null,null,null,"","","","",{"$f":"IF(ISBLANK(C409),\"\",C409/'Betriebsdaten II'!$T$26)","v":""},"","",""]
[null,null,null,null,null,null,null,"","","","",{"$f":"IF(ISBLANK(C410),\"\",C410/'Betriebsdaten II'!$T$26)","v":""},"","",""]
[null,null,null,null,null,null,null,"","","","",{"$f":"IF(ISBLANK(C411),\"\",C411/'Betriebsdaten II'!$T$26)","v":""},"","",""]
[null,null,null,null,null,null,null,"","","","",{"$f":"IF(ISBLANK(C412),\"\",C412/'Betriebsdaten II'!$T$26)","v":""},"","",""]
[null,null,null,null,null,null,null,"","","","",{"$f":"IF(ISBLANK(C413),\"\",C413/'Betriebsdaten II'!$T$26)","v":""},"","",""]
[null,null,null,null,null,null,null,"","","","",{"$f":"IF(ISBLANK(C414),\"\",C414/'Betriebsdaten II'!$T$26)","v":""},"","",""]
[null,null,null,null,null,null,null,"","","","",{"$f":"IF(ISBLANK(C415),\"\",C415/'Betriebsdaten II'!$T$26)","v":""},"","",""]
[null,null,null,null,null,null,null,"","","","",{"$f":"IF(ISBLANK(C416),\"\",C416/'Betriebsdaten II'!$T$26)","v":""},"","",""]
[null,null,null,null,null,null,null,"","","","",{"$f":"IF(ISBLANK(C417),\"\",C417/'Betriebsdaten II'!$T$26)","v":""},"","",""]
[null,null,null,null,null,null,null,"","","","",{"$f":"IF(ISBLANK(C418),\"\",C418/'Betriebsdaten II'!$T$26)","v":""},"","",""]
[null,null,null,null,null,null,null,"","","","",{"$f":"IF(ISBLANK(C419),\"\",C419/'Betriebsdaten II'!$T$26)","v":""},"","",""]
[null,null,null,null,null,null,null,"","","","",{"$f":"IF(ISBLANK(C420),\"\",C420/'Betriebsdaten II'!$T$26)","v":""},"","",""]
[null,null,null,null,null,null,null,"","","","",{"$f":"IF(ISBLANK(C421),\"\",C421/'Betriebsdaten II'!$T$26)","v":""},"","",""]
[null,null,null,null,null,null,null,"","","","",{"$f":"IF(ISBLANK(C422),\"\",C422/'Betriebsdaten II'!$T$26)","v":""},"","",""]
[null,null,null,null,null,null,null,"","","","",{"$f":"IF(ISBLANK(C423),\"\",C423/'Betriebsdaten II'!$T$26)","v":""},"","",""]
[null,null,null,null,null,null,null,"","","","",{"$f":"IF(ISBLANK(C424),\"\",C424/'Betriebsdaten II'!$T$26)","v":""},"","",""]
[null,null,null,null,null,null,null,"","","","",{"$f":"IF(ISBLANK(C425),\"\",C425/'Betriebsdaten II'!$T$26)","v":""},"","",""]
[null,null,null,null,null,null,null,"","","","",{"$f":"IF(ISBLANK(C426),\"\",C426/'Betriebsdaten II'!$T$26)","v":""},"","",""]
[null,null,null,null,null,null,null,"","","","",{"$f":"IF(ISBLANK(C427),\"\",C427/'Betriebsdaten II'!$T$26)","v":""},"","",""]
[null,null,null,null,null,null,null,"","","","",{"$f":"IF(ISBLANK(C428),\"\",C428/'Betriebsdaten II'!$T$26)","v":""},"","",""]
[null,null,null,null,null,null,null,"","","","",{"$f":"IF(ISBLANK(C429),\"\",C429/'Betriebsdaten II'!$T$26)","v":""},"","",""]
[null,null,null,null,null,null,null,"","","","",{"$f":"IF(ISBLANK(C430),\"\",C430/'Betriebsdaten II'!$T$26)","v":""},"","",""]
[null,null,null,null,null,null,null,"","","","",{"$f":"IF(ISBLANK(C431),\"\",C431/'Betriebsdaten II'!$T$26)","v":""},"","",""]
[null,null,null,null,null,null,null,"","","","",{"$f":"IF(ISBLANK(C432),\"\",C432/'Betriebsdaten II'!$T$26)","v":""},"","",""]
[null,null,null,null,null,null,null,"","","","",{"$f":"IF(ISBLANK(C433),\"\",C433/'Betriebsdaten II'!$T$26)","v":""},"","",""]
[null,null,null,null,null,null,null,"","","","",{"$f":"IF(ISBLANK(C434),\"\",C434/'Betriebsdaten II'!$T$26)","v":""},"","",""]
[null,null,null,null,null,null,null,"","","","",{"$f":"IF(ISBLANK(C435),\"\",C435/'Betriebsdaten II'!$T$26)","v":""},"","",""]
[null,null,null,null,null,null,null,"","","","",{"$f":"IF(ISBLANK(C436),\"\",C436/'Betriebsdaten II'!$T$26)","v":""},"","",""]
[null,null,null,null,null,null,null,"","","","",{"$f":"IF(ISBLANK(C437),\"\",C437/'Betriebsdaten II'!$T$26)","v":""},"","",""]
[null,null,null,null,null,null,null,"","","","",{"$f":"IF(ISBLANK(C438),\"\",C438/'Betriebsdaten II'!$T$26)","v":""},"","",""]
[null,null,null,null,null,null,null,"","","","",{"$f":"IF(ISBLANK(C439),\"\",C439/'Betriebsdaten II'!$T$26)","v":""},"","",""]
[null,null,null,null,null,null,null,"","","","",{"$f":"IF(ISBLANK(C440),\"\",C440/'Betriebsdaten II'!$T$26)","v":""},"","",""]
[null,null,null,null,null,null,null,"","","","",{"$f":"IF(ISBLANK(C441),\"\",C441/'Betriebsdaten II'!$T$26)","v":""},"","",""]
[null,null,null,null,null,null,null,"","","","",{"$f":"IF(ISBLANK(C442),\"\",C442/'Betriebsdaten II'!$T$26)","v":""},"","",""]
[null,null,null,null,null,null,null,"","","","",{"$f":"IF(ISBLANK(C443),\"\",C443/'Betriebsdaten II'!$T$26)","v":""},"","",""]
[null,null,null,null,null,null,null,"","","","",{"$f":"IF(ISBLANK(C444),\"\",C444/'Betriebsdaten II'!$T$26)","v":""},"","",""]
[null,null,null,null,null,null,null,"","","","",{"$f":"IF(ISBLANK(C445),\"\",C445/'Betriebsdaten II'!$T$26)","v":""},"","",""]
[null,null,null,null,null,null,null,"","","","",{"$f":"IF(ISBLANK(C446),\"\",C446/'Betriebsdaten II'!$T$26)","v":""},"","",""]
[null,null,null,null,null,null,null,"","","","",{"$f":"IF(ISBLANK(C447),\"\",C447/'Betriebsdaten II'!$T$26)","v":""},"","",""]
[null,null,null,null,null,null,null,"","","","",{"$f":"IF(ISBLANK(C448),\"\",C448/'Betriebsdaten II'!$T$26)","v":""},"","",""]
[null,null,null,null,null,null,null,"","","","",{"$f":"IF(ISBLANK(C449),\"\",C449/'Betriebsdaten II'!$T$26)","v":""},"","",""]
[null,null,null,null,null,null,null,"","","","",{"$f":"IF(ISBLANK(C450),\"\",C450/'Betriebsdaten II'!$T$26)","v":""},"","",""]
[null,null,null,null,null,null,null,"","","","",{"$f":"IF(ISBLANK(C451),\"\",C451/'Betriebsdaten II'!$T$26)","v":""},"","",""]
[null,null,null,null,null,null,null,"","","","",{"$f":"IF(ISBLANK(C452),\"\",C452/'Betriebsdaten II'!$T$26)","v":""},"","",""]
[null,null,null,null,null,null,null,"","","","",{"$f":"IF(ISBLANK(C453),\"\",C453/'Betriebsdaten II'!$T$26)","v":""},"","",""]
[null,null,null,null,null,null,null,"","","","",{"$f":"IF(ISBLANK(C454),\"\",C454/'Betriebsdaten II'!$T$26)","v":""},"","",""]
[null,null,null,null,null,null,null,"","","","",{"$f":"IF(ISBLANK(C455),\"\",C455/'Betriebsdaten II'!$T$26)","v":""},"","",""]
[null,null,null,null,null,null,null,"","","","",{"$f":"IF(ISBLANK(C456),\"\",C456/'Betriebsdaten II'!$T$26)","v":""},"","",""]
[null,null,null,null,null,null,null,"","","","",{"$f":"IF(ISBLANK(C457),\"\",C457/'Betriebsdaten II'!$T$26)","v":""},"","",""]
[null,null,null,null,null,null,null,{"$f":"IF(ISBLANK(A458),\"\",NetzvorlaufTemp)","v":""},{"$f":"IF(ISBLANK(A458),\"\",NetzrücklaufTemp)","v":""},{"$f":"IF(OR(ISBLANK(C458),ISBLANK(E458)),\"\",E458/C458*1000)","v":""},{"$f":"IF(OR(ISBLANK(C458),ISBLANK(E458)),\"\",C458/(4.189*978*E458/3600))","v":""},{"$f":"IF(ISBLANK(C458),\"\",C458/'Betriebsdaten II'!$T$26)","v":""},{"$f":"IF(ISERR(J458*L458),\"\",J458*L458)","v":""},"",{"$f":"IF(N458=\"\",\"\",IF(AND(N458<5,K458<30), \"Optimierungsmöglichkeiten prüfen!\",\"\"))","v":""}]
[null,null,null,null,null,null,null,"","","","",{"$f":"IF(ISBLANK(C459),\"\",C459/'Betriebsdaten II'!$T$26)","v":""},"",{"$f":"IF(ISERR(RANK(M459,$M$10:$M$1210)),\"\",RANK(M459,$M$10:$M$1210))","v":""},""]
[null,null,null,null,null,null,null,"","","","",{"$f":"IF(ISBLANK(C460),\"\",C460/'Betriebsdaten II'!$T$26)","v":""},"","",""]
[null,null,null,null,null,null,null,"","","","",{"$f":"IF(ISBLANK(C461),\"\",C461/'Betriebsdaten II'!$T$26)","v":""},"","",""]
[null,null,null,null,null,null,null,"","","","",{"$f":"IF(ISBLANK(C462),\"\",C462/'Betriebsdaten II'!$T$26)","v":""},"","",""]
[null,null,null,null,null,null,null,"","","","",{"$f":"IF(ISBLANK(C463),\"\",C463/'Betriebsdaten II'!$T$26)","v":""},"","",""]
[null,null,null,null,null,null,null,"","","","",{"$f":"IF(ISBLANK(C464),\"\",C464/'Betriebsdaten II'!$T$26)","v":""},"","",""]
[null,null,null,null,null,null,null,"","","","",{"$f":"IF(ISBLANK(C465),\"\",C465/'Betriebsdaten II'!$T$26)","v":""},"","",""]
[null,null,null,null,null,null,null,"","","","",{"$f":"IF(ISBLANK(C466),\"\",C466/'Betriebsdaten II'!$T$26)","v":""},"","",""]
[null,null,null,null,null,null,null,"","","","",{"$f":"IF(ISBLANK(C467),\"\",C467/'Betriebsdaten II'!$T$26)","v":""},"","",""]
[null,null,null,null,null,null,null,"","","","",{"$f":"IF(ISBLANK(C468),\"\",C468/'Betriebsdaten II'!$T$26)","v":""},"","",""]
[null,null,null,null,null,null,null,"","","","",{"$f":"IF(ISBLANK(C469),\"\",C469/'Betriebsdaten II'!$T$26)","v":""},"","",""]
[null,null,null,null,null,null,null,"","","","",{"$f":"IF(ISBLANK(C470),\"\",C470/'Betriebsdaten II'!$T$26)","v":""},"","",""]
[null,null,null,null,null,null,null,"","","","",{"$f":"IF(ISBLANK(C471),\"\",C471/'Betriebsdaten II'!$T$26)","v":""},"","",""]
[null,null,null,null,null,null,null,"","","","",{"$f":"IF(ISBLANK(C472),\"\",C472/'Betriebsdaten II'!$T$26)","v":""},"","",""]
[null,null,null,null,null,null,null,"","","","",{"$f":"IF(ISBLANK(C473),\"\",C473/'Betriebsdaten II'!$T$26)","v":""},"","",""]
[null,null,null,null,null,null,null,"","","","",{"$f":"IF(ISBLANK(C474),\"\",C474/'Betriebsdaten II'!$T$26)","v":""},"","",""]
[null,null,null,null,null,null,null,"","","","",{"$f":"IF(ISBLANK(C475),\"\",C475/'Betriebsdaten II'!$T$26)","v":""},"","",""]
[null,null,null,null,null,null,null,"","","","",{"$f":"IF(ISBLANK(C476),\"\",C476/'Betriebsdaten II'!$T$26)","v":""},"","",""]
[null,null,null,null,null,null,null,"","","","",{"$f":"IF(ISBLANK(C477),\"\",C477/'Betriebsdaten II'!$T$26)","v":""},"","",""]
[null,null,null,null,null,null,null,"","","","",{"$f":"IF(ISBLANK(C478),\"\",C478/'Betriebsdaten II'!$T$26)","v":""},"","",""]
[null,null,null,null,null,null,null,"","","","",{"$f":"IF(ISBLANK(C479),\"\",C479/'Betriebsdaten II'!$T$26)","v":""},"","",""]
[null,null,null,null,null,null,null,"","","","",{"$f":"IF(ISBLANK(C480),\"\",C480/'Betriebsdaten II'!$T$26)","v":""},"","",""]
[null,null,null,null,null,null,null,"","","","",{"$f":"IF(ISBLANK(C481),\"\",C481/'Betriebsdaten II'!$T$26)","v":""},"","",""]
[null,null,null,null,null,null,null,"","","","",{"$f":"IF(ISBLANK(C482),\"\",C482/'Betriebsdaten II'!$T$26)","v":""},"","",""]
[null,null,null,null,null,null,null,"","","","",{"$f":"IF(ISBLANK(C483),\"\",C483/'Betriebsdaten II'!$T$26)","v":""},"","",""]
[null,null,null,null,null,null,null,"","","","",{"$f":"IF(ISBLANK(C484),\"\",C484/'Betriebsdaten II'!$T$26)","v":""},"","",""]
[null,null,null,null,null,null,null,"","","","",{"$f":"IF(ISBLANK(C485),\"\",C485/'Betriebsdaten II'!$T$26)","v":""},"","",""]
[null,null,null,null,null,null,null,"","","","",{"$f":"IF(ISBLANK(C486),\"\",C486/'Betriebsdaten II'!$T$26)","v":""},"","",""]
[null,null,null,null,null,null,null,"","","","",{"$f":"IF(ISBLANK(C487),\"\",C487/'Betriebsdaten II'!$T$26)","v":""},"","",""]
[null,null,null,null,null,null,null,"","","","",{"$f":"IF(ISBLANK(C488),\"\",C488/'Betriebsdaten II'!$T$26)","v":""},"","",""]
[null,null,null,null,null,null,null,"","","","",{"$f":"IF(ISBLANK(C489),\"\",C489/'Betriebsdaten II'!$T$26)","v":""},"","",""]
[null,null,null,null,null,null,null,"","","","",{"$f":"IF(ISBLANK(C490),\"\",C490/'Betriebsdaten II'!$T$26)","v":""},"","",""]
[null,null,null,null,null,null,null,"","","","",{"$f":"IF(ISBLANK(C491),\"\",C491/'Betriebsdaten II'!$T$26)","v":""},"","",""]
[null,null,null,null,null,null,null,"","","","",{"$f":"IF(ISBLANK(C492),\"\",C492/'Betriebsdaten II'!$T$26)","v":""},"","",""]
[null,null,null,null,null,null,null,"","","","",{"$f":"IF(ISBLANK(C493),\"\",C493/'Betriebsdaten II'!$T$26)","v":""},"","",""]
[null,null,null,null,null,null,null,"","","","",{"$f":"IF(ISBLANK(C494),\"\",C494/'Betriebsdaten II'!$T$26)","v":""},"","",""]
[null,null,null,null,null,null,null,"","","","",{"$f":"IF(ISBLANK(C495),\"\",C495/'Betriebsdaten II'!$T$26)","v":""},"","",""]
[null,null,null,null,null,null,null,"","","","",{"$f":"IF(ISBLANK(C496),\"\",C496/'Betriebsdaten II'!$T$26)","v":""},"","",""]
[null,null,null,null,null,null,null,"","","","",{"$f":"IF(ISBLANK(C497),\"\",C497/'Betriebsdaten II'!$T$26)","v":""},"","",""]
[null,null,null,null,null,null,null,"","","","",{"$f":"IF(ISBLANK(C498),\"\",C498/'Betriebsdaten II'!$T$26)","v":""},"","",""]
[null,null,null,null,null,null,null,"","","","",{"$f":"IF(ISBLANK(C499),\"\",C499/'Betriebsdaten II'!$T$26)","v":""},"","",""]
[null,null,null,null,null,null,null,"","","","",{"$f":"IF(ISBLANK(C500),\"\",C500/'Betriebsdaten II'!$T$26)","v":""},"","",""]
[null,null,null,null,null,null,null,"","","","",{"$f":"IF(ISBLANK(C501),\"\",C501/'Betriebsdaten II'!$T$26)","v":""},"","",""]
[null,null,null,null,null,null,null,"","","","",{"$f":"IF(ISBLANK(C502),\"\",C502/'Betriebsdaten II'!$T$26)","v":""},"","",""]
[null,null,null,null,null,null,null,"","","","",{"$f":"IF(ISBLANK(C503),\"\",C503/'Betriebsdaten II'!$T$26)","v":""},"","",""]
[null,null,null,null,null,null,null,"","","","",{"$f":"IF(ISBLANK(C504),\"\",C504/'Betriebsdaten II'!$T$26)","v":""},"","",""]
[null,null,null,null,null,null,null,"","","","",{"$f":"IF(ISBLANK(C505),\"\",C505/'Betriebsdaten II'!$T$26)","v":""},"","",""]
[null,null,null,null,null,null,null,"","","","",{"$f":"IF(ISBLANK(C506),\"\",C506/'Betriebsdaten II'!$T$26)","v":""},"","",""]
[null,null,null,null,null,null,null,"","","","",{"$f":"IF(ISBLANK(C507),\"\",C507/'Betriebsdaten II'!$T$26)","v":""},"","",""]
[null,null,null,null,null,null,null,"","","","",{"$f":"IF(ISBLANK(C508),\"\",C508/'Betriebsdaten II'!$T$26)","v":""},"","",""]
[null,null,null,null,null,null,null,"","","","",{"$f":"IF(ISBLANK(C509),\"\",C509/'Betriebsdaten II'!$T$26)","v":""},"","",""]
[null,null,null,null,null,null,null,"","","","",{"$f":"IF(ISBLANK(C510),\"\",C510/'Betriebsdaten II'!$T$26)","v":""},"","",""]
[null,null,null,null,null,null,null,"","","","",{"$f":"IF(ISBLANK(C511),\"\",C511/'Betriebsdaten II'!$T$26)","v":""},"","",""]
[null,null,null,null,null,null,null,"","","","",{"$f":"IF(ISBLANK(C512),\"\",C512/'Betriebsdaten II'!$T$26)","v":""},"","",""]
[null,null,null,null,null,null,null,"","","","",{"$f":"IF(ISBLANK(C513),\"\",C513/'Betriebsdaten II'!$T$26)","v":""},"","",""]
[null,null,null,null,null,null,null,"","","","",{"$f":"IF(ISBLANK(C514),\"\",C514/'Betriebsdaten II'!$T$26)","v":""},"","",""]
[null,null,null,null,null,null,null,"","","","",{"$f":"IF(ISBLANK(C515),\"\",C515/'Betriebsdaten II'!$T$26)","v":""},"","",""]
[null,null,null,null,null,null,null,"","","","",{"$f":"IF(ISBLANK(C516),\"\",C516/'Betriebsdaten II'!$T$26)","v":""},"","",""]
[null,null,null,null,null,null,null,"","","","",{"$f":"IF(ISBLANK(C517),\"\",C517/'Betriebsdaten II'!$T$26)","v":""},"","",""]
[null,null,null,null,null,null,null,"","","","",{"$f":"IF(ISBLANK(C518),\"\",C518/'Betriebsdaten II'!$T$26)","v":""},"","",""]
[null,null,null,null,null,null,null,"","","","",{"$f":"IF(ISBLANK(C519),\"\",C519/'Betriebsdaten II'!$T$26)","v":""},"","",""]
[null,null,null,null,null,null,null,"","","","",{"$f":"IF(ISBLANK(C520),\"\",C520/'Betriebsdaten II'!$T$26)","v":""},"","",""]
[null,null,null,null,null,null,null,"","","","",{"$f":"IF(ISBLANK(C521),\"\",C521/'Betriebsdaten II'!$T$26)","v":""},"","",""]
[null,null,null,null,null,null,null,{"$f":"IF(ISBLANK(A522),\"\",NetzvorlaufTemp)","v":""},{"$f":"IF(ISBLANK(A522),\"\",NetzrücklaufTemp)","v":""},{"$f":"IF(OR(ISBLANK(C522),ISBLANK(E522)),\"\",E522/C522*1000)","v":""},{"$f":"IF(OR(ISBLANK(C522),ISBLANK(E522)),\"\",C522/(4.189*978*E522/3600))","v":""},{"$f":"IF(ISBLANK(C522),\"\",C522/'Betriebsdaten II'!$T$26)","v":""},{"$f":"IF(ISERR(J522*L522),\"\",J522*L522)","v":""},"",{"$f":"IF(N522=\"\",\"\",IF(AND(N522<5,K522<30), \"Optimierungsmöglichkeiten prüfen!\",\"\"))","v":""}]
[null,null,null,null,null,null,null,"","","","",{"$f":"IF(ISBLANK(C523),\"\",C523/'Betriebsdaten II'!$T$26)","v":""},"",{"$f":"IF(ISERR(RANK(M523,$M$10:$M$1210)),\"\",RANK(M523,$M$10:$M$1210))","v":""},""]
[null,null,null,null,null,null,null,"","","","",{"$f":"IF(ISBLANK(C524),\"\",C524/'Betriebsdaten II'!$T$26)","v":""},"","",""]
[null,null,null,null,null,null,null,"","","","",{"$f":"IF(ISBLANK(C525),\"\",C525/'Betriebsdaten II'!$T$26)","v":""},"","",""]
[null,null,null,null,null,null,null,"","","","",{"$f":"IF(ISBLANK(C526),\"\",C526/'Betriebsdaten II'!$T$26)","v":""},"","",""]
[null,null,null,null,null,null,null,"","","","",{"$f":"IF(ISBLANK(C527),\"\",C527/'Betriebsdaten II'!$T$26)","v":""},"","",""]
[null,null,null,null,null,null,null,"","","","",{"$f":"IF(ISBLANK(C528),\"\",C528/'Betriebsdaten II'!$T$26)","v":""},"","",""]
[null,null,null,null,null,null,null,"","","","",{"$f":"IF(ISBLANK(C529),\"\",C529/'Betriebsdaten II'!$T$26)","v":""},"","",""]
[null,null,null,null,null,null,null,"","","","",{"$f":"IF(ISBLANK(C530),\"\",C530/'Betriebsdaten II'!$T$26)","v":""},"","",""]
[null,null,null,null,null,null,null,"","","","",{"$f":"IF(ISBLANK(C531),\"\",C531/'Betriebsdaten II'!$T$26)","v":""},"","",""]
[null,null,null,null,null,null,null,"","","","",{"$f":"IF(ISBLANK(C532),\"\",C532/'Betriebsdaten II'!$T$26)","v":""},"","",""]
[null,null,null,null,null,null,null,"","","","",{"$f":"IF(ISBLANK(C533),\"\",C533/'Betriebsdaten II'!$T$26)","v":""},"","",""]
[null,null,null,null,null,null,null,"","","","",{"$f":"IF(ISBLANK(C534),\"\",C534/'Betriebsdaten II'!$T$26)","v":""},"","",""]
[null,null,null,null,null,null,null,"","","","",{"$f":"IF(ISBLANK(C535),\"\",C535/'Betriebsdaten II'!$T$26)","v":""},"","",""]
[null,null,null,null,null,null,null,"","","","",{"$f":"IF(ISBLANK(C536),\"\",C536/'Betriebsdaten II'!$T$26)","v":""},"","",""]
[null,null,null,null,null,null,null,"","","","",{"$f":"IF(ISBLANK(C537),\"\",C537/'Betriebsdaten II'!$T$26)","v":""},"","",""]
[null,null,null,null,null,null,null,"","","","",{"$f":"IF(ISBLANK(C538),\"\",C538/'Betriebsdaten II'!$T$26)","v":""},"","",""]
[null,null,null,null,null,null,null,"","","","",{"$f":"IF(ISBLANK(C539),\"\",C539/'Betriebsdaten II'!$T$26)","v":""},"","",""]
[null,null,null,null,null,null,null,"","","","",{"$f":"IF(ISBLANK(C540),\"\",C540/'Betriebsdaten II'!$T$26)","v":""},"","",""]
[null,null,null,null,null,null,null,"","","","",{"$f":"IF(ISBLANK(C541),\"\",C541/'Betriebsdaten II'!$T$26)","v":""},"","",""]
[null,null,null,null,null,null,null,"","","","",{"$f":"IF(ISBLANK(C542),\"\",C542/'Betriebsdaten II'!$T$26)","v":""},"","",""]
[null,null,null,null,null,null,null,"","","","",{"$f":"IF(ISBLANK(C543),\"\",C543/'Betriebsdaten II'!$T$26)","v":""},"","",""]
[null,null,null,null,null,null,null,"","","","",{"$f":"IF(ISBLANK(C544),\"\",C544/'Betriebsdaten II'!$T$26)","v":""},"","",""]
[null,null,null,null,null,null,null,"","","","",{"$f":"IF(ISBLANK(C545),\"\",C545/'Betriebsdaten II'!$T$26)","v":""},"","",""]
[null,null,null,null,null,null,null,"","","","",{"$f":"IF(ISBLANK(C546),\"\",C546/'Betriebsdaten II'!$T$26)","v":""},"","",""]
[null,null,null,null,null,null,null,"","","","",{"$f":"IF(ISBLANK(C547),\"\",C547/'Betriebsdaten II'!$T$26)","v":""},"","",""]
[null,null,null,null,null,null,null,"","","","",{"$f":"IF(ISBLANK(C548),\"\",C548/'Betriebsdaten II'!$T$26)","v":""},"","",""]
[null,null,null,null,null,null,null,"","","","",{"$f":"IF(ISBLANK(C549),\"\",C549/'Betriebsdaten II'!$T$26)","v":""},"","",""]
[null,null,null,null,null,null,null,"","","","",{"$f":"IF(ISBLANK(C550),\"\",C550/'Betriebsdaten II'!$T$26)","v":""},"","",""]
[null,null,null,null,null,null,null,"","","","",{"$f":"IF(ISBLANK(C551),\"\",C551/'Betriebsdaten II'!$T$26)","v":""},"","",""]
[null,null,null,null,null,null,null,"","","","",{"$f":"IF(ISBLANK(C552),\"\",C552/'Betriebsdaten II'!$T$26)","v":""},"","",""]
[null,null,null,null,null,null,null,"","","","",{"$f":"IF(ISBLANK(C553),\"\",C553/'Betriebsdaten II'!$T$26)","v":""},"","",""]
[null,null,null,null,null,null,null,"","","","",{"$f":"IF(ISBLANK(C554),\"\",C554/'Betriebsdaten II'!$T$26)","v":""},"","",""]
[null,null,null,null,null,null,null,"","","","",{"$f":"IF(ISBLANK(C555),\"\",C555/'Betriebsdaten II'!$T$26)","v":""},"","",""]
[null,null,null,null,null,null,null,"","","","",{"$f":"IF(ISBLANK(C556),\"\",C556/'Betriebsdaten II'!$T$26)","v":""},"","",""]
[null,null,null,null,null,null,null,"","","","",{"$f":"IF(ISBLANK(C557),\"\",C557/'Betriebsdaten II'!$T$26)","v":""},"","",""]
[null,null,null,null,null,null,null,"","","","",{"$f":"IF(ISBLANK(C558),\"\",C558/'Betriebsdaten II'!$T$26)","v":""},"","",""]
[null,null,null,null,null,null,null,"","","","",{"$f":"IF(ISBLANK(C559),\"\",C559/'Betriebsdaten II'!$T$26)","v":""},"","",""]
[null,null,null,null,null,null,null,"","","","",{"$f":"IF(ISBLANK(C560),\"\",C560/'Betriebsdaten II'!$T$26)","v":""},"","",""]
[null,null,null,null,null,null,null,"","","","",{"$f":"IF(ISBLANK(C561),\"\",C561/'Betriebsdaten II'!$T$26)","v":""},"","",""]
[null,null,null,null,null,null,null,"","","","",{"$f":"IF(ISBLANK(C562),\"\",C562/'Betriebsdaten II'!$T$26)","v":""},"","",""]
[null,null,null,null,null,null,null,"","","","",{"$f":"IF(ISBLANK(C563),\"\",C563/'Betriebsdaten II'!$T$26)","v":""},"","",""]
[null,null,null,null,null,null,null,"","","","",{"$f":"IF(ISBLANK(C564),\"\",C564/'Betriebsdaten II'!$T$26)","v":""},"","",""]
[null,null,null,null,null,null,null,"","","","",{"$f":"IF(ISBLANK(C565),\"\",C565/'Betriebsdaten II'!$T$26)","v":""},"","",""]
[null,null,null,null,null,null,null,"","","","",{"$f":"IF(ISBLANK(C566),\"\",C566/'Betriebsdaten II'!$T$26)","v":""},"","",""]
[null,null,null,null,null,null,null,"","","","",{"$f":"IF(ISBLANK(C567),\"\",C567/'Betriebsdaten II'!$T$26)","v":""},"","",""]
[null,null,null,null,null,null,null,"","","","",{"$f":"IF(ISBLANK(C568),\"\",C568/'Betriebsdaten II'!$T$26)","v":""},"","",""]
[null,null,null,null,null,null,null,"","","","",{"$f":"IF(ISBLANK(C569),\"\",C569/'Betriebsdaten II'!$T$26)","v":""},"","",""]
[null,null,null,null,null,null,null,"","","","",{"$f":"IF(ISBLANK(C570),\"\",C570/'Betriebsdaten II'!$T$26)","v":""},"","",""]
[null,null,null,null,null,null,null,"","","","",{"$f":"IF(ISBLANK(C571),\"\",C571/'Betriebsdaten II'!$T$26)","v":""},"","",""]
[null,null,null,null,null,null,null,"","","","",{"$f":"IF(ISBLANK(C572),\"\",C572/'Betriebsdaten II'!$T$26)","v":""},"","",""]
[null,null,null,null,null,null,null,"","","","",{"$f":"IF(ISBLANK(C573),\"\",C573/'Betriebsdaten II'!$T$26)","v":""},"","",""]
[null,null,null,null,null,null,null,"","","","",{"$f":"IF(ISBLANK(C574),\"\",C574/'Betriebsdaten II'!$T$26)","v":""},"","",""]
[null,null,null,null,null,null,null,"","","","",{"$f":"IF(ISBLANK(C575),\"\",C575/'Betriebsdaten II'!$T$26)","v":""},"","",""]
[null,null,null,null,null,null,null,"","","","",{"$f":"IF(ISBLANK(C576),\"\",C576/'Betriebsdaten II'!$T$26)","v":""},"","",""]
[null,null,null,null,null,null,null,"","","","",{"$f":"IF(ISBLANK(C577),\"\",C577/'Betriebsdaten II'!$T$26)","v":""},"","",""]
[null,null,null,null,null,null,null,"","","","",{"$f":"IF(ISBLANK(C578),\"\",C578/'Betriebsdaten II'!$T$26)","v":""},"","",""]
[null,null,null,null,null,null,null,"","","","",{"$f":"IF(ISBLANK(C579),\"\",C579/'Betriebsdaten II'!$T$26)","v":""},"","",""]
[null,null,null,null,null,null,null,"","","","",{"$f":"IF(ISBLANK(C580),\"\",C580/'Betriebsdaten II'!$T$26)","v":""},"","",""]
[null,null,null,null,null,null,null,"","","","",{"$f":"IF(ISBLANK(C581),\"\",C581/'Betriebsdaten II'!$T$26)","v":""},"","",""]
[null,null,null,null,null,null,null,"","","","",{"$f":"IF(ISBLANK(C582),\"\",C582/'Betriebsdaten II'!$T$26)","v":""},"","",""]
[null,null,null,null,null,null,null,"","","","",{"$f":"IF(ISBLANK(C583),\"\",C583/'Betriebsdaten II'!$T$26)","v":""},"","",""]
[null,null,null,null,null,null,null,"","","","",{"$f":"IF(ISBLANK(C584),\"\",C584/'Betriebsdaten II'!$T$26)","v":""},"","",""]
[null,null,null,null,null,null,null,"","","","",{"$f":"IF(ISBLANK(C585),\"\",C585/'Betriebsdaten II'!$T$26)","v":""},"","",""]
[null,null,null,null,null,null,null,{"$f":"IF(ISBLANK(A586),\"\",NetzvorlaufTemp)","v":""},{"$f":"IF(ISBLANK(A586),\"\",NetzrücklaufTemp)","v":""},{"$f":"IF(OR(ISBLANK(C586),ISBLANK(E586)),\"\",E586/C586*1000)","v":""},{"$f":"IF(OR(ISBLANK(C586),ISBLANK(E586)),\"\",C586/(4.189*978*E586/3600))","v":""},{"$f":"IF(ISBLANK(C586),\"\",C586/'Betriebsdaten II'!$T$26)","v":""},{"$f":"IF(ISERR(J586*L586),\"\",J586*L586)","v":""},"",{"$f":"IF(N586=\"\",\"\",IF(AND(N586<5,K586<30), \"Optimierungsmöglichkeiten prüfen!\",\"\"))","v":""}]
[null,null,null,null,null,null,null,"","","","",{"$f":"IF(ISBLANK(C587),\"\",C587/'Betriebsdaten II'!$T$26)","v":""},"",{"$f":"IF(ISERR(RANK(M587,$M$10:$M$1210)),\"\",RANK(M587,$M$10:$M$1210))","v":""},""]
[null,null,null,null,null,null,null,"","","","",{"$f":"IF(ISBLANK(C588),\"\",C588/'Betriebsdaten II'!$T$26)","v":""},"","",""]
[null,null,null,null,null,null,null,"","","","",{"$f":"IF(ISBLANK(C589),\"\",C589/'Betriebsdaten II'!$T$26)","v":""},"","",""]
[null,null,null,null,null,null,null,"","","","",{"$f":"IF(ISBLANK(C590),\"\",C590/'Betriebsdaten II'!$T$26)","v":""},"","",""]
[null,null,null,null,null,null,null,"","","","",{"$f":"IF(ISBLANK(C591),\"\",C591/'Betriebsdaten II'!$T$26)","v":""},"","",""]
[null,null,null,null,null,null,null,"","","","",{"$f":"IF(ISBLANK(C592),\"\",C592/'Betriebsdaten II'!$T$26)","v":""},"","",""]
[null,null,null,null,null,null,null,"","","","",{"$f":"IF(ISBLANK(C593),\"\",C593/'Betriebsdaten II'!$T$26)","v":""},"","",""]
[null,null,null,null,null,null,null,"","","","",{"$f":"IF(ISBLANK(C594),\"\",C594/'Betriebsdaten II'!$T$26)","v":""},"","",""]
[null,null,null,null,null,null,null,"","","","",{"$f":"IF(ISBLANK(C595),\"\",C595/'Betriebsdaten II'!$T$26)","v":""},"","",""]
[null,null,null,null,null,null,null,"","","","",{"$f":"IF(ISBLANK(C596),\"\",C596/'Betriebsdaten II'!$T$26)","v":""},"","",""]
[null,null,null,null,null,null,null,"","","","",{"$f":"IF(ISBLANK(C597),\"\",C597/'Betriebsdaten II'!$T$26)","v":""},"","",""]
[null,null,null,null,null,null,null,"","","","",{"$f":"IF(ISBLANK(C598),\"\",C598/'Betriebsdaten II'!$T$26)","v":""},"","",""]
[null,null,null,null,null,null,null,"","","","",{"$f":"IF(ISBLANK(C599),\"\",C599/'Betriebsdaten II'!$T$26)","v":""},"","",""]
[null,null,null,null,null,null,null,"","","","",{"$f":"IF(ISBLANK(C600),\"\",C600/'Betriebsdaten II'!$T$26)","v":""},"","",""]
[null,null,null,null,null,null,null,"","","","",{"$f":"IF(ISBLANK(C601),\"\",C601/'Betriebsdaten II'!$T$26)","v":""},"","",""]
[null,null,null,null,null,null,null,"","","","",{"$f":"IF(ISBLANK(C602),\"\",C602/'Betriebsdaten II'!$T$26)","v":""},"","",""]
[null,null,null,null,null,null,null,"","","","",{"$f":"IF(ISBLANK(C603),\"\",C603/'Betriebsdaten II'!$T$26)","v":""},"","",""]
[null,null,null,null,null,null,null,"","","","",{"$f":"IF(ISBLANK(C604),\"\",C604/'Betriebsdaten II'!$T$26)","v":""},"","",""]
[null,null,null,null,null,null,null,"","","","",{"$f":"IF(ISBLANK(C605),\"\",C605/'Betriebsdaten II'!$T$26)","v":""},"","",""]
[null,null,null,null,null,null,null,"","","","",{"$f":"IF(ISBLANK(C606),\"\",C606/'Betriebsdaten II'!$T$26)","v":""},"","",""]
[null,null,null,null,null,null,null,"","","","",{"$f":"IF(ISBLANK(C607),\"\",C607/'Betriebsdaten II'!$T$26)","v":""},"","",""]
[null,null,null,null,null,null,null,"","","","",{"$f":"IF(ISBLANK(C608),\"\",C608/'Betriebsdaten II'!$T$26)","v":""},"","",""]
[null,null,null,null,null,null,null,"","","","",{"$f":"IF(ISBLANK(C609),\"\",C609/'Betriebsdaten II'!$T$26)","v":""},"","",""]
[null,null,null,null,null,null,null,"","","","",{"$f":"IF(ISBLANK(C610),\"\",C610/'Betriebsdaten II'!$T$26)","v":""},"","",""]
[null,null,null,null,null,null,null,"","","","",{"$f":"IF(ISBLANK(C611),\"\",C611/'Betriebsdaten II'!$T$26)","v":""},"","",""]
[null,null,null,null,null,null,null,"","","","",{"$f":"IF(ISBLANK(C612),\"\",C612/'Betriebsdaten II'!$T$26)","v":""},"","",""]
[null,null,null,null,null,null,null,"","","","",{"$f":"IF(ISBLANK(C613),\"\",C613/'Betriebsdaten II'!$T$26)","v":""},"","",""]
[null,null,null,null,null,null,null,"","","","",{"$f":"IF(ISBLANK(C614),\"\",C614/'Betriebsdaten II'!$T$26)","v":""},"","",""]
[null,null,null,null,null,null,null,"","","","",{"$f":"IF(ISBLANK(C615),\"\",C615/'Betriebsdaten II'!$T$26)","v":""},"","",""]
[null,null,null,null,null,null,null,"","","","",{"$f":"IF(ISBLANK(C616),\"\",C616/'Betriebsdaten II'!$T$26)","v":""},"","",""]
[null,null,null,null,null,null,null,"","","","",{"$f":"IF(ISBLANK(C617),\"\",C617/'Betriebsdaten II'!$T$26)","v":""},"","",""]
[null,null,null,null,null,null,null,"","","","",{"$f":"IF(ISBLANK(C618),\"\",C618/'Betriebsdaten II'!$T$26)","v":""},"","",""]
[null,null,null,null,null,null,null,"","","","",{"$f":"IF(ISBLANK(C619),\"\",C619/'Betriebsdaten II'!$T$26)","v":""},"","",""]
[null,null,null,null,null,null,null,"","","","",{"$f":"IF(ISBLANK(C620),\"\",C620/'Betriebsdaten II'!$T$26)","v":""},"","",""]
[null,null,null,null,null,null,null,"","","","",{"$f":"IF(ISBLANK(C621),\"\",C621/'Betriebsdaten II'!$T$26)","v":""},"","",""]
[null,null,null,null,null,null,null,"","","","",{"$f":"IF(ISBLANK(C622),\"\",C622/'Betriebsdaten II'!$T$26)","v":""},"","",""]
[null,null,null,null,null,null,null,"","","","",{"$f":"IF(ISBLANK(C623),\"\",C623/'Betriebsdaten II'!$T$26)","v":""},"","",""]
[null,null,null,null,null,null,null,"","","","",{"$f":"IF(ISBLANK(C624),\"\",C624/'Betriebsdaten II'!$T$26)","v":""},"","",""]
[null,null,null,null,null,null,null,"","","","",{"$f":"IF(ISBLANK(C625),\"\",C625/'Betriebsdaten II'!$T$26)","v":""},"","",""]
[null,null,null,null,null,null,null,"","","","",{"$f":"IF(ISBLANK(C626),\"\",C626/'Betriebsdaten II'!$T$26)","v":""},"","",""]
[null,null,null,null,null,null,null,"","","","",{"$f":"IF(ISBLANK(C627),\"\",C627/'Betriebsdaten II'!$T$26)","v":""},"","",""]
[null,null,null,null,null,null,null,"","","","",{"$f":"IF(ISBLANK(C628),\"\",C628/'Betriebsdaten II'!$T$26)","v":""},"","",""]
[null,null,null,null,null,null,null,"","","","",{"$f":"IF(ISBLANK(C629),\"\",C629/'Betriebsdaten II'!$T$26)","v":""},"","",""]
[null,null,null,null,null,null,null,"","","","",{"$f":"IF(ISBLANK(C630),\"\",C630/'Betriebsdaten II'!$T$26)","v":""},"","",""]
[null,null,null,null,null,null,null,"","","","",{"$f":"IF(ISBLANK(C631),\"\",C631/'Betriebsdaten II'!$T$26)","v":""},"","",""]
[null,null,null,null,null,null,null,"","","","",{"$f":"IF(ISBLANK(C632),\"\",C632/'Betriebsdaten II'!$T$26)","v":""},"","",""]
[null,null,null,null,null,null,null,"","","","",{"$f":"IF(ISBLANK(C633),\"\",C633/'Betriebsdaten II'!$T$26)","v":""},"","",""]
[null,null,null,null,null,null,null,"","","","",{"$f":"IF(ISBLANK(C634),\"\",C634/'Betriebsdaten II'!$T$26)","v":""},"","",""]
[null,null,null,null,null,null,null,"","","","",{"$f":"IF(ISBLANK(C635),\"\",C635/'Betriebsdaten II'!$T$26)","v":""},"","",""]
[null,null,null,null,null,null,null,"","","","",{"$f":"IF(ISBLANK(C636),\"\",C636/'Betriebsdaten II'!$T$26)","v":""},"","",""]
[null,null,null,null,null,null,null,"","","","",{"$f":"IF(ISBLANK(C637),\"\",C637/'Betriebsdaten II'!$T$26)","v":""},"","",""]
[null,null,null,null,null,null,null,"","","","",{"$f":"IF(ISBLANK(C638),\"\",C638/'Betriebsdaten II'!$T$26)","v":""},"","",""]
[null,null,null,null,null,null,null,"","","","",{"$f":"IF(ISBLANK(C639),\"\",C639/'Betriebsdaten II'!$T$26)","v":""},"","",""]
[null,null,null,null,null,null,null,"","","","",{"$f":"IF(ISBLANK(C640),\"\",C640/'Betriebsdaten II'!$T$26)","v":""},"","",""]
[null,null,null,null,null,null,null,"","","","",{"$f":"IF(ISBLANK(C641),\"\",C641/'Betriebsdaten II'!$T$26)","v":""},"","",""]
[null,null,null,null,null,null,null,"","","","",{"$f":"IF(ISBLANK(C642),\"\",C642/'Betriebsdaten II'!$T$26)","v":""},"","",""]
[null,null,null,null,null,null,null,"","","","",{"$f":"IF(ISBLANK(C643),\"\",C643/'Betriebsdaten II'!$T$26)","v":""},"","",""]
[null,null,null,null,null,null,null,"","","","",{"$f":"IF(ISBLANK(C644),\"\",C644/'Betriebsdaten II'!$T$26)","v":""},"","",""]
[null,null,null,null,null,null,null,"","","","",{"$f":"IF(ISBLANK(C645),\"\",C645/'Betriebsdaten II'!$T$26)","v":""},"","",""]
[null,null,null,null,null,null,null,"","","","",{"$f":"IF(ISBLANK(C646),\"\",C646/'Betriebsdaten II'!$T$26)","v":""},"","",""]
[null,null,null,null,null,null,null,"","","","",{"$f":"IF(ISBLANK(C647),\"\",C647/'Betriebsdaten II'!$T$26)","v":""},"","",""]
[null,null,null,null,null,null,null,"","","","",{"$f":"IF(ISBLANK(C648),\"\",C648/'Betriebsdaten II'!$T$26)","v":""},"","",""]
[null,null,null,null,null,null,null,"","","","",{"$f":"IF(ISBLANK(C649),\"\",C649/'Betriebsdaten II'!$T$26)","v":""},"","",""]
[null,null,null,null,null,null,null,{"$f":"IF(ISBLANK(A650),\"\",NetzvorlaufTemp)","v":""},{"$f":"IF(ISBLANK(A650),\"\",NetzrücklaufTemp)","v":""},{"$f":"IF(OR(ISBLANK(C650),ISBLANK(E650)),\"\",E650/C650*1000)","v":""},{"$f":"IF(OR(ISBLANK(C650),ISBLANK(E650)),\"\",C650/(4.189*978*E650/3600))","v":""},{"$f":"IF(ISBLANK(C650),\"\",C650/'Betriebsdaten II'!$T$26)","v":""},{"$f":"IF(ISERR(J650*L650),\"\",J650*L650)","v":""},"",{"$f":"IF(N650=\"\",\"\",IF(AND(N650<5,K650<30), \"Optimierungsmöglichkeiten prüfen!\",\"\"))","v":""}]
[null,null,null,null,null,null,null,"","","","",{"$f":"IF(ISBLANK(C651),\"\",C651/'Betriebsdaten II'!$T$26)","v":""},"",{"$f":"IF(ISERR(RANK(M651,$M$10:$M$1210)),\"\",RANK(M651,$M$10:$M$1210))","v":""},""]
[null,null,null,null,null,null,null,"","","","",{"$f":"IF(ISBLANK(C652),\"\",C652/'Betriebsdaten II'!$T$26)","v":""},"","",""]
[null,null,null,null,null,null,null,"","","","",{"$f":"IF(ISBLANK(C653),\"\",C653/'Betriebsdaten II'!$T$26)","v":""},"","",""]
[null,null,null,null,null,null,null,"","","","",{"$f":"IF(ISBLANK(C654),\"\",C654/'Betriebsdaten II'!$T$26)","v":""},"","",""]
[null,null,null,null,null,null,null,"","","","",{"$f":"IF(ISBLANK(C655),\"\",C655/'Betriebsdaten II'!$T$26)","v":""},"","",""]
[null,null,null,null,null,null,null,"","","","",{"$f":"IF(ISBLANK(C656),\"\",C656/'Betriebsdaten II'!$T$26)","v":""},"","",""]
[null,null,null,null,null,null,null,"","","","",{"$f":"IF(ISBLANK(C657),\"\",C657/'Betriebsdaten II'!$T$26)","v":""},"","",""]
[null,null,null,null,null,null,null,"","","","",{"$f":"IF(ISBLANK(C658),\"\",C658/'Betriebsdaten II'!$T$26)","v":""},"","",""]
[null,null,null,null,null,null,null,"","","","",{"$f":"IF(ISBLANK(C659),\"\",C659/'Betriebsdaten II'!$T$26)","v":""},"","",""]
[null,null,null,null,null,null,null,"","","","",{"$f":"IF(ISBLANK(C660),\"\",C660/'Betriebsdaten II'!$T$26)","v":""},"","",""]
[null,null,null,null,null,null,null,"","","","",{"$f":"IF(ISBLANK(C661),\"\",C661/'Betriebsdaten II'!$T$26)","v":""},"","",""]
[null,null,null,null,null,null,null,"","","","",{"$f":"IF(ISBLANK(C662),\"\",C662/'Betriebsdaten II'!$T$26)","v":""},"","",""]
[null,null,null,null,null,null,null,"","","","",{"$f":"IF(ISBLANK(C663),\"\",C663/'Betriebsdaten II'!$T$26)","v":""},"","",""]
[null,null,null,null,null,null,null,"","","","",{"$f":"IF(ISBLANK(C664),\"\",C664/'Betriebsdaten II'!$T$26)","v":""},"","",""]
[null,null,null,null,null,null,null,"","","","",{"$f":"IF(ISBLANK(C665),\"\",C665/'Betriebsdaten II'!$T$26)","v":""},"","",""]
[null,null,null,null,null,null,null,"","","","",{"$f":"IF(ISBLANK(C666),\"\",C666/'Betriebsdaten II'!$T$26)","v":""},"","",""]
[null,null,null,null,null,null,null,"","","","",{"$f":"IF(ISBLANK(C667),\"\",C667/'Betriebsdaten II'!$T$26)","v":""},"","",""]
[null,null,null,null,null,null,null,"","","","",{"$f":"IF(ISBLANK(C668),\"\",C668/'Betriebsdaten II'!$T$26)","v":""},"","",""]
[null,null,null,null,null,null,null,"","","","",{"$f":"IF(ISBLANK(C669),\"\",C669/'Betriebsdaten II'!$T$26)","v":""},"","",""]
[null,null,null,null,null,null,null,"","","","",{"$f":"IF(ISBLANK(C670),\"\",C670/'Betriebsdaten II'!$T$26)","v":""},"","",""]
[null,null,null,null,null,null,null,"","","","",{"$f":"IF(ISBLANK(C671),\"\",C671/'Betriebsdaten II'!$T$26)","v":""},"","",""]
[null,null,null,null,null,null,null,"","","","",{"$f":"IF(ISBLANK(C672),\"\",C672/'Betriebsdaten II'!$T$26)","v":""},"","",""]
[null,null,null,null,null,null,null,"","","","",{"$f":"IF(ISBLANK(C673),\"\",C673/'Betriebsdaten II'!$T$26)","v":""},"","",""]
[null,null,null,null,null,null,null,"","","","",{"$f":"IF(ISBLANK(C674),\"\",C674/'Betriebsdaten II'!$T$26)","v":""},"","",""]
[null,null,null,null,null,null,null,"","","","",{"$f":"IF(ISBLANK(C675),\"\",C675/'Betriebsdaten II'!$T$26)","v":""},"","",""]
[null,null,null,null,null,null,null,"","","","",{"$f":"IF(ISBLANK(C676),\"\",C676/'Betriebsdaten II'!$T$26)","v":""},"","",""]
[null,null,null,null,null,null,null,"","","","",{"$f":"IF(ISBLANK(C677),\"\",C677/'Betriebsdaten II'!$T$26)","v":""},"","",""]
[null,null,null,null,null,null,null,"","","","",{"$f":"IF(ISBLANK(C678),\"\",C678/'Betriebsdaten II'!$T$26)","v":""},"","",""]
[null,null,null,null,null,null,null,"","","","",{"$f":"IF(ISBLANK(C679),\"\",C679/'Betriebsdaten II'!$T$26)","v":""},"","",""]
[null,null,null,null,null,null,null,"","","","",{"$f":"IF(ISBLANK(C680),\"\",C680/'Betriebsdaten II'!$T$26)","v":""},"","",""]
[null,null,null,null,null,null,null,"","","","",{"$f":"IF(ISBLANK(C681),\"\",C681/'Betriebsdaten II'!$T$26)","v":""},"","",""]
[null,null,null,null,null,null,null,"","","","",{"$f":"IF(ISBLANK(C682),\"\",C682/'Betriebsdaten II'!$T$26)","v":""},"","",""]
[null,null,null,null,null,null,null,"","","","",{"$f":"IF(ISBLANK(C683),\"\",C683/'Betriebsdaten II'!$T$26)","v":""},"","",""]
[null,null,null,null,null,null,null,"","","","",{"$f":"IF(ISBLANK(C684),\"\",C684/'Betriebsdaten II'!$T$26)","v":""},"","",""]
[null,null,null,null,null,null,null,"","","","",{"$f":"IF(ISBLANK(C685),\"\",C685/'Betriebsdaten II'!$T$26)","v":""},"","",""]
[null,null,null,null,null,null,null,"","","","",{"$f":"IF(ISBLANK(C686),\"\",C686/'Betriebsdaten II'!$T$26)","v":""},"","",""]
[null,null,null,null,null,null,null,"","","","",{"$f":"IF(ISBLANK(C687),\"\",C687/'Betriebsdaten II'!$T$26)","v":""},"","",""]
[null,null,null,null,null,null,null,"","","","",{"$f":"IF(ISBLANK(C688),\"\",C688/'Betriebsdaten II'!$T$26)","v":""},"","",""]
[null,null,null,null,null,null,null,"","","","",{"$f":"IF(ISBLANK(C689),\"\",C689/'Betriebsdaten II'!$T$26)","v":""},"","",""]
[null,null,null,null,null,null,null,"","","","",{"$f":"IF(ISBLANK(C690),\"\",C690/'Betriebsdaten II'!$T$26)","v":""},"","",""]
[null,null,null,null,null,null,null,"","","","",{"$f":"IF(ISBLANK(C691),\"\",C691/'Betriebsdaten II'!$T$26)","v":""},"","",""]
[null,null,null,null,null,null,null,"","","","",{"$f":"IF(ISBLANK(C692),\"\",C692/'Betriebsdaten II'!$T$26)","v":""},"","",""]
[null,null,null,null,null,null,null,"","","","",{"$f":"IF(ISBLANK(C693),\"\",C693/'Betriebsdaten II'!$T$26)","v":""},"","",""]
[null,null,null,null,null,null,null,"","","","",{"$f":"IF(ISBLANK(C694),\"\",C694/'Betriebsdaten II'!$T$26)","v":""},"","",""]
[null,null,null,null,null,null,null,"","","","",{"$f":"IF(ISBLANK(C695),\"\",C695/'Betriebsdaten II'!$T$26)","v":""},"","",""]
[null,null,null,null,null,null,null,"","","","",{"$f":"IF(ISBLANK(C696),\"\",C696/'Betriebsdaten II'!$T$26)","v":""},"","",""]
[null,null,null,null,null,null,null,"","","","",{"$f":"IF(ISBLANK(C697),\"\",C697/'Betriebsdaten II'!$T$26)","v":""},"","",""]
[null,null,null,null,null,null,null,"","","","",{"$f":"IF(ISBLANK(C698),\"\",C698/'Betriebsdaten II'!$T$26)","v":""},"","",""]
[null,null,null,null,null,null,null,"","","","",{"$f":"IF(ISBLANK(C699),\"\",C699/'Betriebsdaten II'!$T$26)","v":""},"","",""]
[null,null,null,null,null,null,null,"","","","",{"$f":"IF(ISBLANK(C700),\"\",C700/'Betriebsdaten II'!$T$26)","v":""},"","",""]
[null,null,null,null,null,null,null,"","","","",{"$f":"IF(ISBLANK(C701),\"\",C701/'Betriebsdaten II'!$T$26)","v":""},"","",""]
[null,null,null,null,null,null,null,"","","","",{"$f":"IF(ISBLANK(C702),\"\",C702/'Betriebsdaten II'!$T$26)","v":""},"","",""]
[null,null,null,null,null,null,null,"","","","",{"$f":"IF(ISBLANK(C703),\"\",C703/'Betriebsdaten II'!$T$26)","v":""},"","",""]
[null,null,null,null,null,null,null,"","","","",{"$f":"IF(ISBLANK(C704),\"\",C704/'Betriebsdaten II'!$T$26)","v":""},"","",""]
[null,null,null,null,null,null,null,"","","","",{"$f":"IF(ISBLANK(C705),\"\",C705/'Betriebsdaten II'!$T$26)","v":""},"","",""]
[null,null,null,null,null,null,null,"","","","",{"$f":"IF(ISBLANK(C706),\"\",C706/'Betriebsdaten II'!$T$26)","v":""},"","",""]
[null,null,null,null,null,null,null,"","","","",{"$f":"IF(ISBLANK(C707),\"\",C707/'Betriebsdaten II'!$T$26)","v":""},"","",""]
[null,null,null,null,null,null,null,"","","","",{"$f":"IF(ISBLANK(C708),\"\",C708/'Betriebsdaten II'!$T$26)","v":""},"","",""]
[null,null,null,null,null,null,null,"","","","",{"$f":"IF(ISBLANK(C709),\"\",C709/'Betriebsdaten II'!$T$26)","v":""},"","",""]
[null,null,null,null,null,null,null,"","","","",{"$f":"IF(ISBLANK(C710),\"\",C710/'Betriebsdaten II'!$T$26)","v":""},"","",""]
[null,null,null,null,null,null,null,"","","","",{"$f":"IF(ISBLANK(C711),\"\",C711/'Betriebsdaten II'!$T$26)","v":""},"","",""]
[null,null,null,null,null,null,null,"","","","",{"$f":"IF(ISBLANK(C712),\"\",C712/'Betriebsdaten II'!$T$26)","v":""},"","",""]
[null,null,null,null,null,null,null,"","","","",{"$f":"IF(ISBLANK(C713),\"\",C713/'Betriebsdaten II'!$T$26)","v":""},"","",""]
[null,null,null,null,null,null,null,{"$f":"IF(ISBLANK(A714),\"\",NetzvorlaufTemp)","v":""},{"$f":"IF(ISBLANK(A714),\"\",NetzrücklaufTemp)","v":""},{"$f":"IF(OR(ISBLANK(C714),ISBLANK(E714)),\"\",E714/C714*1000)","v":""},{"$f":"IF(OR(ISBLANK(C714),ISBLANK(E714)),\"\",C714/(4.189*978*E714/3600))","v":""},{"$f":"IF(ISBLANK(C714),\"\",C714/'Betriebsdaten II'!$T$26)","v":""},{"$f":"IF(ISERR(J714*L714),\"\",J714*L714)","v":""},"",{"$f":"IF(N714=\"\",\"\",IF(AND(N714<5,K714<30), \"Optimierungsmöglichkeiten prüfen!\",\"\"))","v":""}]
[null,null,null,null,null,null,null,"","","","",{"$f":"IF(ISBLANK(C715),\"\",C715/'Betriebsdaten II'!$T$26)","v":""},"",{"$f":"IF(ISERR(RANK(M715,$M$10:$M$1210)),\"\",RANK(M715,$M$10:$M$1210))","v":""},""]
[null,null,null,null,null,null,null,"","","","",{"$f":"IF(ISBLANK(C716),\"\",C716/'Betriebsdaten II'!$T$26)","v":""},"","",""]
[null,null,null,null,null,null,null,"","","","",{"$f":"IF(ISBLANK(C717),\"\",C717/'Betriebsdaten II'!$T$26)","v":""},"","",""]
[null,null,null,null,null,null,null,"","","","",{"$f":"IF(ISBLANK(C718),\"\",C718/'Betriebsdaten II'!$T$26)","v":""},"","",""]
[null,null,null,null,null,null,null,"","","","",{"$f":"IF(ISBLANK(C719),\"\",C719/'Betriebsdaten II'!$T$26)","v":""},"","",""]
[null,null,null,null,null,null,null,"","","","",{"$f":"IF(ISBLANK(C720),\"\",C720/'Betriebsdaten II'!$T$26)","v":""},"","",""]
[null,null,null,null,null,null,null,"","","","",{"$f":"IF(ISBLANK(C721),\"\",C721/'Betriebsdaten II'!$T$26)","v":""},"","",""]
[null,null,null,null,null,null,null,"","","","",{"$f":"IF(ISBLANK(C722),\"\",C722/'Betriebsdaten II'!$T$26)","v":""},"","",""]
[null,null,null,null,null,null,null,"","","","",{"$f":"IF(ISBLANK(C723),\"\",C723/'Betriebsdaten II'!$T$26)","v":""},"","",""]
[null,null,null,null,null,null,null,"","","","",{"$f":"IF(ISBLANK(C724),\"\",C724/'Betriebsdaten II'!$T$26)","v":""},"","",""]
[null,null,null,null,null,null,null,"","","","",{"$f":"IF(ISBLANK(C725),\"\",C725/'Betriebsdaten II'!$T$26)","v":""},"","",""]
[null,null,null,null,null,null,null,"","","","",{"$f":"IF(ISBLANK(C726),\"\",C726/'Betriebsdaten II'!$T$26)","v":""},"","",""]
[null,null,null,null,null,null,null,"","","","",{"$f":"IF(ISBLANK(C727),\"\",C727/'Betriebsdaten II'!$T$26)","v":""},"","",""]
[null,null,null,null,null,null,null,"","","","",{"$f":"IF(ISBLANK(C728),\"\",C728/'Betriebsdaten II'!$T$26)","v":""},"","",""]
[null,null,null,null,null,null,null,"","","","",{"$f":"IF(ISBLANK(C729),\"\",C729/'Betriebsdaten II'!$T$26)","v":""},"","",""]
[null,null,null,null,null,null,null,"","","","",{"$f":"IF(ISBLANK(C730),\"\",C730/'Betriebsdaten II'!$T$26)","v":""},"","",""]
[null,null,null,null,null,null,null,"","","","",{"$f":"IF(ISBLANK(C731),\"\",C731/'Betriebsdaten II'!$T$26)","v":""},"","",""]
[null,null,null,null,null,null,null,"","","","",{"$f":"IF(ISBLANK(C732),\"\",C732/'Betriebsdaten II'!$T$26)","v":""},"","",""]
[null,null,null,null,null,null,null,"","","","",{"$f":"IF(ISBLANK(C733),\"\",C733/'Betriebsdaten II'!$T$26)","v":""},"","",""]
[null,null,null,null,null,null,null,"","","","",{"$f":"IF(ISBLANK(C734),\"\",C734/'Betriebsdaten II'!$T$26)","v":""},"","",""]
[null,null,null,null,null,null,null,"","","","",{"$f":"IF(ISBLANK(C735),\"\",C735/'Betriebsdaten II'!$T$26)","v":""},"","",""]
[null,null,null,null,null,null,null,"","","","",{"$f":"IF(ISBLANK(C736),\"\",C736/'Betriebsdaten II'!$T$26)","v":""},"","",""]
[null,null,null,null,null,null,null,"","","","",{"$f":"IF(ISBLANK(C737),\"\",C737/'Betriebsdaten II'!$T$26)","v":""},"","",""]
[null,null,null,null,null,null,null,"","","","",{"$f":"IF(ISBLANK(C738),\"\",C738/'Betriebsdaten II'!$T$26)","v":""},"","",""]
[null,null,null,null,null,null,null,"","","","",{"$f":"IF(ISBLANK(C739),\"\",C739/'Betriebsdaten II'!$T$26)","v":""},"","",""]
[null,null,null,null,null,null,null,"","","","",{"$f":"IF(ISBLANK(C740),\"\",C740/'Betriebsdaten II'!$T$26)","v":""},"","",""]
[null,null,null,null,null,null,null,"","","","",{"$f":"IF(ISBLANK(C741),\"\",C741/'Betriebsdaten II'!$T$26)","v":""},"","",""]
[null,null,null,null,null,null,null,"","","","",{"$f":"IF(ISBLANK(C742),\"\",C742/'Betriebsdaten II'!$T$26)","v":""},"","",""]
[null,null,null,null,null,null,null,"","","","",{"$f":"IF(ISBLANK(C743),\"\",C743/'Betriebsdaten II'!$T$26)","v":""},"","",""]
[null,null,null,null,null,null,null,"","","","",{"$f":"IF(ISBLANK(C744),\"\",C744/'Betriebsdaten II'!$T$26)","v":""},"","",""]
[null,null,null,null,null,null,null,"","","","",{"$f":"IF(ISBLANK(C745),\"\",C745/'Betriebsdaten II'!$T$26)","v":""},"","",""]
[null,null,null,null,null,null,null,"","","","",{"$f":"IF(ISBLANK(C746),\"\",C746/'Betriebsdaten II'!$T$26)","v":""},"","",""]
[null,null,null,null,null,null,null,"","","","",{"$f":"IF(ISBLANK(C747),\"\",C747/'Betriebsdaten II'!$T$26)","v":""},"","",""]
[null,null,null,null,null,null,null,"","","","",{"$f":"IF(ISBLANK(C748),\"\",C748/'Betriebsdaten II'!$T$26)","v":""},"","",""]
[null,null,null,null,null,null,null,"","","","",{"$f":"IF(ISBLANK(C749),\"\",C749/'Betriebsdaten II'!$T$26)","v":""},"","",""]
[null,null,null,null,null,null,null,"","","","",{"$f":"IF(ISBLANK(C750),\"\",C750/'Betriebsdaten II'!$T$26)","v":""},"","",""]
[null,null,null,null,null,null,null,"","","","",{"$f":"IF(ISBLANK(C751),\"\",C751/'Betriebsdaten II'!$T$26)","v":""},"","",""]
[null,null,null,null,null,null,null,"","","","",{"$f":"IF(ISBLANK(C752),\"\",C752/'Betriebsdaten II'!$T$26)","v":""},"","",""]
[null,null,null,null,null,null,null,"","","","",{"$f":"IF(ISBLANK(C753),\"\",C753/'Betriebsdaten II'!$T$26)","v":""},"","",""]
[null,null,null,null,null,null,null,"","","","",{"$f":"IF(ISBLANK(C754),\"\",C754/'Betriebsdaten II'!$T$26)","v":""},"","",""]
[null,null,null,null,null,null,null,"","","","",{"$f":"IF(ISBLANK(C755),\"\",C755/'Betriebsdaten II'!$T$26)","v":""},"","",""]
[null,null,null,null,null,null,null,"","","","",{"$f":"IF(ISBLANK(C756),\"\",C756/'Betriebsdaten II'!$T$26)","v":""},"","",""]
[null,null,null,null,null,null,null,"","","","",{"$f":"IF(ISBLANK(C757),\"\",C757/'Betriebsdaten II'!$T$26)","v":""},"","",""]
[null,null,null,null,null,null,null,"","","","",{"$f":"IF(ISBLANK(C758),\"\",C758/'Betriebsdaten II'!$T$26)","v":""},"","",""]
[null,null,null,null,null,null,null,"","","","",{"$f":"IF(ISBLANK(C759),\"\",C759/'Betriebsdaten II'!$T$26)","v":""},"","",""]
[null,null,null,null,null,null,null,"","","","",{"$f":"IF(ISBLANK(C760),\"\",C760/'Betriebsdaten II'!$T$26)","v":""},"","",""]
[null,null,null,null,null,null,null,"","","","",{"$f":"IF(ISBLANK(C761),\"\",C761/'Betriebsdaten II'!$T$26)","v":""},"","",""]
[null,null,null,null,null,null,null,"","","","",{"$f":"IF(ISBLANK(C762),\"\",C762/'Betriebsdaten II'!$T$26)","v":""},"","",""]
[null,null,null,null,null,null,null,"","","","",{"$f":"IF(ISBLANK(C763),\"\",C763/'Betriebsdaten II'!$T$26)","v":""},"","",""]
[null,null,null,null,null,null,null,"","","","",{"$f":"IF(ISBLANK(C764),\"\",C764/'Betriebsdaten II'!$T$26)","v":""},"","",""]
[null,null,null,null,null,null,null,"","","","",{"$f":"IF(ISBLANK(C765),\"\",C765/'Betriebsdaten II'!$T$26)","v":""},"","",""]
[null,null,null,null,null,null,null,"","","","",{"$f":"IF(ISBLANK(C766),\"\",C766/'Betriebsdaten II'!$T$26)","v":""},"","",""]
[null,null,null,null,null,null,null,"","","","",{"$f":"IF(ISBLANK(C767),\"\",C767/'Betriebsdaten II'!$T$26)","v":""},"","",""]
[null,null,null,null,null,null,null,"","","","",{"$f":"IF(ISBLANK(C768),\"\",C768/'Betriebsdaten II'!$T$26)","v":""},"","",""]
[null,null,null,null,null,null,null,"","","","",{"$f":"IF(ISBLANK(C769),\"\",C769/'Betriebsdaten II'!$T$26)","v":""},"","",""]
[null,null,null,null,null,null,null,"","","","",{"$f":"IF(ISBLANK(C770),\"\",C770/'Betriebsdaten II'!$T$26)","v":""},"","",""]
[null,null,null,null,null,null,null,"","","","",{"$f":"IF(ISBLANK(C771),\"\",C771/'Betriebsdaten II'!$T$26)","v":""},"","",""]
[null,null,null,null,null,null,null,"","","","",{"$f":"IF(ISBLANK(C772),\"\",C772/'Betriebsdaten II'!$T$26)","v":""},"","",""]
[null,null,null,null,null,null,null,"","","","",{"$f":"IF(ISBLANK(C773),\"\",C773/'Betriebsdaten II'!$T$26)","v":""},"","",""]
[null,null,null,null,null,null,null,"","","","",{"$f":"IF(ISBLANK(C774),\"\",C774/'Betriebsdaten II'!$T$26)","v":""},"","",""]
[null,null,null,null,null,null,null,"","","","",{"$f":"IF(ISBLANK(C775),\"\",C775/'Betriebsdaten II'!$T$26)","v":""},"","",""]
[null,null,null,null,null,null,null,"","","","",{"$f":"IF(ISBLANK(C776),\"\",C776/'Betriebsdaten II'!$T$26)","v":""},"","",""]
[null,null,null,null,null,null,null,"","","","",{"$f":"IF(ISBLANK(C777),\"\",C777/'Betriebsdaten II'!$T$26)","v":""},"","",""]
[null,null,null,null,null,null,null,{"$f":"IF(ISBLANK(A778),\"\",NetzvorlaufTemp)","v":""},{"$f":"IF(ISBLANK(A778),\"\",NetzrücklaufTemp)","v":""},{"$f":"IF(OR(ISBLANK(C778),ISBLANK(E778)),\"\",E778/C778*1000)","v":""},{"$f":"IF(OR(ISBLANK(C778),ISBLANK(E778)),\"\",C778/(4.189*978*E778/3600))","v":""},{"$f":"IF(ISBLANK(C778),\"\",C778/'Betriebsdaten II'!$T$26)","v":""},{"$f":"IF(ISERR(J778*L778),\"\",J778*L778)","v":""},"",{"$f":"IF(N778=\"\",\"\",IF(AND(N778<5,K778<30), \"Optimierungsmöglichkeiten prüfen!\",\"\"))","v":""}]
[null,null,null,null,null,null,null,"","","","",{"$f":"IF(ISBLANK(C779),\"\",C779/'Betriebsdaten II'!$T$26)","v":""},"",{"$f":"IF(ISERR(RANK(M779,$M$10:$M$1210)),\"\",RANK(M779,$M$10:$M$1210))","v":""},""]
[null,null,null,null,null,null,null,"","","","",{"$f":"IF(ISBLANK(C780),\"\",C780/'Betriebsdaten II'!$T$26)","v":""},"","",""]
[null,null,null,null,null,null,null,"","","","",{"$f":"IF(ISBLANK(C781),\"\",C781/'Betriebsdaten II'!$T$26)","v":""},"","",""]
[null,null,null,null,null,null,null,"","","","",{"$f":"IF(ISBLANK(C782),\"\",C782/'Betriebsdaten II'!$T$26)","v":""},"","",""]
[null,null,null,null,null,null,null,"","","","",{"$f":"IF(ISBLANK(C783),\"\",C783/'Betriebsdaten II'!$T$26)","v":""},"","",""]
[null,null,null,null,null,null,null,"","","","",{"$f":"IF(ISBLANK(C784),\"\",C784/'Betriebsdaten II'!$T$26)","v":""},"","",""]
[null,null,null,null,null,null,null,"","","","",{"$f":"IF(ISBLANK(C785),\"\",C785/'Betriebsdaten II'!$T$26)","v":""},"","",""]
[null,null,null,null,null,null,null,"","","","",{"$f":"IF(ISBLANK(C786),\"\",C786/'Betriebsdaten II'!$T$26)","v":""},"","",""]
[null,null,null,null,null,null,null,"","","","",{"$f":"IF(ISBLANK(C787),\"\",C787/'Betriebsdaten II'!$T$26)","v":""},"","",""]
[null,null,null,null,null,null,null,"","","","",{"$f":"IF(ISBLANK(C788),\"\",C788/'Betriebsdaten II'!$T$26)","v":""},"","",""]
[null,null,null,null,null,null,null,"","","","",{"$f":"IF(ISBLANK(C789),\"\",C789/'Betriebsdaten II'!$T$26)","v":""},"","",""]
[null,null,null,null,null,null,null,"","","","",{"$f":"IF(ISBLANK(C790),\"\",C790/'Betriebsdaten II'!$T$26)","v":""},"","",""]
[null,null,null,null,null,null,null,"","","","",{"$f":"IF(ISBLANK(C791),\"\",C791/'Betriebsdaten II'!$T$26)","v":""},"","",""]
[null,null,null,null,null,null,null,"","","","",{"$f":"IF(ISBLANK(C792),\"\",C792/'Betriebsdaten II'!$T$26)","v":""},"","",""]
[null,null,null,null,null,null,null,"","","","",{"$f":"IF(ISBLANK(C793),\"\",C793/'Betriebsdaten II'!$T$26)","v":""},"","",""]
[null,null,null,null,null,null,null,"","","","",{"$f":"IF(ISBLANK(C794),\"\",C794/'Betriebsdaten II'!$T$26)","v":""},"","",""]
[null,null,null,null,null,null,null,"","","","",{"$f":"IF(ISBLANK(C795),\"\",C795/'Betriebsdaten II'!$T$26)","v":""},"","",""]
[null,null,null,null,null,null,null,"","","","",{"$f":"IF(ISBLANK(C796),\"\",C796/'Betriebsdaten II'!$T$26)","v":""},"","",""]
[null,null,null,null,null,null,null,"","","","",{"$f":"IF(ISBLANK(C797),\"\",C797/'Betriebsdaten II'!$T$26)","v":""},"","",""]
[null,null,null,null,null,null,null,"","","","",{"$f":"IF(ISBLANK(C798),\"\",C798/'Betriebsdaten II'!$T$26)","v":""},"","",""]
[null,null,null,null,null,null,null,"","","","",{"$f":"IF(ISBLANK(C799),\"\",C799/'Betriebsdaten II'!$T$26)","v":""},"","",""]
[null,null,null,null,null,null,null,"","","","",{"$f":"IF(ISBLANK(C800),\"\",C800/'Betriebsdaten II'!$T$26)","v":""},"","",""]
[null,null,null,null,null,null,null,"","","","",{"$f":"IF(ISBLANK(C801),\"\",C801/'Betriebsdaten II'!$T$26)","v":""},"","",""]
[null,null,null,null,null,null,null,"","","","",{"$f":"IF(ISBLANK(C802),\"\",C802/'Betriebsdaten II'!$T$26)","v":""},"","",""]
[null,null,null,null,null,null,null,"","","","",{"$f":"IF(ISBLANK(C803),\"\",C803/'Betriebsdaten II'!$T$26)","v":""},"","",""]
[null,null,null,null,null,null,null,"","","","",{"$f":"IF(ISBLANK(C804),\"\",C804/'Betriebsdaten II'!$T$26)","v":""},"","",""]
[null,null,null,null,null,null,null,"","","","",{"$f":"IF(ISBLANK(C805),\"\",C805/'Betriebsdaten II'!$T$26)","v":""},"","",""]
[null,null,null,null,null,null,null,"","","","",{"$f":"IF(ISBLANK(C806),\"\",C806/'Betriebsdaten II'!$T$26)","v":""},"","",""]
[null,null,null,null,null,null,null,"","","","",{"$f":"IF(ISBLANK(C807),\"\",C807/'Betriebsdaten II'!$T$26)","v":""},"","",""]
[null,null,null,null,null,null,null,"","","","",{"$f":"IF(ISBLANK(C808),\"\",C808/'Betriebsdaten II'!$T$26)","v":""},"","",""]
[null,null,null,null,null,null,null,"","","","",{"$f":"IF(ISBLANK(C809),\"\",C809/'Betriebsdaten II'!$T$26)","v":""},"","",""]
[null,null,null,null,null,null,null,"","","","",{"$f":"IF(ISBLANK(C810),\"\",C810/'Betriebsdaten II'!$T$26)","v":""},"","",""]
[null,null,null,null,null,null,null,"","","","",{"$f":"IF(ISBLANK(C811),\"\",C811/'Betriebsdaten II'!$T$26)","v":""},"","",""]
[null,null,null,null,null,null,null,"","","","",{"$f":"IF(ISBLANK(C812),\"\",C812/'Betriebsdaten II'!$T$26)","v":""},"","",""]
[null,null,null,null,null,null,null,"","","","",{"$f":"IF(ISBLANK(C813),\"\",C813/'Betriebsdaten II'!$T$26)","v":""},"","",""]
[null,null,null,null,null,null,null,"","","","",{"$f":"IF(ISBLANK(C814),\"\",C814/'Betriebsdaten II'!$T$26)","v":""},"","",""]
[null,null,null,null,null,null,null,"","","","",{"$f":"IF(ISBLANK(C815),\"\",C815/'Betriebsdaten II'!$T$26)","v":""},"","",""]
[null,null,null,null,null,null,null,"","","","",{"$f":"IF(ISBLANK(C816),\"\",C816/'Betriebsdaten II'!$T$26)","v":""},"","",""]
[null,null,null,null,null,null,null,"","","","",{"$f":"IF(ISBLANK(C817),\"\",C817/'Betriebsdaten II'!$T$26)","v":""},"","",""]
[null,null,null,null,null,null,null,"","","","",{"$f":"IF(ISBLANK(C818),\"\",C818/'Betriebsdaten II'!$T$26)","v":""},"","",""]
[null,null,null,null,null,null,null,"","","","",{"$f":"IF(ISBLANK(C819),\"\",C819/'Betriebsdaten II'!$T$26)","v":""},"","",""]
[null,null,null,null,null,null,null,"","","","",{"$f":"IF(ISBLANK(C820),\"\",C820/'Betriebsdaten II'!$T$26)","v":""},"","",""]
[null,null,null,null,null,null,null,"","","","",{"$f":"IF(ISBLANK(C821),\"\",C821/'Betriebsdaten II'!$T$26)","v":""},"","",""]
[null,null,null,null,null,null,null,"","","","",{"$f":"IF(ISBLANK(C822),\"\",C822/'Betriebsdaten II'!$T$26)","v":""},"","",""]
[null,null,null,null,null,null,null,"","","","",{"$f":"IF(ISBLANK(C823),\"\",C823/'Betriebsdaten II'!$T$26)","v":""},"","",""]
[null,null,null,null,null,null,null,"","","","",{"$f":"IF(ISBLANK(C824),\"\",C824/'Betriebsdaten II'!$T$26)","v":""},"","",""]
[null,null,null,null,null,null,null,"","","","",{"$f":"IF(ISBLANK(C825),\"\",C825/'Betriebsdaten II'!$T$26)","v":""},"","",""]
[null,null,null,null,null,null,null,"","","","",{"$f":"IF(ISBLANK(C826),\"\",C826/'Betriebsdaten II'!$T$26)","v":""},"","",""]
[null,null,null,null,null,null,null,"","","","",{"$f":"IF(ISBLANK(C827),\"\",C827/'Betriebsdaten II'!$T$26)","v":""},"","",""]
[null,null,null,null,null,null,null,"","","","",{"$f":"IF(ISBLANK(C828),\"\",C828/'Betriebsdaten II'!$T$26)","v":""},"","",""]
[null,null,null,null,null,null,null,"","","","",{"$f":"IF(ISBLANK(C829),\"\",C829/'Betriebsdaten II'!$T$26)","v":""},"","",""]
[null,null,null,null,null,null,null,"","","","",{"$f":"IF(ISBLANK(C830),\"\",C830/'Betriebsdaten II'!$T$26)","v":""},"","",""]
[null,null,null,null,null,null,null,"","","","",{"$f":"IF(ISBLANK(C831),\"\",C831/'Betriebsdaten II'!$T$26)","v":""},"","",""]
[null,null,null,null,null,null,null,"","","","",{"$f":"IF(ISBLANK(C832),\"\",C832/'Betriebsdaten II'!$T$26)","v":""},"","",""]
[null,null,null,null,null,null,null,"","","","",{"$f":"IF(ISBLANK(C833),\"\",C833/'Betriebsdaten II'!$T$26)","v":""},"","",""]
[null,null,null,null,null,null,null,"","","","",{"$f":"IF(ISBLANK(C834),\"\",C834/'Betriebsdaten II'!$T$26)","v":""},"","",""]
[null,null,null,null,null,null,null,"","","","",{"$f":"IF(ISBLANK(C835),\"\",C835/'Betriebsdaten II'!$T$26)","v":""},"","",""]
[null,null,null,null,null,null,null,"","","","",{"$f":"IF(ISBLANK(C836),\"\",C836/'Betriebsdaten II'!$T$26)","v":""},"","",""]
[null,null,null,null,null,null,null,"","","","",{"$f":"IF(ISBLANK(C837),\"\",C837/'Betriebsdaten II'!$T$26)","v":""},"","",""]
[null,null,null,null,null,null,null,"","","","",{"$f":"IF(ISBLANK(C838),\"\",C838/'Betriebsdaten II'!$T$26)","v":""},"","",""]
[null,null,null,null,null,null,null,"","","","",{"$f":"IF(ISBLANK(C839),\"\",C839/'Betriebsdaten II'!$T$26)","v":""},"","",""]
[null,null,null,null,null,null,null,"","","","",{"$f":"IF(ISBLANK(C840),\"\",C840/'Betriebsdaten II'!$T$26)","v":""},"","",""]
[null,null,null,null,null,null,null,"","","","",{"$f":"IF(ISBLANK(C841),\"\",C841/'Betriebsdaten II'!$T$26)","v":""},"","",""]
[null,null,null,null,null,null,null,{"$f":"IF(ISBLANK(A842),\"\",NetzvorlaufTemp)","v":""},{"$f":"IF(ISBLANK(A842),\"\",NetzrücklaufTemp)","v":""},{"$f":"IF(OR(ISBLANK(C842),ISBLANK(E842)),\"\",E842/C842*1000)","v":""},{"$f":"IF(OR(ISBLANK(C842),ISBLANK(E842)),\"\",C842/(4.189*978*E842/3600))","v":""},{"$f":"IF(ISBLANK(C842),\"\",C842/'Betriebsdaten II'!$T$26)","v":""},{"$f":"IF(ISERR(J842*L842),\"\",J842*L842)","v":""},"",{"$f":"IF(N842=\"\",\"\",IF(AND(N842<5,K842<30), \"Optimierungsmöglichkeiten prüfen!\",\"\"))","v":""}]
[null,null,null,null,null,null,null,"","","","",{"$f":"IF(ISBLANK(C843),\"\",C843/'Betriebsdaten II'!$T$26)","v":""},"",{"$f":"IF(ISERR(RANK(M843,$M$10:$M$1210)),\"\",RANK(M843,$M$10:$M$1210))","v":""},""]
[null,null,null,null,null,null,null,"","","","",{"$f":"IF(ISBLANK(C844),\"\",C844/'Betriebsdaten II'!$T$26)","v":""},"","",""]
[null,null,null,null,null,null,null,"","","","",{"$f":"IF(ISBLANK(C845),\"\",C845/'Betriebsdaten II'!$T$26)","v":""},"","",""]
[null,null,null,null,null,null,null,"","","","",{"$f":"IF(ISBLANK(C846),\"\",C846/'Betriebsdaten II'!$T$26)","v":""},"","",""]
[null,null,null,null,null,null,null,"","","","",{"$f":"IF(ISBLANK(C847),\"\",C847/'Betriebsdaten II'!$T$26)","v":""},"","",""]
[null,null,null,null,null,null,null,"","","","",{"$f":"IF(ISBLANK(C848),\"\",C848/'Betriebsdaten II'!$T$26)","v":""},"","",""]
[null,null,null,null,null,null,null,"","","","",{"$f":"IF(ISBLANK(C849),\"\",C849/'Betriebsdaten II'!$T$26)","v":""},"","",""]
[null,null,null,null,null,null,null,"","","","",{"$f":"IF(ISBLANK(C850),\"\",C850/'Betriebsdaten II'!$T$26)","v":""},"","",""]
[null,null,null,null,null,null,null,"","","","",{"$f":"IF(ISBLANK(C851),\"\",C851/'Betriebsdaten II'!$T$26)","v":""},"","",""]
[null,null,null,null,null,null,null,"","","","",{"$f":"IF(ISBLANK(C852),\"\",C852/'Betriebsdaten II'!$T$26)","v":""},"","",""]
[null,null,null,null,null,null,null,"","","","",{"$f":"IF(ISBLANK(C853),\"\",C853/'Betriebsdaten II'!$T$26)","v":""},"","",""]
[null,null,null,null,null,null,null,"","","","",{"$f":"IF(ISBLANK(C854),\"\",C854/'Betriebsdaten II'!$T$26)","v":""},"","",""]
[null,null,null,null,null,null,null,"","","","",{"$f":"IF(ISBLANK(C855),\"\",C855/'Betriebsdaten II'!$T$26)","v":""},"","",""]
[null,null,null,null,null,null,null,"","","","",{"$f":"IF(ISBLANK(C856),\"\",C856/'Betriebsdaten II'!$T$26)","v":""},"","",""]
[null,null,null,null,null,null,null,"","","","",{"$f":"IF(ISBLANK(C857),\"\",C857/'Betriebsdaten II'!$T$26)","v":""},"","",""]
[null,null,null,null,null,null,null,"","","","",{"$f":"IF(ISBLANK(C858),\"\",C858/'Betriebsdaten II'!$T$26)","v":""},"","",""]
[null,null,null,null,null,null,null,"","","","",{"$f":"IF(ISBLANK(C859),\"\",C859/'Betriebsdaten II'!$T$26)","v":""},"","",""]
[null,null,null,null,null,null,null,"","","","",{"$f":"IF(ISBLANK(C860),\"\",C860/'Betriebsdaten II'!$T$26)","v":""},"","",""]
[null,null,null,null,null,null,null,"","","","",{"$f":"IF(ISBLANK(C861),\"\",C861/'Betriebsdaten II'!$T$26)","v":""},"","",""]
[null,null,null,null,null,null,null,"","","","",{"$f":"IF(ISBLANK(C862),\"\",C862/'Betriebsdaten II'!$T$26)","v":""},"","",""]
[null,null,null,null,null,null,null,"","","","",{"$f":"IF(ISBLANK(C863),\"\",C863/'Betriebsdaten II'!$T$26)","v":""},"","",""]
[null,null,null,null,null,null,null,"","","","",{"$f":"IF(ISBLANK(C864),\"\",C864/'Betriebsdaten II'!$T$26)","v":""},"","",""]
[null,null,null,null,null,null,null,"","","","",{"$f":"IF(ISBLANK(C865),\"\",C865/'Betriebsdaten II'!$T$26)","v":""},"","",""]
[null,null,null,null,null,null,null,"","","","",{"$f":"IF(ISBLANK(C866),\"\",C866/'Betriebsdaten II'!$T$26)","v":""},"","",""]
[null,null,null,null,null,null,null,"","","","",{"$f":"IF(ISBLANK(C867),\"\",C867/'Betriebsdaten II'!$T$26)","v":""},"","",""]
[null,null,null,null,null,null,null,"","","","",{"$f":"IF(ISBLANK(C868),\"\",C868/'Betriebsdaten II'!$T$26)","v":""},"","",""]
[null,null,null,null,null,null,null,"","","","",{"$f":"IF(ISBLANK(C869),\"\",C869/'Betriebsdaten II'!$T$26)","v":""},"","",""]
[null,null,null,null,null,null,null,"","","","",{"$f":"IF(ISBLANK(C870),\"\",C870/'Betriebsdaten II'!$T$26)","v":""},"","",""]
[null,null,null,null,null,null,null,"","","","",{"$f":"IF(ISBLANK(C871),\"\",C871/'Betriebsdaten II'!$T$26)","v":""},"","",""]
[null,null,null,null,null,null,null,"","","","",{"$f":"IF(ISBLANK(C872),\"\",C872/'Betriebsdaten II'!$T$26)","v":""},"","",""]
[null,null,null,null,null,null,null,"","","","",{"$f":"IF(ISBLANK(C873),\"\",C873/'Betriebsdaten II'!$T$26)","v":""},"","",""]
[null,null,null,null,null,null,null,"","","","",{"$f":"IF(ISBLANK(C874),\"\",C874/'Betriebsdaten II'!$T$26)","v":""},"","",""]
[null,null,null,null,null,null,null,"","","","",{"$f":"IF(ISBLANK(C875),\"\",C875/'Betriebsdaten II'!$T$26)","v":""},"","",""]
[null,null,null,null,null,null,null,"","","","",{"$f":"IF(ISBLANK(C876),\"\",C876/'Betriebsdaten II'!$T$26)","v":""},"","",""]
[null,null,null,null,null,null,null,"","","","",{"$f":"IF(ISBLANK(C877),\"\",C877/'Betriebsdaten II'!$T$26)","v":""},"","",""]
[null,null,null,null,null,null,null,"","","","",{"$f":"IF(ISBLANK(C878),\"\",C878/'Betriebsdaten II'!$T$26)","v":""},"","",""]
[null,null,null,null,null,null,null,"","","","",{"$f":"IF(ISBLANK(C879),\"\",C879/'Betriebsdaten II'!$T$26)","v":""},"","",""]
[null,null,null,null,null,null,null,"","","","",{"$f":"IF(ISBLANK(C880),\"\",C880/'Betriebsdaten II'!$T$26)","v":""},"","",""]
[null,null,null,null,null,null,null,"","","","",{"$f":"IF(ISBLANK(C881),\"\",C881/'Betriebsdaten II'!$T$26)","v":""},"","",""]
[null,null,null,null,null,null,null,"","","","",{"$f":"IF(ISBLANK(C882),\"\",C882/'Betriebsdaten II'!$T$26)","v":""},"","",""]
[null,null,null,null,null,null,null,"","","","",{"$f":"IF(ISBLANK(C883),\"\",C883/'Betriebsdaten II'!$T$26)","v":""},"","",""]
[null,null,null,null,null,null,null,"","","","",{"$f":"IF(ISBLANK(C884),\"\",C884/'Betriebsdaten II'!$T$26)","v":""},"","",""]
[null,null,null,null,null,null,null,"","","","",{"$f":"IF(ISBLANK(C885),\"\",C885/'Betriebsdaten II'!$T$26)","v":""},"","",""]
[null,null,null,null,null,null,null,"","","","",{"$f":"IF(ISBLANK(C886),\"\",C886/'Betriebsdaten II'!$T$26)","v":""},"","",""]
[null,null,null,null,null,null,null,"","","","",{"$f":"IF(ISBLANK(C887),\"\",C887/'Betriebsdaten II'!$T$26)","v":""},"","",""]
[null,null,null,null,null,null,null,"","","","",{"$f":"IF(ISBLANK(C888),\"\",C888/'Betriebsdaten II'!$T$26)","v":""},"","",""]
[null,null,null,null,null,null,null,"","","","",{"$f":"IF(ISBLANK(C889),\"\",C889/'Betriebsdaten II'!$T$26)","v":""},"","",""]
[null,null,null,null,null,null,null,"","","","",{"$f":"IF(ISBLANK(C890),\"\",C890/'Betriebsdaten II'!$T$26)","v":""},"","",""]
[null,null,null,null,null,null,null,"","","","",{"$f":"IF(ISBLANK(C891),\"\",C891/'Betriebsdaten II'!$T$26)","v":""},"","",""]
[null,null,null,null,null,null,null,"","","","",{"$f":"IF(ISBLANK(C892),\"\",C892/'Betriebsdaten II'!$T$26)","v":""},"","",""]
[null,null,null,null,null,null,null,"","","","",{"$f":"IF(ISBLANK(C893),\"\",C893/'Betriebsdaten II'!$T$26)","v":""},"","",""]
[null,null,null,null,null,null,null,"","","","",{"$f":"IF(ISBLANK(C894),\"\",C894/'Betriebsdaten II'!$T$26)","v":""},"","",""]
[null,null,null,null,null,null,null,"","","","",{"$f":"IF(ISBLANK(C895),\"\",C895/'Betriebsdaten II'!$T$26)","v":""},"","",""]
[null,null,null,null,null,null,null,"","","","",{"$f":"IF(ISBLANK(C896),\"\",C896/'Betriebsdaten II'!$T$26)","v":""},"","",""]
[null,null,null,null,null,null,null,"","","","",{"$f":"IF(ISBLANK(C897),\"\",C897/'Betriebsdaten II'!$T$26)","v":""},"","",""]
[null,null,null,null,null,null,null,"","","","",{"$f":"IF(ISBLANK(C898),\"\",C898/'Betriebsdaten II'!$T$26)","v":""},"","",""]
[null,null,null,null,null,null,null,"","","","",{"$f":"IF(ISBLANK(C899),\"\",C899/'Betriebsdaten II'!$T$26)","v":""},"","",""]
[null,null,null,null,null,null,null,"","","","",{"$f":"IF(ISBLANK(C900),\"\",C900/'Betriebsdaten II'!$T$26)","v":""},"","",""]
[null,null,null,null,null,null,null,"","","","",{"$f":"IF(ISBLANK(C901),\"\",C901/'Betriebsdaten II'!$T$26)","v":""},"","",""]
[null,null,null,null,null,null,null,"","","","",{"$f":"IF(ISBLANK(C902),\"\",C902/'Betriebsdaten II'!$T$26)","v":""},"","",""]
[null,null,null,null,null,null,null,"","","","",{"$f":"IF(ISBLANK(C903),\"\",C903/'Betriebsdaten II'!$T$26)","v":""},"","",""]
[null,null,null,null,null,null,null,"","","","",{"$f":"IF(ISBLANK(C904),\"\",C904/'Betriebsdaten II'!$T$26)","v":""},"","",""]
[null,null,null,null,null,null,null,"","","","",{"$f":"IF(ISBLANK(C905),\"\",C905/'Betriebsdaten II'!$T$26)","v":""},"","",""]
[null,null,null,null,null,null,null,{"$f":"IF(ISBLANK(A906),\"\",NetzvorlaufTemp)","v":""},{"$f":"IF(ISBLANK(A906),\"\",NetzrücklaufTemp)","v":""},{"$f":"IF(OR(ISBLANK(C906),ISBLANK(E906)),\"\",E906/C906*1000)","v":""},{"$f":"IF(OR(ISBLANK(C906),ISBLANK(E906)),\"\",C906/(4.189*978*E906/3600))","v":""},{"$f":"IF(ISBLANK(C906),\"\",C906/'Betriebsdaten II'!$T$26)","v":""},{"$f":"IF(ISERR(J906*L906),\"\",J906*L906)","v":""},"",{"$f":"IF(N906=\"\",\"\",IF(AND(N906<5,K906<30), \"Optimierungsmöglichkeiten prüfen!\",\"\"))","v":""}]
[null,null,null,null,null,null,null,"","","","",{"$f":"IF(ISBLANK(C907),\"\",C907/'Betriebsdaten II'!$T$26)","v":""},"",{"$f":"IF(ISERR(RANK(M907,$M$10:$M$1210)),\"\",RANK(M907,$M$10:$M$1210))","v":""},""]
[null,null,null,null,null,null,null,"","","","",{"$f":"IF(ISBLANK(C908),\"\",C908/'Betriebsdaten II'!$T$26)","v":""},"","",""]
[null,null,null,null,null,null,null,"","","","",{"$f":"IF(ISBLANK(C909),\"\",C909/'Betriebsdaten II'!$T$26)","v":""},"","",""]
[null,null,null,null,null,null,null,"","","","",{"$f":"IF(ISBLANK(C910),\"\",C910/'Betriebsdaten II'!$T$26)","v":""},"","",""]
[null,null,null,null,null,null,null,"","","","",{"$f":"IF(ISBLANK(C911),\"\",C911/'Betriebsdaten II'!$T$26)","v":""},"","",""]
[null,null,null,null,null,null,null,"","","","",{"$f":"IF(ISBLANK(C912),\"\",C912/'Betriebsdaten II'!$T$26)","v":""},"","",""]
[null,null,null,null,null,null,null,"","","","",{"$f":"IF(ISBLANK(C913),\"\",C913/'Betriebsdaten II'!$T$26)","v":""},"","",""]
[null,null,null,null,null,null,null,"","","","",{"$f":"IF(ISBLANK(C914),\"\",C914/'Betriebsdaten II'!$T$26)","v":""},"","",""]
[null,null,null,null,null,null,null,"","","","",{"$f":"IF(ISBLANK(C915),\"\",C915/'Betriebsdaten II'!$T$26)","v":""},"","",""]
[null,null,null,null,null,null,null,"","","","",{"$f":"IF(ISBLANK(C916),\"\",C916/'Betriebsdaten II'!$T$26)","v":""},"","",""]
[null,null,null,null,null,null,null,"","","","",{"$f":"IF(ISBLANK(C917),\"\",C917/'Betriebsdaten II'!$T$26)","v":""},"","",""]
[null,null,null,null,null,null,null,"","","","",{"$f":"IF(ISBLANK(C918),\"\",C918/'Betriebsdaten II'!$T$26)","v":""},"","",""]
[null,null,null,null,null,null,null,"","","","",{"$f":"IF(ISBLANK(C919),\"\",C919/'Betriebsdaten II'!$T$26)","v":""},"","",""]
[null,null,null,null,null,null,null,"","","","",{"$f":"IF(ISBLANK(C920),\"\",C920/'Betriebsdaten II'!$T$26)","v":""},"","",""]
[null,null,null,null,null,null,null,"","","","",{"$f":"IF(ISBLANK(C921),\"\",C921/'Betriebsdaten II'!$T$26)","v":""},"","",""]
[null,null,null,null,null,null,null,"","","","",{"$f":"IF(ISBLANK(C922),\"\",C922/'Betriebsdaten II'!$T$26)","v":""},"","",""]
[null,null,null,null,null,null,null,"","","","",{"$f":"IF(ISBLANK(C923),\"\",C923/'Betriebsdaten II'!$T$26)","v":""},"","",""]
[null,null,null,null,null,null,null,"","","","",{"$f":"IF(ISBLANK(C924),\"\",C924/'Betriebsdaten II'!$T$26)","v":""},"","",""]
[null,null,null,null,null,null,null,"","","","",{"$f":"IF(ISBLANK(C925),\"\",C925/'Betriebsdaten II'!$T$26)","v":""},"","",""]
[null,null,null,null,null,null,null,"","","","",{"$f":"IF(ISBLANK(C926),\"\",C926/'Betriebsdaten II'!$T$26)","v":""},"","",""]
[null,null,null,null,null,null,null,"","","","",{"$f":"IF(ISBLANK(C927),\"\",C927/'Betriebsdaten II'!$T$26)","v":""},"","",""]
[null,null,null,null,null,null,null,"","","","",{"$f":"IF(ISBLANK(C928),\"\",C928/'Betriebsdaten II'!$T$26)","v":""},"","",""]
[null,null,null,null,null,null,null,"","","","",{"$f":"IF(ISBLANK(C929),\"\",C929/'Betriebsdaten II'!$T$26)","v":""},"","",""]
[null,null,null,null,null,null,null,"","","","",{"$f":"IF(ISBLANK(C930),\"\",C930/'Betriebsdaten II'!$T$26)","v":""},"","",""]
[null,null,null,null,null,null,null,"","","","",{"$f":"IF(ISBLANK(C931),\"\",C931/'Betriebsdaten II'!$T$26)","v":""},"","",""]
[null,null,null,null,null,null,null,"","","","",{"$f":"IF(ISBLANK(C932),\"\",C932/'Betriebsdaten II'!$T$26)","v":""},"","",""]
[null,null,null,null,null,null,null,"","","","",{"$f":"IF(ISBLANK(C933),\"\",C933/'Betriebsdaten II'!$T$26)","v":""},"","",""]
[null,null,null,null,null,null,null,"","","","",{"$f":"IF(ISBLANK(C934),\"\",C934/'Betriebsdaten II'!$T$26)","v":""},"","",""]
[null,null,null,null,null,null,null,"","","","",{"$f":"IF(ISBLANK(C935),\"\",C935/'Betriebsdaten II'!$T$26)","v":""},"","",""]
[null,null,null,null,null,null,null,"","","","",{"$f":"IF(ISBLANK(C936),\"\",C936/'Betriebsdaten II'!$T$26)","v":""},"","",""]
[null,null,null,null,null,null,null,"","","","",{"$f":"IF(ISBLANK(C937),\"\",C937/'Betriebsdaten II'!$T$26)","v":""},"","",""]
[null,null,null,null,null,null,null,"","","","",{"$f":"IF(ISBLANK(C938),\"\",C938/'Betriebsdaten II'!$T$26)","v":""},"","",""]
[null,null,null,null,null,null,null,"","","","",{"$f":"IF(ISBLANK(C939),\"\",C939/'Betriebsdaten II'!$T$26)","v":""},"","",""]
[null,null,null,null,null,null,null,"","","","",{"$f":"IF(ISBLANK(C940),\"\",C940/'Betriebsdaten II'!$T$26)","v":""},"","",""]
[null,null,null,null,null,null,null,"","","","",{"$f":"IF(ISBLANK(C941),\"\",C941/'Betriebsdaten II'!$T$26)","v":""},"","",""]
[null,null,null,null,null,null,null,"","","","",{"$f":"IF(ISBLANK(C942),\"\",C942/'Betriebsdaten II'!$T$26)","v":""},"","",""]
[null,null,null,null,null,null,null,"","","","",{"$f":"IF(ISBLANK(C943),\"\",C943/'Betriebsdaten II'!$T$26)","v":""},"","",""]
[null,null,null,null,null,null,null,"","","","",{"$f":"IF(ISBLANK(C944),\"\",C944/'Betriebsdaten II'!$T$26)","v":""},"","",""]
[null,null,null,null,null,null,null,"","","","",{"$f":"IF(ISBLANK(C945),\"\",C945/'Betriebsdaten II'!$T$26)","v":""},"","",""]
[null,null,null,null,null,null,null,"","","","",{"$f":"IF(ISBLANK(C946),\"\",C946/'Betriebsdaten II'!$T$26)","v":""},"","",""]
[null,null,null,null,null,null,null,"","","","",{"$f":"IF(ISBLANK(C947),\"\",C947/'Betriebsdaten II'!$T$26)","v":""},"","",""]
[null,null,null,null,null,null,null,"","","","",{"$f":"IF(ISBLANK(C948),\"\",C948/'Betriebsdaten II'!$T$26)","v":""},"","",""]
[null,null,null,null,null,null,null,"","","","",{"$f":"IF(ISBLANK(C949),\"\",C949/'Betriebsdaten II'!$T$26)","v":""},"","",""]
[null,null,null,null,null,null,null,"","","","",{"$f":"IF(ISBLANK(C950),\"\",C950/'Betriebsdaten II'!$T$26)","v":""},"","",""]
[null,null,null,null,null,null,null,"","","","",{"$f":"IF(ISBLANK(C951),\"\",C951/'Betriebsdaten II'!$T$26)","v":""},"","",""]
[null,null,null,null,null,null,null,"","","","",{"$f":"IF(ISBLANK(C952),\"\",C952/'Betriebsdaten II'!$T$26)","v":""},"","",""]
[null,null,null,null,null,null,null,"","","","",{"$f":"IF(ISBLANK(C953),\"\",C953/'Betriebsdaten II'!$T$26)","v":""},"","",""]
[null,null,null,null,null,null,null,"","","","",{"$f":"IF(ISBLANK(C954),\"\",C954/'Betriebsdaten II'!$T$26)","v":""},"","",""]
[null,null,null,null,null,null,null,"","","","",{"$f":"IF(ISBLANK(C955),\"\",C955/'Betriebsdaten II'!$T$26)","v":""},"","",""]
[null,null,null,null,null,null,null,"","","","",{"$f":"IF(ISBLANK(C956),\"\",C956/'Betriebsdaten II'!$T$26)","v":""},"","",""]
[null,null,null,null,null,null,null,"","","","",{"$f":"IF(ISBLANK(C957),\"\",C957/'Betriebsdaten II'!$T$26)","v":""},"","",""]
[null,null,null,null,null,null,null,"","","","",{"$f":"IF(ISBLANK(C958),\"\",C958/'Betriebsdaten II'!$T$26)","v":""},"","",""]
[null,null,null,null,null,null,null,"","","","",{"$f":"IF(ISBLANK(C959),\"\",C959/'Betriebsdaten II'!$T$26)","v":""},"","",""]
[null,null,null,null,null,null,null,"","","","",{"$f":"IF(ISBLANK(C960),\"\",C960/'Betriebsdaten II'!$T$26)","v":""},"","",""]
[null,null,null,null,null,null,null,"","","","",{"$f":"IF(ISBLANK(C961),\"\",C961/'Betriebsdaten II'!$T$26)","v":""},"","",""]
[null,null,null,null,null,null,null,"","","","",{"$f":"IF(ISBLANK(C962),\"\",C962/'Betriebsdaten II'!$T$26)","v":""},"","",""]
[null,null,null,null,null,null,null,"","","","",{"$f":"IF(ISBLANK(C963),\"\",C963/'Betriebsdaten II'!$T$26)","v":""},"","",""]
[null,null,null,null,null,null,null,"","","","",{"$f":"IF(ISBLANK(C964),\"\",C964/'Betriebsdaten II'!$T$26)","v":""},"","",""]
[null,null,null,null,null,null,null,"","","","",{"$f":"IF(ISBLANK(C965),\"\",C965/'Betriebsdaten II'!$T$26)","v":""},"","",""]
[null,null,null,null,null,null,null,"","","","",{"$f":"IF(ISBLANK(C966),\"\",C966/'Betriebsdaten II'!$T$26)","v":""},"","",""]
[null,null,null,null,null,null,null,"","","","",{"$f":"IF(ISBLANK(C967),\"\",C967/'Betriebsdaten II'!$T$26)","v":""},"","",""]
[null,null,null,null,null,null,null,"","","","",{"$f":"IF(ISBLANK(C968),\"\",C968/'Betriebsdaten II'!$T$26)","v":""},"","",""]
[null,null,null,null,null,null,null,"","","","",{"$f":"IF(ISBLANK(C969),\"\",C969/'Betriebsdaten II'!$T$26)","v":""},"","",""]
[null,null,null,null,null,null,null,{"$f":"IF(ISBLANK(A970),\"\",NetzvorlaufTemp)","v":""},{"$f":"IF(ISBLANK(A970),\"\",NetzrücklaufTemp)","v":""},{"$f":"IF(OR(ISBLANK(C970),ISBLANK(E970)),\"\",E970/C970*1000)","v":""},{"$f":"IF(OR(ISBLANK(C970),ISBLANK(E970)),\"\",C970/(4.189*978*E970/3600))","v":""},{"$f":"IF(ISBLANK(C970),\"\",C970/'Betriebsdaten II'!$T$26)","v":""},{"$f":"IF(ISERR(J970*L970),\"\",J970*L970)","v":""},"",{"$f":"IF(N970=\"\",\"\",IF(AND(N970<5,K970<30), \"Optimierungsmöglichkeiten prüfen!\",\"\"))","v":""}]
[null,null,null,null,null,null,null,"","","","",{"$f":"IF(ISBLANK(C971),\"\",C971/'Betriebsdaten II'!$T$26)","v":""},"",{"$f":"IF(ISERR(RANK(M971,$M$10:$M$1210)),\"\",RANK(M971,$M$10:$M$1210))","v":""},""]
[null,null,null,null,null,null,null,"","","","",{"$f":"IF(ISBLANK(C972),\"\",C972/'Betriebsdaten II'!$T$26)","v":""},"","",""]
[null,null,null,null,null,null,null,"","","","",{"$f":"IF(ISBLANK(C973),\"\",C973/'Betriebsdaten II'!$T$26)","v":""},"","",""]
[null,null,null,null,null,null,null,"","","","",{"$f":"IF(ISBLANK(C974),\"\",C974/'Betriebsdaten II'!$T$26)","v":""},"","",""]
[null,null,null,null,null,null,null,"","","","",{"$f":"IF(ISBLANK(C975),\"\",C975/'Betriebsdaten II'!$T$26)","v":""},"","",""]
[null,null,null,null,null,null,null,"","","","",{"$f":"IF(ISBLANK(C976),\"\",C976/'Betriebsdaten II'!$T$26)","v":""},"","",""]
[null,null,null,null,null,null,null,"","","","",{"$f":"IF(ISBLANK(C977),\"\",C977/'Betriebsdaten II'!$T$26)","v":""},"","",""]
[null,null,null,null,null,null,null,"","","","",{"$f":"IF(ISBLANK(C978),\"\",C978/'Betriebsdaten II'!$T$26)","v":""},"","",""]
[null,null,null,null,null,null,null,"","","","",{"$f":"IF(ISBLANK(C979),\"\",C979/'Betriebsdaten II'!$T$26)","v":""},"","",""]
[null,null,null,null,null,null,null,"","","","",{"$f":"IF(ISBLANK(C980),\"\",C980/'Betriebsdaten II'!$T$26)","v":""},"","",""]
[null,null,null,null,null,null,null,"","","","",{"$f":"IF(ISBLANK(C981),\"\",C981/'Betriebsdaten II'!$T$26)","v":""},"","",""]
[null,null,null,null,null,null,null,"","","","",{"$f":"IF(ISBLANK(C982),\"\",C982/'Betriebsdaten II'!$T$26)","v":""},"","",""]
[null,null,null,null,null,null,null,"","","","",{"$f":"IF(ISBLANK(C983),\"\",C983/'Betriebsdaten II'!$T$26)","v":""},"","",""]
[null,null,null,null,null,null,null,"","","","",{"$f":"IF(ISBLANK(C984),\"\",C984/'Betriebsdaten II'!$T$26)","v":""},"","",""]
[null,null,null,null,null,null,null,"","","","",{"$f":"IF(ISBLANK(C985),\"\",C985/'Betriebsdaten II'!$T$26)","v":""},"","",""]
[null,null,null,null,null,null,null,"","","","",{"$f":"IF(ISBLANK(C986),\"\",C986/'Betriebsdaten II'!$T$26)","v":""},"","",""]
[null,null,null,null,null,null,null,"","","","",{"$f":"IF(ISBLANK(C987),\"\",C987/'Betriebsdaten II'!$T$26)","v":""},"","",""]
[null,null,null,null,null,null,null,"","","","",{"$f":"IF(ISBLANK(C988),\"\",C988/'Betriebsdaten II'!$T$26)","v":""},"","",""]
[null,null,null,null,null,null,null,"","","","",{"$f":"IF(ISBLANK(C989),\"\",C989/'Betriebsdaten II'!$T$26)","v":""},"","",""]
[null,null,null,null,null,null,null,"","","","",{"$f":"IF(ISBLANK(C990),\"\",C990/'Betriebsdaten II'!$T$26)","v":""},"","",""]
[null,null,null,null,null,null,null,"","","","",{"$f":"IF(ISBLANK(C991),\"\",C991/'Betriebsdaten II'!$T$26)","v":""},"","",""]
[null,null,null,null,null,null,null,"","","","",{"$f":"IF(ISBLANK(C992),\"\",C992/'Betriebsdaten II'!$T$26)","v":""},"","",""]
[null,null,null,null,null,null,null,"","","","",{"$f":"IF(ISBLANK(C993),\"\",C993/'Betriebsdaten II'!$T$26)","v":""},"","",""]
[null,null,null,null,null,null,null,"","","","",{"$f":"IF(ISBLANK(C994),\"\",C994/'Betriebsdaten II'!$T$26)","v":""},"","",""]
[null,null,null,null,null,null,null,"","","","",{"$f":"IF(ISBLANK(C995),\"\",C995/'Betriebsdaten II'!$T$26)","v":""},"","",""]
[null,null,null,null,null,null,null,"","","","",{"$f":"IF(ISBLANK(C996),\"\",C996/'Betriebsdaten II'!$T$26)","v":""},"","",""]
[null,null,null,null,null,null,null,"","","","",{"$f":"IF(ISBLANK(C997),\"\",C997/'Betriebsdaten II'!$T$26)","v":""},"","",""]
[null,null,null,null,null,null,null,"","","","",{"$f":"IF(ISBLANK(C998),\"\",C998/'Betriebsdaten II'!$T$26)","v":""},"","",""]
[null,null,null,null,null,null,null,"","","","",{"$f":"IF(ISBLANK(C999),\"\",C999/'Betriebsdaten II'!$T$26)","v":""},"","",""]
[null,null,null,null,null,null,null,"","","","",{"$f":"IF(ISBLANK(C1000),\"\",C1000/'Betriebsdaten II'!$T$26)","v":""},"","",""]
[null,null,null,null,null,null,null,"","","","",{"$f":"IF(ISBLANK(C1001),\"\",C1001/'Betriebsdaten II'!$T$26)","v":""},"","",""]
[null,null,null,null,null,null,null,"","","","",{"$f":"IF(ISBLANK(C1002),\"\",C1002/'Betriebsdaten II'!$T$26)","v":""},"","",""]
[null,null,null,null,null,null,null,"","","","",{"$f":"IF(ISBLANK(C1003),\"\",C1003/'Betriebsdaten II'!$T$26)","v":""},"","",""]
[null,null,null,null,null,null,null,"","","","",{"$f":"IF(ISBLANK(C1004),\"\",C1004/'Betriebsdaten II'!$T$26)","v":""},"","",""]
[null,null,null,null,null,null,null,"","","","",{"$f":"IF(ISBLANK(C1005),\"\",C1005/'Betriebsdaten II'!$T$26)","v":""},"","",""]
[null,null,null,null,null,null,null,"","","","",{"$f":"IF(ISBLANK(C1006),\"\",C1006/'Betriebsdaten II'!$T$26)","v":""},"","",""]
[null,null,null,null,null,null,null,"","","","",{"$f":"IF(ISBLANK(C1007),\"\",C1007/'Betriebsdaten II'!$T$26)","v":""},"","",""]
[null,null,null,null,null,null,null,"","","","",{"$f":"IF(ISBLANK(C1008),\"\",C1008/'Betriebsdaten II'!$T$26)","v":""},"","",""]
[null,null,null,null,null,null,null,"","","","",{"$f":"IF(ISBLANK(C1009),\"\",C1009/'Betriebsdaten II'!$T$26)","v":""},"","",""]
[null,null,null,null,null,null,null,"","","","",{"$f":"IF(ISBLANK(C1010),\"\",C1010/'Betriebsdaten II'!$T$26)","v":""},"","",""]
[null,null,null,null,null,null,null,"","","","",{"$f":"IF(ISBLANK(C1011),\"\",C1011/'Betriebsdaten II'!$T$26)","v":""},"","",""]
[null,null,null,null,null,null,null,"","","","",{"$f":"IF(ISBLANK(C1012),\"\",C1012/'Betriebsdaten II'!$T$26)","v":""},"","",""]
[null,null,null,null,null,null,null,"","","","",{"$f":"IF(ISBLANK(C1013),\"\",C1013/'Betriebsdaten II'!$T$26)","v":""},"","",""]
[null,null,null,null,null,null,null,"","","","",{"$f":"IF(ISBLANK(C1014),\"\",C1014/'Betriebsdaten II'!$T$26)","v":""},"","",""]
[null,null,null,null,null,null,null,"","","","",{"$f":"IF(ISBLANK(C1015),\"\",C1015/'Betriebsdaten II'!$T$26)","v":""},"","",""]
[null,null,null,null,null,null,null,"","","","",{"$f":"IF(ISBLANK(C1016),\"\",C1016/'Betriebsdaten II'!$T$26)","v":""},"","",""]
[null,null,null,null,null,null,null,"","","","",{"$f":"IF(ISBLANK(C1017),\"\",C1017/'Betriebsdaten II'!$T$26)","v":""},"","",""]
[null,null,null,null,null,null,null,"","","","",{"$f":"IF(ISBLANK(C1018),\"\",C1018/'Betriebsdaten II'!$T$26)","v":""},"","",""]
[null,null,null,null,null,null,null,"","","","",{"$f":"IF(ISBLANK(C1019),\"\",C1019/'Betriebsdaten II'!$T$26)","v":""},"","",""]
[null,null,null,null,null,null,null,"","","","",{"$f":"IF(ISBLANK(C1020),\"\",C1020/'Betriebsdaten II'!$T$26)","v":""},"","",""]
[null,null,null,null,null,null,null,"","","","",{"$f":"IF(ISBLANK(C1021),\"\",C1021/'Betriebsdaten II'!$T$26)","v":""},"","",""]
[null,null,null,null,null,null,null,"","","","",{"$f":"IF(ISBLANK(C1022),\"\",C1022/'Betriebsdaten II'!$T$26)","v":""},"","",""]
[null,null,null,null,null,null,null,"","","","",{"$f":"IF(ISBLANK(C1023),\"\",C1023/'Betriebsdaten II'!$T$26)","v":""},"","",""]
[null,null,null,null,null,null,null,"","","","",{"$f":"IF(ISBLANK(C1024),\"\",C1024/'Betriebsdaten II'!$T$26)","v":""},"","",""]
[null,null,null,null,null,null,null,"","","","",{"$f":"IF(ISBLANK(C1025),\"\",C1025/'Betriebsdaten II'!$T$26)","v":""},"","",""]
[null,null,null,null,null,null,null,"","","","",{"$f":"IF(ISBLANK(C1026),\"\",C1026/'Betriebsdaten II'!$T$26)","v":""},"","",""]
[null,null,null,null,null,null,null,"","","","",{"$f":"IF(ISBLANK(C1027),\"\",C1027/'Betriebsdaten II'!$T$26)","v":""},"","",""]
[null,null,null,null,null,null,null,"","","","",{"$f":"IF(ISBLANK(C1028),\"\",C1028/'Betriebsdaten II'!$T$26)","v":""},"","",""]
[null,null,null,null,null,null,null,"","","","",{"$f":"IF(ISBLANK(C1029),\"\",C1029/'Betriebsdaten II'!$T$26)","v":""},"","",""]
[null,null,null,null,null,null,null,"","","","",{"$f":"IF(ISBLANK(C1030),\"\",C1030/'Betriebsdaten II'!$T$26)","v":""},"","",""]
[null,null,null,null,null,null,null,"","","","",{"$f":"IF(ISBLANK(C1031),\"\",C1031/'Betriebsdaten II'!$T$26)","v":""},"","",""]
[null,null,null,null,null,null,null,"","","","",{"$f":"IF(ISBLANK(C1032),\"\",C1032/'Betriebsdaten II'!$T$26)","v":""},"","",""]
[null,null,null,null,null,null,null,"","","","",{"$f":"IF(ISBLANK(C1033),\"\",C1033/'Betriebsdaten II'!$T$26)","v":""},"","",""]
[null,null,null,null,null,null,null,{"$f":"IF(ISBLANK(A1034),\"\",NetzvorlaufTemp)","v":""},{"$f":"IF(ISBLANK(A1034),\"\",NetzrücklaufTemp)","v":""},{"$f":"IF(OR(ISBLANK(C1034),ISBLANK(E1034)),\"\",E1034/C1034*1000)","v":""},{"$f":"IF(OR(ISBLANK(C1034),ISBLANK(E1034)),\"\",C1034/(4.189*978*E1034/3600))","v":""},{"$f":"IF(ISBLANK(C1034),\"\",C1034/'Betriebsdaten II'!$T$26)","v":""},{"$f":"IF(ISERR(J1034*L1034),\"\",J1034*L1034)","v":""},"",{"$f":"IF(N1034=\"\",\"\",IF(AND(N1034<5,K1034<30), \"Optimierungsmöglichkeiten prüfen!\",\"\"))","v":""}]
[null,null,null,null,null,null,null,"","","","",{"$f":"IF(ISBLANK(C1035),\"\",C1035/'Betriebsdaten II'!$T$26)","v":""},"",{"$f":"IF(ISERR(RANK(M1035,$M$10:$M$1210)),\"\",RANK(M1035,$M$10:$M$1210))","v":""},""]
[null,null,null,null,null,null,null,"","","","",{"$f":"IF(ISBLANK(C1036),\"\",C1036/'Betriebsdaten II'!$T$26)","v":""},"","",""]
[null,null,null,null,null,null,null,"","","","",{"$f":"IF(ISBLANK(C1037),\"\",C1037/'Betriebsdaten II'!$T$26)","v":""},"","",""]
[null,null,null,null,null,null,null,"","","","",{"$f":"IF(ISBLANK(C1038),\"\",C1038/'Betriebsdaten II'!$T$26)","v":""},"","",""]
[null,null,null,null,null,null,null,"","","","",{"$f":"IF(ISBLANK(C1039),\"\",C1039/'Betriebsdaten II'!$T$26)","v":""},"","",""]
[null,null,null,null,null,null,null,"","","","",{"$f":"IF(ISBLANK(C1040),\"\",C1040/'Betriebsdaten II'!$T$26)","v":""},"","",""]
[null,null,null,null,null,null,null,"","","","",{"$f":"IF(ISBLANK(C1041),\"\",C1041/'Betriebsdaten II'!$T$26)","v":""},"","",""]
[null,null,null,null,null,null,null,"","","","",{"$f":"IF(ISBLANK(C1042),\"\",C1042/'Betriebsdaten II'!$T$26)","v":""},"","",""]
[null,null,null,null,null,null,null,"","","","",{"$f":"IF(ISBLANK(C1043),\"\",C1043/'Betriebsdaten II'!$T$26)","v":""},"","",""]
[null,null,null,null,null,null,null,"","","","",{"$f":"IF(ISBLANK(C1044),\"\",C1044/'Betriebsdaten II'!$T$26)","v":""},"","",""]
[null,null,null,null,null,null,null,"","","","",{"$f":"IF(ISBLANK(C1045),\"\",C1045/'Betriebsdaten II'!$T$26)","v":""},"","",""]
[null,null,null,null,null,null,null,"","","","",{"$f":"IF(ISBLANK(C1046),\"\",C1046/'Betriebsdaten II'!$T$26)","v":""},"","",""]
[null,null,null,null,null,null,null,"","","","",{"$f":"IF(ISBLANK(C1047),\"\",C1047/'Betriebsdaten II'!$T$26)","v":""},"","",""]
[null,null,null,null,null,null,null,"","","","",{"$f":"IF(ISBLANK(C1048),\"\",C1048/'Betriebsdaten II'!$T$26)","v":""},"","",""]
[null,null,null,null,null,null,null,"","","","",{"$f":"IF(ISBLANK(C1049),\"\",C1049/'Betriebsdaten II'!$T$26)","v":""},"","",""]
[null,null,null,null,null,null,null,"","","","",{"$f":"IF(ISBLANK(C1050),\"\",C1050/'Betriebsdaten II'!$T$26)","v":""},"","",""]
[null,null,null,null,null,null,null,"","","","",{"$f":"IF(ISBLANK(C1051),\"\",C1051/'Betriebsdaten II'!$T$26)","v":""},"","",""]
[null,null,null,null,null,null,null,"","","","",{"$f":"IF(ISBLANK(C1052),\"\",C1052/'Betriebsdaten II'!$T$26)","v":""},"","",""]
[null,null,null,null,null,null,null,"","","","",{"$f":"IF(ISBLANK(C1053),\"\",C1053/'Betriebsdaten II'!$T$26)","v":""},"","",""]
[null,null,null,null,null,null,null,"","","","",{"$f":"IF(ISBLANK(C1054),\"\",C1054/'Betriebsdaten II'!$T$26)","v":""},"","",""]
[null,null,null,null,null,null,null,"","","","",{"$f":"IF(ISBLANK(C1055),\"\",C1055/'Betriebsdaten II'!$T$26)","v":""},"","",""]
[null,null,null,null,null,null,null,"","","","",{"$f":"IF(ISBLANK(C1056),\"\",C1056/'Betriebsdaten II'!$T$26)","v":""},"","",""]
[null,null,null,null,null,null,null,"","","","",{"$f":"IF(ISBLANK(C1057),\"\",C1057/'Betriebsdaten II'!$T$26)","v":""},"","",""]
[null,null,null,null,null,null,null,"","","","",{"$f":"IF(ISBLANK(C1058),\"\",C1058/'Betriebsdaten II'!$T$26)","v":""},"","",""]
[null,null,null,null,null,null,null,"","","","",{"$f":"IF(ISBLANK(C1059),\"\",C1059/'Betriebsdaten II'!$T$26)","v":""},"","",""]
[null,null,null,null,null,null,null,"","","","",{"$f":"IF(ISBLANK(C1060),\"\",C1060/'Betriebsdaten II'!$T$26)","v":""},"","",""]
[null,null,null,null,null,null,null,"","","","",{"$f":"IF(ISBLANK(C1061),\"\",C1061/'Betriebsdaten II'!$T$26)","v":""},"","",""]
[null,null,null,null,null,null,null,"","","","",{"$f":"IF(ISBLANK(C1062),\"\",C1062/'Betriebsdaten II'!$T$26)","v":""},"","",""]
[null,null,null,null,null,null,null,"","","","",{"$f":"IF(ISBLANK(C1063),\"\",C1063/'Betriebsdaten II'!$T$26)","v":""},"","",""]
[null,null,null,null,null,null,null,"","","","",{"$f":"IF(ISBLANK(C1064),\"\",C1064/'Betriebsdaten II'!$T$26)","v":""},"","",""]
[null,null,null,null,null,null,null,"","","","",{"$f":"IF(ISBLANK(C1065),\"\",C1065/'Betriebsdaten II'!$T$26)","v":""},"","",""]
[null,null,null,null,null,null,null,"","","","",{"$f":"IF(ISBLANK(C1066),\"\",C1066/'Betriebsdaten II'!$T$26)","v":""},"","",""]
[null,null,null,null,null,null,null,"","","","",{"$f":"IF(ISBLANK(C1067),\"\",C1067/'Betriebsdaten II'!$T$26)","v":""},"","",""]
[null,null,null,null,null,null,null,"","","","",{"$f":"IF(ISBLANK(C1068),\"\",C1068/'Betriebsdaten II'!$T$26)","v":""},"","",""]
[null,null,null,null,null,null,null,"","","","",{"$f":"IF(ISBLANK(C1069),\"\",C1069/'Betriebsdaten II'!$T$26)","v":""},"","",""]
[null,null,null,null,null,null,null,"","","","",{"$f":"IF(ISBLANK(C1070),\"\",C1070/'Betriebsdaten II'!$T$26)","v":""},"","",""]
[null,null,null,null,null,null,null,"","","","",{"$f":"IF(ISBLANK(C1071),\"\",C1071/'Betriebsdaten II'!$T$26)","v":""},"","",""]
[null,null,null,null,null,null,null,"","","","",{"$f":"IF(ISBLANK(C1072),\"\",C1072/'Betriebsdaten II'!$T$26)","v":""},"","",""]
[null,null,null,null,null,null,null,"","","","",{"$f":"IF(ISBLANK(C1073),\"\",C1073/'Betriebsdaten II'!$T$26)","v":""},"","",""]
[null,null,null,null,null,null,null,"","","","",{"$f":"IF(ISBLANK(C1074),\"\",C1074/'Betriebsdaten II'!$T$26)","v":""},"","",""]
[null,null,null,null,null,null,null,"","","","",{"$f":"IF(ISBLANK(C1075),\"\",C1075/'Betriebsdaten II'!$T$26)","v":""},"","",""]
[null,null,null,null,null,null,null,"","","","",{"$f":"IF(ISBLANK(C1076),\"\",C1076/'Betriebsdaten II'!$T$26)","v":""},"","",""]
[null,null,null,null,null,null,null,"","","","",{"$f":"IF(ISBLANK(C1077),\"\",C1077/'Betriebsdaten II'!$T$26)","v":""},"","",""]
[null,null,null,null,null,null,null,"","","","",{"$f":"IF(ISBLANK(C1078),\"\",C1078/'Betriebsdaten II'!$T$26)","v":""},"","",""]
[null,null,null,null,null,null,null,"","","","",{"$f":"IF(ISBLANK(C1079),\"\",C1079/'Betriebsdaten II'!$T$26)","v":""},"","",""]
[null,null,null,null,null,null,null,"","","","",{"$f":"IF(ISBLANK(C1080),\"\",C1080/'Betriebsdaten II'!$T$26)","v":""},"","",""]
[null,null,null,null,null,null,null,"","","","",{"$f":"IF(ISBLANK(C1081),\"\",C1081/'Betriebsdaten II'!$T$26)","v":""},"","",""]
[null,null,null,null,null,null,null,"","","","",{"$f":"IF(ISBLANK(C1082),\"\",C1082/'Betriebsdaten II'!$T$26)","v":""},"","",""]
[null,null,null,null,null,null,null,"","","","",{"$f":"IF(ISBLANK(C1083),\"\",C1083/'Betriebsdaten II'!$T$26)","v":""},"","",""]
[null,null,null,null,null,null,null,"","","","",{"$f":"IF(ISBLANK(C1084),\"\",C1084/'Betriebsdaten II'!$T$26)","v":""},"","",""]
[null,null,null,null,null,null,null,"","","","",{"$f":"IF(ISBLANK(C1085),\"\",C1085/'Betriebsdaten II'!$T$26)","v":""},"","",""]
[null,null,null,null,null,null,null,"","","","",{"$f":"IF(ISBLANK(C1086),\"\",C1086/'Betriebsdaten II'!$T$26)","v":""},"","",""]
[null,null,null,null,null,null,null,"","","","",{"$f":"IF(ISBLANK(C1087),\"\",C1087/'Betriebsdaten II'!$T$26)","v":""},"","",""]
[null,null,null,null,null,null,null,"","","","",{"$f":"IF(ISBLANK(C1088),\"\",C1088/'Betriebsdaten II'!$T$26)","v":""},"","",""]
[null,null,null,null,null,null,null,"","","","",{"$f":"IF(ISBLANK(C1089),\"\",C1089/'Betriebsdaten II'!$T$26)","v":""},"","",""]
[null,null,null,null,null,null,null,"","","","",{"$f":"IF(ISBLANK(C1090),\"\",C1090/'Betriebsdaten II'!$T$26)","v":""},"","",""]
[null,null,null,null,null,null,null,"","","","",{"$f":"IF(ISBLANK(C1091),\"\",C1091/'Betriebsdaten II'!$T$26)","v":""},"","",""]
[null,null,null,null,null,null,null,"","","","",{"$f":"IF(ISBLANK(C1092),\"\",C1092/'Betriebsdaten II'!$T$26)","v":""},"","",""]
[null,null,null,null,null,null,null,"","","","",{"$f":"IF(ISBLANK(C1093),\"\",C1093/'Betriebsdaten II'!$T$26)","v":""},"","",""]
[null,null,null,null,null,null,null,"","","","",{"$f":"IF(ISBLANK(C1094),\"\",C1094/'Betriebsdaten II'!$T$26)","v":""},"","",""]
[null,null,null,null,null,null,null,"","","","",{"$f":"IF(ISBLANK(C1095),\"\",C1095/'Betriebsdaten II'!$T$26)","v":""},"","",""]
[null,null,null,null,null,null,null,"","","","",{"$f":"IF(ISBLANK(C1096),\"\",C1096/'Betriebsdaten II'!$T$26)","v":""},"","",""]
[null,null,null,null,null,null,null,"","","","",{"$f":"IF(ISBLANK(C1097),\"\",C1097/'Betriebsdaten II'!$T$26)","v":""},"","",""]
[null,null,null,null,null,null,null,{"$f":"IF(ISBLANK(A1098),\"\",NetzvorlaufTemp)","v":""},{"$f":"IF(ISBLANK(A1098),\"\",NetzrücklaufTemp)","v":""},{"$f":"IF(OR(ISBLANK(C1098),ISBLANK(E1098)),\"\",E1098/C1098*1000)","v":""},{"$f":"IF(OR(ISBLANK(C1098),ISBLANK(E1098)),\"\",C1098/(4.189*978*E1098/3600))","v":""},{"$f":"IF(ISBLANK(C1098),\"\",C1098/'Betriebsdaten II'!$T$26)","v":""},{"$f":"IF(ISERR(J1098*L1098),\"\",J1098*L1098)","v":""},"",{"$f":"IF(N1098=\"\",\"\",IF(AND(N1098<5,K1098<30), \"Optimierungsmöglichkeiten prüfen!\",\"\"))","v":""}]
[null,null,null,null,null,null,null,"","","","",{"$f":"IF(ISBLANK(C1099),\"\",C1099/'Betriebsdaten II'!$T$26)","v":""},"",{"$f":"IF(ISERR(RANK(M1099,$M$10:$M$1210)),\"\",RANK(M1099,$M$10:$M$1210))","v":""},""]
[null,null,null,null,null,null,null,"","","","",{"$f":"IF(ISBLANK(C1100),\"\",C1100/'Betriebsdaten II'!$T$26)","v":""},"","",""]
[null,null,null,null,null,null,null,"","","","",{"$f":"IF(ISBLANK(C1101),\"\",C1101/'Betriebsdaten II'!$T$26)","v":""},"","",""]
[null,null,null,null,null,null,null,"","","","",{"$f":"IF(ISBLANK(C1102),\"\",C1102/'Betriebsdaten II'!$T$26)","v":""},"","",""]
[null,null,null,null,null,null,null,"","","","",{"$f":"IF(ISBLANK(C1103),\"\",C1103/'Betriebsdaten II'!$T$26)","v":""},"","",""]
[null,null,null,null,null,null,null,"","","","",{"$f":"IF(ISBLANK(C1104),\"\",C1104/'Betriebsdaten II'!$T$26)","v":""},"","",""]
[null,null,null,null,null,null,null,"","","","",{"$f":"IF(ISBLANK(C1105),\"\",C1105/'Betriebsdaten II'!$T$26)","v":""},"","",""]
[null,null,null,null,null,null,null,"","","","",{"$f":"IF(ISBLANK(C1106),\"\",C1106/'Betriebsdaten II'!$T$26)","v":""},"","",""]
[null,null,null,null,null,null,null,"","","","",{"$f":"IF(ISBLANK(C1107),\"\",C1107/'Betriebsdaten II'!$T$26)","v":""},"","",""]
[null,null,null,null,null,null,null,"","","","",{"$f":"IF(ISBLANK(C1108),\"\",C1108/'Betriebsdaten II'!$T$26)","v":""},"","",""]
[null,null,null,null,null,null,null,"","","","",{"$f":"IF(ISBLANK(C1109),\"\",C1109/'Betriebsdaten II'!$T$26)","v":""},"","",""]
[null,null,null,null,null,null,null,"","","","",{"$f":"IF(ISBLANK(C1110),\"\",C1110/'Betriebsdaten II'!$T$26)","v":""},"","",""]
[null,null,null,null,null,null,null,"","","","",{"$f":"IF(ISBLANK(C1111),\"\",C1111/'Betriebsdaten II'!$T$26)","v":""},"","",""]
[null,null,null,null,null,null,null,"","","","",{"$f":"IF(ISBLANK(C1112),\"\",C1112/'Betriebsdaten II'!$T$26)","v":""},"","",""]
[null,null,null,null,null,null,null,"","","","",{"$f":"IF(ISBLANK(C1113),\"\",C1113/'Betriebsdaten II'!$T$26)","v":""},"","",""]
[null,null,null,null,null,null,null,"","","","",{"$f":"IF(ISBLANK(C1114),\"\",C1114/'Betriebsdaten II'!$T$26)","v":""},"","",""]
[null,null,null,null,null,null,null,"","","","",{"$f":"IF(ISBLANK(C1115),\"\",C1115/'Betriebsdaten II'!$T$26)","v":""},"","",""]
[null,null,null,null,null,null,null,"","","","",{"$f":"IF(ISBLANK(C1116),\"\",C1116/'Betriebsdaten II'!$T$26)","v":""},"","",""]
[null,null,null,null,null,null,null,"","","","",{"$f":"IF(ISBLANK(C1117),\"\",C1117/'Betriebsdaten II'!$T$26)","v":""},"","",""]
[null,null,null,null,null,null,null,"","","","",{"$f":"IF(ISBLANK(C1118),\"\",C1118/'Betriebsdaten II'!$T$26)","v":""},"","",""]
[null,null,null,null,null,null,null,"","","","",{"$f":"IF(ISBLANK(C1119),\"\",C1119/'Betriebsdaten II'!$T$26)","v":""},"","",""]
[null,null,null,null,null,null,null,"","","","",{"$f":"IF(ISBLANK(C1120),\"\",C1120/'Betriebsdaten II'!$T$26)","v":""},"","",""]
[null,null,null,null,null,null,null,"","","","",{"$f":"IF(ISBLANK(C1121),\"\",C1121/'Betriebsdaten II'!$T$26)","v":""},"","",""]
[null,null,null,null,null,null,null,"","","","",{"$f":"IF(ISBLANK(C1122),\"\",C1122/'Betriebsdaten II'!$T$26)","v":""},"","",""]
[null,null,null,null,null,null,null,"","","","",{"$f":"IF(ISBLANK(C1123),\"\",C1123/'Betriebsdaten II'!$T$26)","v":""},"","",""]
[null,null,null,null,null,null,null,"","","","",{"$f":"IF(ISBLANK(C1124),\"\",C1124/'Betriebsdaten II'!$T$26)","v":""},"","",""]
[null,null,null,null,null,null,null,"","","","",{"$f":"IF(ISBLANK(C1125),\"\",C1125/'Betriebsdaten II'!$T$26)","v":""},"","",""]
[null,null,null,null,null,null,null,"","","","",{"$f":"IF(ISBLANK(C1126),\"\",C1126/'Betriebsdaten II'!$T$26)","v":""},"","",""]
[null,null,null,null,null,null,null,"","","","",{"$f":"IF(ISBLANK(C1127),\"\",C1127/'Betriebsdaten II'!$T$26)","v":""},"","",""]
[null,null,null,null,null,null,null,"","","","",{"$f":"IF(ISBLANK(C1128),\"\",C1128/'Betriebsdaten II'!$T$26)","v":""},"","",""]
[null,null,null,null,null,null,null,"","","","",{"$f":"IF(ISBLANK(C1129),\"\",C1129/'Betriebsdaten II'!$T$26)","v":""},"","",""]
[null,null,null,null,null,null,null,"","","","",{"$f":"IF(ISBLANK(C1130),\"\",C1130/'Betriebsdaten II'!$T$26)","v":""},"","",""]
[null,null,null,null,null,null,null,"","","","",{"$f":"IF(ISBLANK(C1131),\"\",C1131/'Betriebsdaten II'!$T$26)","v":""},"","",""]
[null,null,null,null,null,null,null,"","","","",{"$f":"IF(ISBLANK(C1132),\"\",C1132/'Betriebsdaten II'!$T$26)","v":""},"","",""]
[null,null,null,null,null,null,null,"","","","",{"$f":"IF(ISBLANK(C1133),\"\",C1133/'Betriebsdaten II'!$T$26)","v":""},"","",""]
[null,null,null,null,null,null,null,"","","","",{"$f":"IF(ISBLANK(C1134),\"\",C1134/'Betriebsdaten II'!$T$26)","v":""},"","",""]
[null,null,null,null,null,null,null,"","","","",{"$f":"IF(ISBLANK(C1135),\"\",C1135/'Betriebsdaten II'!$T$26)","v":""},"","",""]
[null,null,null,null,null,null,null,"","","","",{"$f":"IF(ISBLANK(C1136),\"\",C1136/'Betriebsdaten II'!$T$26)","v":""},"","",""]
[null,null,null,null,null,null,null,"","","","",{"$f":"IF(ISBLANK(C1137),\"\",C1137/'Betriebsdaten II'!$T$26)","v":""},"","",""]
[null,null,null,null,null,null,null,"","","","",{"$f":"IF(ISBLANK(C1138),\"\",C1138/'Betriebsdaten II'!$T$26)","v":""},"","",""]
[null,null,null,null,null,null,null,"","","","",{"$f":"IF(ISBLANK(C1139),\"\",C1139/'Betriebsdaten II'!$T$26)","v":""},"","",""]
[null,null,null,null,null,null,null,"","","","",{"$f":"IF(ISBLANK(C1140),\"\",C1140/'Betriebsdaten II'!$T$26)","v":""},"","",""]
[null,null,null,null,null,null,null,"","","","",{"$f":"IF(ISBLANK(C1141),\"\",C1141/'Betriebsdaten II'!$T$26)","v":""},"","",""]
[null,null,null,null,null,null,null,"","","","",{"$f":"IF(ISBLANK(C1142),\"\",C1142/'Betriebsdaten II'!$T$26)","v":""},"","",""]
[null,null,null,null,null,null,null,"","","","",{"$f":"IF(ISBLANK(C1143),\"\",C1143/'Betriebsdaten II'!$T$26)","v":""},"","",""]
[null,null,null,null,null,null,null,"","","","",{"$f":"IF(ISBLANK(C1144),\"\",C1144/'Betriebsdaten II'!$T$26)","v":""},"","",""]
[null,null,null,null,null,null,null,"","","","",{"$f":"IF(ISBLANK(C1145),\"\",C1145/'Betriebsdaten II'!$T$26)","v":""},"","",""]
[null,null,null,null,null,null,null,"","","","",{"$f":"IF(ISBLANK(C1146),\"\",C1146/'Betriebsdaten II'!$T$26)","v":""},"","",""]
[null,null,null,null,null,null,null,"","","","",{"$f":"IF(ISBLANK(C1147),\"\",C1147/'Betriebsdaten II'!$T$26)","v":""},"","",""]
[null,null,null,null,null,null,null,"","","","",{"$f":"IF(ISBLANK(C1148),\"\",C1148/'Betriebsdaten II'!$T$26)","v":""},"","",""]
[null,null,null,null,null,null,null,"","","","",{"$f":"IF(ISBLANK(C1149),\"\",C1149/'Betriebsdaten II'!$T$26)","v":""},"","",""]
[null,null,null,null,null,null,null,"","","","",{"$f":"IF(ISBLANK(C1150),\"\",C1150/'Betriebsdaten II'!$T$26)","v":""},"","",""]
[null,null,null,null,null,null,null,"","","","",{"$f":"IF(ISBLANK(C1151),\"\",C1151/'Betriebsdaten II'!$T$26)","v":""},"","",""]
[null,null,null,null,null,null,null,"","","","",{"$f":"IF(ISBLANK(C1152),\"\",C1152/'Betriebsdaten II'!$T$26)","v":""},"","",""]
[null,null,null,null,null,null,null,"","","","",{"$f":"IF(ISBLANK(C1153),\"\",C1153/'Betriebsdaten II'!$T$26)","v":""},"","",""]
[null,null,null,null,null,null,null,"","","","",{"$f":"IF(ISBLANK(C1154),\"\",C1154/'Betriebsdaten II'!$T$26)","v":""},"","",""]
[null,null,null,null,null,null,null,"","","","",{"$f":"IF(ISBLANK(C1155),\"\",C1155/'Betriebsdaten II'!$T$26)","v":""},"","",""]
[null,null,null,null,null,null,null,"","","","",{"$f":"IF(ISBLANK(C1156),\"\",C1156/'Betriebsdaten II'!$T$26)","v":""},"","",""]
[null,null,null,null,null,null,null,"","","","",{"$f":"IF(ISBLANK(C1157),\"\",C1157/'Betriebsdaten II'!$T$26)","v":""},"","",""]
[null,null,null,null,null,null,null,"","","","",{"$f":"IF(ISBLANK(C1158),\"\",C1158/'Betriebsdaten II'!$T$26)","v":""},"","",""]
[null,null,null,null,null,null,null,"","","","",{"$f":"IF(ISBLANK(C1159),\"\",C1159/'Betriebsdaten II'!$T$26)","v":""},"","",""]
[null,null,null,null,null,null,null,"","","","",{"$f":"IF(ISBLANK(C1160),\"\",C1160/'Betriebsdaten II'!$T$26)","v":""},"","",""]
[null,null,null,null,null,null,null,"","","","",{"$f":"IF(ISBLANK(C1161),\"\",C1161/'Betriebsdaten II'!$T$26)","v":""},"","",""]
[null,null,null,null,null,null,null,{"$f":"IF(ISBLANK(A1162),\"\",NetzvorlaufTemp)","v":""},{"$f":"IF(ISBLANK(A1162),\"\",NetzrücklaufTemp)","v":""},{"$f":"IF(OR(ISBLANK(C1162),ISBLANK(E1162)),\"\",E1162/C1162*1000)","v":""},{"$f":"IF(OR(ISBLANK(C1162),ISBLANK(E1162)),\"\",C1162/(4.189*978*E1162/3600))","v":""},{"$f":"IF(ISBLANK(C1162),\"\",C1162/'Betriebsdaten II'!$T$26)","v":""},{"$f":"IF(ISERR(J1162*L1162),\"\",J1162*L1162)","v":""},"",{"$f":"IF(N1162=\"\",\"\",IF(AND(N1162<5,K1162<30), \"Optimierungsmöglichkeiten prüfen!\",\"\"))","v":""}]
[null,null,null,null,null,null,null,"","","","",{"$f":"IF(ISBLANK(C1163),\"\",C1163/'Betriebsdaten II'!$T$26)","v":""},"",{"$f":"IF(ISERR(RANK(M1163,$M$10:$M$1210)),\"\",RANK(M1163,$M$10:$M$1210))","v":""},""]
[null,null,null,null,null,null,null,"","","","",{"$f":"IF(ISBLANK(C1164),\"\",C1164/'Betriebsdaten II'!$T$26)","v":""},"","",""]
[null,null,null,null,null,null,null,"","","","",{"$f":"IF(ISBLANK(C1165),\"\",C1165/'Betriebsdaten II'!$T$26)","v":""},"","",""]
[null,null,null,null,null,null,null,"","","","",{"$f":"IF(ISBLANK(C1166),\"\",C1166/'Betriebsdaten II'!$T$26)","v":""},"","",""]
[null,null,null,null,null,null,null,"","","","",{"$f":"IF(ISBLANK(C1167),\"\",C1167/'Betriebsdaten II'!$T$26)","v":""},"","",""]
[null,null,null,null,null,null,null,"","","","",{"$f":"IF(ISBLANK(C1168),\"\",C1168/'Betriebsdaten II'!$T$26)","v":""},"","",""]
[null,null,null,null,null,null,null,"","","","",{"$f":"IF(ISBLANK(C1169),\"\",C1169/'Betriebsdaten II'!$T$26)","v":""},"","",""]
[null,null,null,null,null,null,null,"","","","",{"$f":"IF(ISBLANK(C1170),\"\",C1170/'Betriebsdaten II'!$T$26)","v":""},"","",""]
[null,null,null,null,null,null,null,"","","","",{"$f":"IF(ISBLANK(C1171),\"\",C1171/'Betriebsdaten II'!$T$26)","v":""},"","",""]
[null,null,null,null,null,null,null,"","","","",{"$f":"IF(ISBLANK(C1172),\"\",C1172/'Betriebsdaten II'!$T$26)","v":""},"","",""]
[null,null,null,null,null,null,null,"","","","",{"$f":"IF(ISBLANK(C1173),\"\",C1173/'Betriebsdaten II'!$T$26)","v":""},"","",""]
[null,null,null,null,null,null,null,"","","","",{"$f":"IF(ISBLANK(C1174),\"\",C1174/'Betriebsdaten II'!$T$26)","v":""},"","",""]
[null,null,null,null,null,null,null,"","","","",{"$f":"IF(ISBLANK(C1175),\"\",C1175/'Betriebsdaten II'!$T$26)","v":""},"","",""]
[null,null,null,null,null,null,null,"","","","",{"$f":"IF(ISBLANK(C1176),\"\",C1176/'Betriebsdaten II'!$T$26)","v":""},"","",""]
[null,null,null,null,null,null,null,"","","","",{"$f":"IF(ISBLANK(C1177),\"\",C1177/'Betriebsdaten II'!$T$26)","v":""},"","",""]
[null,null,null,null,null,null,null,"","","","",{"$f":"IF(ISBLANK(C1178),\"\",C1178/'Betriebsdaten II'!$T$26)","v":""},"","",""]
[null,null,null,null,null,null,null,"","","","",{"$f":"IF(ISBLANK(C1179),\"\",C1179/'Betriebsdaten II'!$T$26)","v":""},"","",""]
[null,null,null,null,null,null,null,"","","","",{"$f":"IF(ISBLANK(C1180),\"\",C1180/'Betriebsdaten II'!$T$26)","v":""},"","",""]
[null,null,null,null,null,null,null,"","","","",{"$f":"IF(ISBLANK(C1181),\"\",C1181/'Betriebsdaten II'!$T$26)","v":""},"","",""]
[null,null,null,null,null,null,null,"","","","",{"$f":"IF(ISBLANK(C1182),\"\",C1182/'Betriebsdaten II'!$T$26)","v":""},"","",""]
[null,null,null,null,null,null,null,"","","","",{"$f":"IF(ISBLANK(C1183),\"\",C1183/'Betriebsdaten II'!$T$26)","v":""},"","",""]
[null,null,null,null,null,null,null,"","","","",{"$f":"IF(ISBLANK(C1184),\"\",C1184/'Betriebsdaten II'!$T$26)","v":""},"","",""]
[null,null,null,null,null,null,null,"","","","",{"$f":"IF(ISBLANK(C1185),\"\",C1185/'Betriebsdaten II'!$T$26)","v":""},"","",""]
[null,null,null,null,null,null,null,"","","","",{"$f":"IF(ISBLANK(C1186),\"\",C1186/'Betriebsdaten II'!$T$26)","v":""},"","",""]
[null,null,null,null,null,null,null,"","","","",{"$f":"IF(ISBLANK(C1187),\"\",C1187/'Betriebsdaten II'!$T$26)","v":""},"","",""]
[null,null,null,null,null,null,null,"","","","",{"$f":"IF(ISBLANK(C1188),\"\",C1188/'Betriebsdaten II'!$T$26)","v":""},"","",""]
[null,null,null,null,null,null,null,"","","","",{"$f":"IF(ISBLANK(C1189),\"\",C1189/'Betriebsdaten II'!$T$26)","v":""},"","",""]
[null,null,null,null,null,null,null,"","","","",{"$f":"IF(ISBLANK(C1190),\"\",C1190/'Betriebsdaten II'!$T$26)","v":""},"","",""]
[null,null,null,null,null,null,null,"","","","",{"$f":"IF(ISBLANK(C1191),\"\",C1191/'Betriebsdaten II'!$T$26)","v":""},"","",""]
[null,null,null,null,null,null,null,"","","","",{"$f":"IF(ISBLANK(C1192),\"\",C1192/'Betriebsdaten II'!$T$26)","v":""},"","",""]
[null,null,null,null,null,null,null,"","","","",{"$f":"IF(ISBLANK(C1193),\"\",C1193/'Betriebsdaten II'!$T$26)","v":""},"","",""]
[null,null,null,null,null,null,null,"","","","",{"$f":"IF(ISBLANK(C1194),\"\",C1194/'Betriebsdaten II'!$T$26)","v":""},"","",""]
[null,null,null,null,null,null,null,"","","","",{"$f":"IF(ISBLANK(C1195),\"\",C1195/'Betriebsdaten II'!$T$26)","v":""},"","",""]
[null,null,null,null,null,null,null,"","","","",{"$f":"IF(ISBLANK(C1196),\"\",C1196/'Betriebsdaten II'!$T$26)","v":""},"","",""]
[null,null,null,null,null,null,null,"","","","",{"$f":"IF(ISBLANK(C1197),\"\",C1197/'Betriebsdaten II'!$T$26)","v":""},"","",""]
[null,null,null,null,null,null,null,"","",{"$f":"IF(OR(ISBLANK(C1198),ISBLANK(E1198)),\"\",E1198/C1198*1000)","v":""},{"$f":"IF(OR(ISBLANK(C1198),ISBLANK(E1198)),\"\",C1198/(4.189*978*E1198/3600))","v":""},{"$f":"IF(ISBLANK(C1198),\"\",C1198/'Betriebsdaten II'!$T$26)","v":""},"","",""]
[null,null,null,null,null,null,null,"","","","",{"$f":"IF(ISBLANK(C1199),\"\",C1199/'Betriebsdaten II'!$T$26)","v":""},"","",""]
[null,null,null,null,null,null,null,"","","","",{"$f":"IF(ISBLANK(C1200),\"\",C1200/'Betriebsdaten II'!$T$26)","v":""},"","",""]
[null,null,null,null,null,null,null,"","",{"$f":"IF(OR(ISBLANK(C1201),ISBLANK(E1201)),\"\",E1201/C1201*1000)","v":""},{"$f":"IF(OR(ISBLANK(C1201),ISBLANK(E1201)),\"\",C1201/(4.189*978*E1201/3600))","v":""},{"$f":"IF(ISBLANK(C1201),\"\",C1201/'Betriebsdaten II'!$T$26)","v":""},{"$f":"IF(ISERR(J1201*L1201),\"\",J1201*L1201)","v":""},{"$f":"IF(ISERR(RANK(M1201,$M$10:$M$1210)),\"\",RANK(M1201,$M$10:$M$1210))","v":""},{"$f":"IF(N1201=\"\",\"\",IF(AND(N1201<5,K1201<30), \"Optimierungsmöglichkeiten prüfen!\",\"\"))","v":""}]
[null,null,null,null,null,null,null,"","","","",{"$f":"IF(ISBLANK(C1202),\"\",C1202/'Betriebsdaten II'!$T$26)","v":""},"","",""]
[null,null,null,null,null,null,null,"","","","",{"$f":"IF(ISBLANK(C1203),\"\",C1203/'Betriebsdaten II'!$T$26)","v":""},"","",""]
[null,null,null,null,null,null,null,"","","","",{"$f":"IF(ISBLANK(C1204),\"\",C1204/'Betriebsdaten II'!$T$26)","v":""},"","",""]
[null,null,null,null,null,null,null,"","","","",{"$f":"IF(ISBLANK(C1205),\"\",C1205/'Betriebsdaten II'!$T$26)","v":""},"","",""]
[null,null,null,null,null,null,null,"","","","",{"$f":"IF(ISBLANK(C1206),\"\",C1206/'Betriebsdaten II'!$T$26)","v":""},"","",""]
[null,null,null,null,null,null,null,"","","","",{"$f":"IF(ISBLANK(C1207),\"\",C1207/'Betriebsdaten II'!$T$26)","v":""},"","",""]
[null,null,null,null,null,null,null,"","","","",{"$f":"IF(ISBLANK(C1208),\"\",C1208/'Betriebsdaten II'!$T$26)","v":""},"","",""]
[null,null,null,null,null,null,null,"","","","",{"$f":"IF(ISBLANK(C1209),\"\",C1209/'Betriebsdaten II'!$T$26)","v":""},"","",""]
[null,null,null,null,null,null,null,"","","","",{"$f":"IF(ISBLANK(C1210),\"\",C1210/'Betriebsdaten II'!$T$26)","v":""},"","",""]

{"sheet":"Auswertung_I","index":5,"n_rows":15,"n_cols":10,"rows_kept":15,"cut":false,"hidden":false,"merged":[]}
[]
[null,"QM Heizwerke - Auswertung Betriebsbericht"]
[null,null,null,null,null,null,null,"bitte auswählen!","bitte eintragen!"]
[null,"Kennzahlen","Einheit","Wert","Anmerkung",null,"Zusatzeingaben für Wärmeerzeuger","Art","Nennleistung","erzeugte Wärmemenge"]
[null,"Wärmeverkauf Planung","MWh/a",null,"bitte eingeben!",null,null,null,"kW","MWh/a"]
[null,"Wärmeverkauf Soll-/Istvergleich","%",{"$f":"IF(OR(Auswertung_I!D5=0,ISBLANK(Auswertung_I!D5)),0,WM_AbnehmerNetzJahr/1000/Auswertung_I!D5)","v":0},{"$f":"IF(ISBLANK(D5),\"Planungswert Wärmeverkauf eingeben\",\"\")","v":"Planungswert Wärmeverkauf eingeben"},null,{"$f":"IF(ISBLANK(KmpNrBMKessel1),\"\",\"Wärmeerzeuger Nr. \" & KmpNrBMKessel1 & \" - \" & BezeichnungBMKessel1)","v":""},null,null,{"$f":"IF(Hilfstabelle!N1=0,\"-\",Hilfstabelle!N1/1000)","v":"-"}]
[null,"Wärmeverluste Netz","%",{"$f":"Auswertung_II!Q10","v":""},null,null,{"$f":"IF(ISBLANK(KmpNrBMKessel2),\"\",\"Wärmeerzeuger Nr. \" & KmpNrBMKessel2 & \" - \" & BezeichnungBMKessel2)","v":""},null,null,{"$f":"IF(Hilfstabelle!N2=0,\"-\",Hilfstabelle!N2/1000)","v":"-"}]
[null,"Wärmeverluste Heizhaus","%",{"$f":"Auswertung_II!Q8","v":""},null,null,{"$f":"IF(ISBLANK(KmpNrBMKessel3),\"\",\"Wärmeerzeuger Nr. \" & KmpNrBMKessel3 & \" - \" & BezeichnungBMKessel3)","v":""},null,null,{"$f":"IF(Hilfstabelle!N3=0,\"-\",Hilfstabelle!N3/1000)","v":"-"}]
[null,"Stromverbrauch Gesamtanlagen","kWhel/MWhtherm",{"$f":"Auswertung_II!Q21","v":""},null,null,{"$f":"IF(ISBLANK(KmpNrSonstige1),\"\",\"Wärmeerzeuger Nr. \" & KmpNrSonstige1 & \" - \" & BezeichnungSonstige1)","v":""},null,null,{"$f":"IF(Hilfstabelle!N4=0,\"-\",Hilfstabelle!N4/1000)","v":"-"}]
[null,"Volllaststunden Biomassekessel (Gesamt)","h/a",{"$f":"SUMIF($H$6:$H$15,\"Biomasse\",J6:J15)*1000/SUMIF($H$6:$H$15,\"Biomasse\",I6:I15)","v":{"$error":"#DIV/0!"}},{"$f":"IF(ISBLANK(I6),\" Nennleistung Kessel eingeben\",\"\")","v":" Nennleistung Kessel eingeben"},null,{"$f":"IF(ISBLANK(KmpNrSonstige2),\"\",\"Wärmeerzeuger Nr. \" & KmpNrSonstige2 & \" - \" & BezeichnungSonstige2)","v":""},null,null,{"$f":"IF(Hilfstabelle!N5=0,\"-\",Hilfstabelle!N5/1000)","v":"-"}]
[null,"Trassenlänge","trm",null,"bitte eingeben!",null,{"$f":"IF(ISBLANK(KmpNrSonstige3),\"\",\"Wärmeerzeuger Nr. \" & KmpNrSonstige3 & \" - \" & BezeichnungSonstige3)","v":""},null,null,{"$f":"IF(Hilfstabelle!N6=0,\"-\",Hilfstabelle!N6/1000)","v":"-"}]
[null,"Wärmebelegung","kWh/(trm*a)",{"$f":"WM_AbnehmerNetzJahr/Auswertung_I!D11","v":{"$error":"#DIV/0!"}},{"$f":"IF(ISBLANK(D11),\"Trassenlänge eingeben\",\"\")","v":"Trassenlänge eingeben"},null,{"$f":"IF(ISBLANK(KmpNrSonstige4),\"\",\"Wärmeerzeuger Nr. \" & KmpNrSonstige4 & \" - \" & BezeichnungSonstige4)","v":""},null,null,{"$f":"IF(Hilfstabelle!N7=0,\"-\",Hilfstabelle!N7/1000)","v":"-"}]
[null,"spez. Volumenstrom (Wassermenge)","m³/MWh",{"$f":"Auswertung_II!Q45","v":""},null,null,{"$f":"IF(ISBLANK(KmpNrSonstige5),\"\",\"Wärmeerzeuger Nr. \" & KmpNrSonstige5 & \" - \" & BezeichnungSonstige5)","v":""},null,null,{"$f":"IF(Hilfstabelle!N8=0,\"-\",Hilfstabelle!N8/1000)","v":"-"}]
[null,null,null,null,null,null,{"$f":"IF(ISBLANK(KmpNrSonstige6),\"\",\"Wärmeerzeuger Nr. \" & KmpNrSonstige6 & \" - \" & BezeichnungSonstige6)","v":""},null,null,{"$f":"IF(Hilfstabelle!N9=0,\"-\",Hilfstabelle!N9/1000)","v":"-"}]
[null,null,null,null,null,null,{"$f":"IF(ISBLANK(KmpNrSonstige7),\"\",\"Wärmeerzeuger Nr. \" & KmpNrSonstige7 & \" - \" & BezeichnungSonstige7)","v":""},null,null,{"$f":"IF(Hilfstabelle!N10=0,\"-\",Hilfstabelle!N10/1000)","v":"-"}]

{"sheet":"Auswertung_II","index":6,"n_rows":46,"n_cols":17,"rows_kept":46,"cut":false,"hidden":false,"merged":[[40,14,41,14],[40,15,41,15],[40,11,41,11],[40,12,41,12],[44,2,44,3],[45,2,45,3],[40,13,41,13],[42,2,42,3],[43,2,43,3],[40,7,41,7],[40,8,41,8],[40,9,41,9],[26,13,27,13],[26,14,27,14],[26,15,27,15],[26,16,27,16],[40,1,41,1],[40,2,41,3],[40,4,41,4],[40,5,41,5],[40,6,41,6],[31,2,33,2],[34,2,36,2],[39,2,39,3],[39,6,39,7],[39,11,39,12],[40,16,41,16],[40,10,41,10],[28,2,30,2],[26,6,27,6],[26,7,27,7],[26,8,27,8],[26,9,27,9],[26,10,27,10],[26,11,27,11],[21,2,21,3],[22,2,22,3],[25,2,25,3],[25,6,25,7],[25,11,25,12],[26,12,27,12],[26,1,27,1],[26,2,27,2],[26,3,27,3],[26,4,27,4],[26,5,27,5],[20,2,20,3],[9,2,9,3],[10,2,10,3],[11,1,12,1],[11,2,12,16],[13,2,13,3],[14,2,14,3],[15,2,15,3],[16,2,16,3],[17,2,17,3],[18,1,19,1],[18,2,19,16],[4,14,5,14],[4,15,5,15],[4,16,5,16],[6,2,6,3],[7,2,7,3],[4,12,5,12],[4,13,5,13],[8,2,8,3],[4,8,5,8],[4,9,5,9],[4,10,5,10],[4,11,5,11],[4,7,5,7],[3,2,3,3],[3,6,3,7],[3,11,3,12],[4,1,5,1],[4,2,5,3],[4,4,5,4],[4,5,5,5],[4,6,5,6]]}
[]
[null,"QM Heizwerke - Auswertung Betriebsbericht"]
[]
[null,"Projektnummer:",{"$f":"IF(Titelblatt!$D$6=\"\",\"\",Titelblatt!$D$6)","v":""},null,null,"Jahr:",{"$f":"IF(Titelblatt!$D$8=\"\",YEAR(TODAY()),Titelblatt!$D$8)","v":2022},null,null,null,"Anfangsmonat:",{"$f":"IF(Titelblatt!$D$10=\"\",1,Titelblatt!$D$10)","v":1}]
[null,"Energiebilanz","Einheit",null,{"$f":"DATE($G$4,$L$26,1)","v":"2022-01-01"},{"$f":"IF($L$26+1>12,DATE($G$26+1,$L$26+1-12,1),DATE($G$26,$L$26+1,1))","v":"2022-02-01"},{"$f":"IF($L$26+2>12,DATE($G$26+1,$L$26+2-12,1),DATE($G$26,$L$26+2,1))","v":"2022-03-01"},{"$f":"IF($L$26+3>12,DATE($G$26+1,$L$26+3-12,1),DATE($G$26,$L$26+3,1))","v":"2022-04-01"},{"$f":"IF($L$26+4>12,DATE($G$26+4,$L$26+1-12,1),DATE($G$26,$L$26+4,1))","v":"2022-05-01"},{"$f":"IF($L$26+5>12,DATE($G$26+5,$L$26+1-12,1),DATE($G$26,$L$26+5,1))","v":"2022-06-01"},{"$f":"IF($L$26+6>12,DATE($G$26+1,$L$26+6-12,1),DATE($G$26,$L$26+6,1))","v":"2022-07-01"},{"$f":"IF($L$26+7>12,DATE($G$26+1,$L$26+7-12,1),DATE($G$26,$L$26+7,1))","v":"2022-08-01"},{"$f":"IF($L$26+8>12,DATE($G$26+1,$L$26+8-12,1),DATE($G$26,$L$26+8,1))","v":"2022-09-01"},{"$f":"IF($L$26+9>12,DATE($G$26+1,$L$26+9-12,1),DATE($G$26,$L$26+9,1))","v":"2022-10-01"},{"$f":"IF($L$26+10>12,DATE($G$26+1,$L$26+10-12,1),DATE($G$26,$L$26+10,1))","v":"2022-11-01"},{"$f":"IF($L$26+11>12,DATE($G$26+1,$L$26+11-12,1),DATE($G$26,$L$26+11,1))","v":"2022-12-01"},"Jahr"]
[]
[null,"Erzeugte Wärmemenge","MWh",null,{"$f":"Hilfstabelle!B15/1000","v":0},{"$f":"Hilfstabelle!C15/1000","v":0},{"$f":"Hilfstabelle!D15/1000","v":0},{"$f":"Hilfstabelle!E15/1000","v":0},{"$f":"Hilfstabelle!F15/1000","v":0},{"$f":"Hilfstabelle!G15/1000","v":0},{"$f":"Hilfstabelle!H15/1000","v":0},{"$f":"Hilfstabelle!I15/1000","v":0},{"$f":"Hilfstabelle!J15/1000","v":0},{"$f":"Hilfstabelle!K15/1000","v":0},{"$f":"Hilfstabelle!L15/1000","v":0},{"$f":"Hilfstabelle!M15/1000","v":0},{"$f":"Hilfstabelle!N15/1000","v":0}]
[null,"Wärmeverluste Heizhaus","%",null,{"$f":"Hilfstabelle!B24","v":""},{"$f":"Hilfstabelle!C24","v":""},{"$f":"Hilfstabelle!D24","v":""},{"$f":"Hilfstabelle!E24","v":""},{"$f":"Hilfstabelle!F24","v":""},{"$f":"Hilfstabelle!G24","v":""},{"$f":"Hilfstabelle!H24","v":""},{"$f":"Hilfstabelle!I24","v":""},{"$f":"Hilfstabelle!J24","v":""},{"$f":"Hilfstabelle!K24","v":""},{"$f":"Hilfstabelle!L24","v":""},{"$f":"Hilfstabelle!M24","v":""},{"$f":"Hilfstabelle!N24","v":""}]
[null,"Ins Netz eingespeiste Wärmemenge","MWh",null,{"$f":"Hilfstabelle!B16/1000","v":0},{"$f":"Hilfstabelle!C16/1000","v":0},{"$f":"Hilfstabelle!D16/1000","v":0},{"$f":"Hilfstabelle!E16/1000","v":0},{"$f":"Hilfstabelle!F16/1000","v":0},{"$f":"Hilfstabelle!G16/1000","v":0},{"$f":"Hilfstabelle!H16/1000","v":0},{"$f":"Hilfstabelle!I16/1000","v":0},{"$f":"Hilfstabelle!J16/1000","v":0},{"$f":"Hilfstabelle!K16/1000","v":0},{"$f":"Hilfstabelle!L16/1000","v":0},{"$f":"Hilfstabelle!M16/1000","v":0},{"$f":"Hilfstabelle!N16/1000","v":0}]
[null,"Wärmeverluste Netz","%",null,{"$f":"E43","v":""},{"$f":"F43","v":""},"","","","","","","","","","",""]
[null,"Verkaufte Wärmemenge","MWh",null,{"$f":"Hilfstabelle!B17/1000","v":0},{"$f":"Hilfstabelle!C17/1000","v":0},{"$f":"Hilfstabelle!D17/1000","v":0},{"$f":"Hilfstabelle!E17/1000","v":0},{"$f":"Hilfstabelle!F17/1000","v":0},{"$f":"Hilfstabelle!G17/1000","v":0},{"$f":"Hilfstabelle!H17/1000","v":0},{"$f":"Hilfstabelle!I17/1000","v":0},{"$f":"Hilfstabelle!J17/1000","v":0},{"$f":"Hilfstabelle!K17/1000","v":0},{"$f":"Hilfstabelle!L17/1000","v":0},{"$f":"Hilfstabelle!M17/1000","v":0},{"$f":"Hilfstabelle!N17/1000","v":0}]
[null,"Erzeugungsmix"]
[]
[null,"Anteil der Energieerzeugung mit Biomasse","%",null,{"$f":"IF(SUM(Hilfstabelle!B1:B10)=0,\"\",SUMIF(Auswertung_I!$H$6:$H$15,\"Biomasse\",Hilfstabelle!B1:B10)/(SUM(Hilfstabelle!B1:B10)))","v":""},{"$f":"IF(SUM(Hilfstabelle!C1:C10)=0,\"\",SUMIF(Auswertung_I!$H$6:$H$15,\"Biomasse\",Hilfstabelle!C1:C10)/(SUM(Hilfstabelle!C1:C10)))","v":""},{"$f":"IF(SUM(Hilfstabelle!D1:D10)=0,\"\",SUMIF(Auswertung_I!$H$6:$H$15,\"Biomasse\",Hilfstabelle!D1:D10)/(SUM(Hilfstabelle!D1:D10)))","v":""},{"$f":"IF(SUM(Hilfstabelle!E1:E10)=0,\"\",SUMIF(Auswertung_I!$H$6:$H$15,\"Biomasse\",Hilfstabelle!E1:E10)/(SUM(Hilfstabelle!E1:E10)))","v":""},{"$f":"IF(SUM(Hilfstabelle!F1:F10)=0,\"\",SUMIF(Auswertung_I!$H$6:$H$15,\"Biomasse\",Hilfstabelle!F1:F10)/(SUM(Hilfstabelle!F1:F10)))","v":""},{"$f":"IF(SUM(Hilfstabelle!G1:G10)=0,\"\",SUMIF(Auswertung_I!$H$6:$H$15,\"Biomasse\",Hilfstabelle!G1:G10)/(SUM(Hilfstabelle!G1:G10)))","v":""},{"$f":"IF(SUM(Hilfstabelle!H1:H10)=0,\"\",SUMIF(Auswertung_I!$H$6:$H$15,\"Biomasse\",Hilfstabelle!H1:H10)/(SUM(Hilfstabelle!H1:H10)))","v":""},{"$f":"IF(SUM(Hilfstabelle!I1:I10)=0,\"\",SUMIF(Auswertung_I!$H$6:$H$15,\"Biomasse\",Hilfstabelle!I1:I10)/(SUM(Hilfstabelle!I1:I10)))","v":""},{"$f":"IF(SUM(Hilfstabelle!J1:J10)=0,\"\",SUMIF(Auswertung_I!$H$6:$H$15,\"Biomasse\",Hilfstabelle!J1:J10)/(SUM(Hilfstabelle!J1:J10)))","v":""},{"$f":"IF(SUM(Hilfstabelle!K1:K10)=0,\"\",SUMIF(Auswertung_I!$H$6:$H$15,\"Biomasse\",Hilfstabelle!K1:K10)/(SUM(Hilfstabelle!K1:K10)))","v":""},{"$f":"IF(SUM(Hilfstabelle!L1:L10)=0,\"\",SUMIF(Auswertung_I!$H$6:$H$15,\"Biomasse\",Hilfstabelle!L1:L10)/(SUM(Hilfstabelle!L1:L10)))","v":""},{"$f":"IF(SUM(Hilfstabelle!M1:M10)=0,\"\",SUMIF(Auswertung_I!$H$6:$H$15,\"Biomasse\",Hilfstabelle!M1:M10)/(SUM(Hilfstabelle!M1:M10)))","v":""},{"$f":"IF(SUM(Hilfstabelle!N1:N10)=0,\"\",SUMIF(Auswertung_I!$H$6:$H$15,\"Biomasse\",Hilfstabelle!N1:N10)/(SUM(Hilfstabelle!N1:N10)))","v":""}]
[null,"Anteil Kondensation","%",null,{"$f":"IF(SUM(Hilfstabelle!B1:B10)=0,\"\",SUMIF(Auswertung_I!$H$6:$H$15,\"RG-Kondensation\",Hilfstabelle!B1:B10)/(SUM(Hilfstabelle!B1:B10)))","v":""},{"$f":"IF(SUM(Hilfstabelle!C1:C10)=0,\"\",SUMIF(Auswertung_I!$H$6:$H$15,\"RG-Kondensation\",Hilfstabelle!C1:C10)/(SUM(Hilfstabelle!C1:C10)))","v":""},{"$f":"IF(SUM(Hilfstabelle!D1:D10)=0,\"\",SUMIF(Auswertung_I!$H$6:$H$15,\"RG-Kondensation\",Hilfstabelle!D1:D10)/(SUM(Hilfstabelle!D1:D10)))","v":""},{"$f":"IF(SUM(Hilfstabelle!E1:E10)=0,\"\",SUMIF(Auswertung_I!$H$6:$H$15,\"RG-Kondensation\",Hilfstabelle!E1:E10)/(SUM(Hilfstabelle!E1:E10)))","v":""},{"$f":"IF(SUM(Hilfstabelle!F1:F10)=0,\"\",SUMIF(Auswertung_I!$H$6:$H$15,\"RG-Kondensation\",Hilfstabelle!F1:F10)/(SUM(Hilfstabelle!F1:F10)))","v":""},{"$f":"IF(SUM(Hilfstabelle!G1:G10)=0,\"\",SUMIF(Auswertung_I!$H$6:$H$15,\"RG-Kondensation\",Hilfstabelle!G1:G10)/(SUM(Hilfstabelle!G1:G10)))","v":""},{"$f":"IF(SUM(Hilfstabelle!H1:H10)=0,\"\",SUMIF(Auswertung_I!$H$6:$H$15,\"RG-Kondensation\",Hilfstabelle!H1:H10)/(SUM(Hilfstabelle!H1:H10)))","v":""},{"$f":"IF(SUM(Hilfstabelle!I1:I10)=0,\"\",SUMIF(Auswertung_I!$H$6:$H$15,\"RG-Kondensation\",Hilfstabelle!I1:I10)/(SUM(Hilfstabelle!I1:I10)))","v":""},{"$f":"IF(SUM(Hilfstabelle!J1:J10)=0,\"\",SUMIF(Auswertung_I!$H$6:$H$15,\"RG-Kondensation\",Hilfstabelle!J1:J10)/(SUM(Hilfstabelle!J1:J10)))","v":""},{"$f":"IF(SUM(Hilfstabelle!K1:K10)=0,\"\",SUMIF(Auswertung_I!$H$6:$H$15,\"RG-Kondensation\",Hilfstabelle!K1:K10)/(SUM(Hilfstabelle!K1:K10)))","v":""},{"$f":"IF(SUM(Hilfstabelle!L1:L10)=0,\"\",SUMIF(Auswertung_I!$H$6:$H$15,\"RG-Kondensation\",Hilfstabelle!L1:L10)/(SUM(Hilfstabelle!L1:L10)))","v":""},{"$f":"IF(SUM(Hilfstabelle!M1:M10)=0,\"\",SUMIF(Auswertung_I!$H$6:$H$15,\"RG-Kondensation\",Hilfstabelle!M1:M10)/(SUM(Hilfstabelle!M1:M10)))","v":""},{"$f":"IF(SUM(Hilfstabelle!N1:N10)=0,\"\",SUMIF(Auswertung_I!$H$6:$H$15,\"RG-Kondensation\",Hilfstabelle!N1:N10)/(SUM(Hilfstabelle!N1:N10)))","v":""}]
[null,"Anteil Solar","%",null,{"$f":"IF(SUM(Hilfstabelle!B1:B10)=0,\"\",SUMIF(Auswertung_I!$H$6:$H$15,\"Solar\",Hilfstabelle!B1:B10)/(SUM(Hilfstabelle!B1:B10)))","v":""},{"$f":"IF(SUM(Hilfstabelle!C1:C10)=0,\"\",SUMIF(Auswertung_I!$H$6:$H$15,\"Solar\",Hilfstabelle!C1:C10)/(SUM(Hilfstabelle!C1:C10)))","v":""},{"$f":"IF(SUM(Hilfstabelle!D1:D10)=0,\"\",SUMIF(Auswertung_I!$H$6:$H$15,\"Solar\",Hilfstabelle!D1:D10)/(SUM(Hilfstabelle!D1:D10)))","v":""},{"$f":"IF(SUM(Hilfstabelle!E1:E10)=0,\"\",SUMIF(Auswertung_I!$H$6:$H$15,\"Solar\",Hilfstabelle!E1:E10)/(SUM(Hilfstabelle!E1:E10)))","v":""},{"$f":"IF(SUM(Hilfstabelle!F1:F10)=0,\"\",SUMIF(Auswertung_I!$H$6:$H$15,\"Solar\",Hilfstabelle!F1:F10)/(SUM(Hilfstabelle!F1:F10)))","v":""},{"$f":"IF(SUM(Hilfstabelle!G1:G10)=0,\"\",SUMIF(Auswertung_I!$H$6:$H$15,\"Solar\",Hilfstabelle!G1:G10)/(SUM(Hilfstabelle!G1:G10)))","v":""},{"$f":"IF(SUM(Hilfstabelle!H1:H10)=0,\"\",SUMIF(Auswertung_I!$H$6:$H$15,\"Solar\",Hilfstabelle!H1:H10)/(SUM(Hilfstabelle!H1:H10)))","v":""},{"$f":"IF(SUM(Hilfstabelle!I1:I10)=0,\"\",SUMIF(Auswertung_I!$H$6:$H$15,\"Solar\",Hilfstabelle!I1:I10)/(SUM(Hilfstabelle!I1:I10)))","v":""},{"$f":"IF(SUM(Hilfstabelle!J1:J10)=0,\"\",SUMIF(Auswertung_I!$H$6:$H$15,\"Solar\",Hilfstabelle!J1:J10)/(SUM(Hilfstabelle!J1:J10)))","v":""},{"$f":"IF(SUM(Hilfstabelle!K1:K10)=0,\"\",SUMIF(Auswertung_I!$H$6:$H$15,\"Solar\",Hilfstabelle!K1:K10)/(SUM(Hilfstabelle!K1:K10)))","v":""},{"$f":"IF(SUM(Hilfstabelle!L1:L10)=0,\"\",SUMIF(Auswertung_I!$H$6:$H$15,\"Solar\",Hilfstabelle!L1:L10)/(SUM(Hilfstabelle!L1:L10)))","v":""},{"$f":"IF(SUM(Hilfstabelle!M1:M10)=0,\"\",SUMIF(Auswertung_I!$H$6:$H$15,\"Solar\",Hilfstabelle!M1:M10)/(SUM(Hilfstabelle!M1:M10)))","v":""},{"$f":"IF(SUM(Hilfstabelle!N1:N10)=0,\"\",SUMIF(Auswertung_I!$H$6:$H$15,\"Solar\",Hilfstabelle!N1:N10)/(SUM(Hilfstabelle!N1:N10)))","v":""}]
[null,"Anteil Fossilenergie","%",null,{"$f":"IF(SUM(Hilfstabelle!B1:B10)=0,\"\",(SUMIF(Auswertung_I!$H$6:$H$15,\"Heizöl\",Hilfstabelle!B1:B10)+SUMIF(Auswertung_I!$H$6:$H$15,\"Erdgas\",Hilfstabelle!B1:B10))/(SUM(Hilfstabelle!B1:B10)))","v":""},{"$f":"IF(SUM(Hilfstabelle!C1:C10)=0,\"\",(SUMIF(Auswertung_I!$H$6:$H$15,\"Heizöl\",Hilfstabelle!C1:C10)+SUMIF(Auswertung_I!$H$6:$H$15,\"Erdgas\",Hilfstabelle!C1:C10))/(SUM(Hilfstabelle!C1:C10)))","v":""},{"$f":"IF(SUM(Hilfstabelle!D1:D10)=0,\"\",(SUMIF(Auswertung_I!$H$6:$H$15,\"Heizöl\",Hilfstabelle!D1:D10)+SUMIF(Auswertung_I!$H$6:$H$15,\"Erdgas\",Hilfstabelle!D1:D10))/(SUM(Hilfstabelle!D1:D10)))","v":""},{"$f":"IF(SUM(Hilfstabelle!E1:E10)=0,\"\",(SUMIF(Auswertung_I!$H$6:$H$15,\"Heizöl\",Hilfstabelle!E1:E10)+SUMIF(Auswertung_I!$H$6:$H$15,\"Erdgas\",Hilfstabelle!E1:E10))/(SUM(Hilfstabelle!E1:E10)))","v":""},{"$f":"IF(SUM(Hilfstabelle!F1:F10)=0,\"\",(SUMIF(Auswertung_I!$H$6:$H$15,\"Heizöl\",Hilfstabelle!F1:F10)+SUMIF(Auswertung_I!$H$6:$H$15,\"Erdgas\",Hilfstabelle!F1:F10))/(SUM(Hilfstabelle!F1:F10)))","v":""},{"$f":"IF(SUM(Hilfstabelle!G1:G10)=0,\"\",(SUMIF(Auswertung_I!$H$6:$H$15,\"Heizöl\",Hilfstabelle!G1:G10)+SUMIF(Auswertung_I!$H$6:$H$15,\"Erdgas\",Hilfstabelle!G1:G10))/(SUM(Hilfstabelle!G1:G10)))","v":""},{"$f":"IF(SUM(Hilfstabelle!H1:H10)=0,\"\",(SUMIF(Auswertung_I!$H$6:$H$15,\"Heizöl\",Hilfstabelle!H1:H10)+SUMIF(Auswertung_I!$H$6:$H$15,\"Erdgas\",Hilfstabelle!H1:H10))/(SUM(Hilfstabelle!H1:H10)))","v":""},{"$f":"IF(SUM(Hilfstabelle!I1:I10)=0,\"\",(SUMIF(Auswertung_I!$H$6:$H$15,\"Heizöl\",Hilfstabelle!I1:I10)+SUMIF(Auswertung_I!$H$6:$H$15,\"Erdgas\",Hilfstabelle!I1:I10))/(SUM(Hilfstabelle!I1:I10)))","v":""},{"$f":"IF(SUM(Hilfstabelle!J1:J10)=0,\"\",(SUMIF(Auswertung_I!$H$6:$H$15,\"Heizöl\",Hilfstabelle!J1:J10)+SUMIF(Auswertung_I!$H$6:$H$15,\"Erdgas\",Hilfstabelle!J1:J10))/(SUM(Hilfstabelle!J1:J10)))","v":""},{"$f":"IF(SUM(Hilfstabelle!K1:K10)=0,\"\",(SUMIF(Auswertung_I!$H$6:$H$15,\"Heizöl\",Hilfstabelle!K1:K10)+SUMIF(Auswertung_I!$H$6:$H$15,\"Erdgas\",Hilfstabelle!K1:K10))/(SUM(Hilfstabelle!K1:K10)))","v":""},{"$f":"IF(SUM(Hilfstabelle!L1:L10)=0,\"\",(SUMIF(Auswertung_I!$H$6:$H$15,\"Heizöl\",Hilfstabelle!L1:L10)+SUMIF(Auswertung_I!$H$6:$H$15,\"Erdgas\",Hilfstabelle!L1:L10))/(SUM(Hilfstabelle!L1:L10)))","v":""},{"$f":"IF(SUM(Hilfstabelle!M1:M10)=0,\"\",(SUMIF(Auswertung_I!$H$6:$H$15,\"Heizöl\",Hilfstabelle!M1:M10)+SUMIF(Auswertung_I!$H$6:$H$15,\"Erdgas\",Hilfstabelle!M1:M10))/(SUM(Hilfstabelle!M1:M10)))","v":""},{"$f":"IF(SUM(Hilfstabelle!N1:N10)=0,\"\",(SUMIF(Auswertung_I!$H$6:$H$15,\"Heizöl\",Hilfstabelle!N1:N10)+SUMIF(Auswertung_I!$H$6:$H$15,\"Erdgas\",Hilfstabelle!N1:N10))/(SUM(Hilfstabelle!N1:N10)))","v":""}]
[null,"Anteil Sonstige","%",null,{"$f":"IF(SUM(Hilfstabelle!B1:B10)=0,\"\",SUMIF(Auswertung_I!$H$6:$H$15,\"Sonstige\",Hilfstabelle!B1:B10)/(SUM(Hilfstabelle!B1:B10)))","v":""},{"$f":"IF(SUM(Hilfstabelle!C1:C10)=0,\"\",SUMIF(Auswertung_I!$H$6:$H$15,\"Sonstige\",Hilfstabelle!C1:C10)/(SUM(Hilfstabelle!C1:C10)))","v":""},{"$f":"IF(SUM(Hilfstabelle!D1:D10)=0,\"\",SUMIF(Auswertung_I!$H$6:$H$15,\"Sonstige\",Hilfstabelle!D1:D10)/(SUM(Hilfstabelle!D1:D10)))","v":""},{"$f":"IF(SUM(Hilfstabelle!E1:E10)=0,\"\",SUMIF(Auswertung_I!$H$6:$H$15,\"Sonstige\",Hilfstabelle!E1:E10)/(SUM(Hilfstabelle!E1:E10)))","v":""},{"$f":"IF(SUM(Hilfstabelle!F1:F10)=0,\"\",SUMIF(Auswertung_I!$H$6:$H$15,\"Sonstige\",Hilfstabelle!F1:F10)/(SUM(Hilfstabelle!F1:F10)))","v":""},{"$f":"IF(SUM(Hilfstabelle!G1:G10)=0,\"\",SUMIF(Auswertung_I!$H$6:$H$15,\"Sonstige\",Hilfstabelle!G1:G10)/(SUM(Hilfstabelle!G1:G10)))","v":""},{"$f":"IF(SUM(Hilfstabelle!H1:H10)=0,\"\",SUMIF(Auswertung_I!$H$6:$H$15,\"Sonstige\",Hilfstabelle!H1:H10)/(SUM(Hilfstabelle!H1:H10)))","v":""},{"$f":"IF(SUM(Hilfstabelle!I1:I10)=0,\"\",SUMIF(Auswertung_I!$H$6:$H$15,\"Sonstige\",Hilfstabelle!I1:I10)/(SUM(Hilfstabelle!I1:I10)))","v":""},{"$f":"IF(SUM(Hilfstabelle!J1:J10)=0,\"\",SUMIF(Auswertung_I!$H$6:$H$15,\"Sonstige\",Hilfstabelle!J1:J10)/(SUM(Hilfstabelle!J1:J10)))","v":""},{"$f":"IF(SUM(Hilfstabelle!K1:K10)=0,\"\",SUMIF(Auswertung_I!$H$6:$H$15,\"Sonstige\",Hilfstabelle!K1:K10)/(SUM(Hilfstabelle!K1:K10)))","v":""},{"$f":"IF(SUM(Hilfstabelle!L1:L10)=0,\"\",SUMIF(Auswertung_I!$H$6:$H$15,\"Sonstige\",Hilfstabelle!L1:L10)/(SUM(Hilfstabelle!L1:L10)))","v":""},{"$f":"IF(SUM(Hilfstabelle!M1:M10)=0,\"\",SUMIF(Auswertung_I!$H$6:$H$15,\"Sonstige\",Hilfstabelle!M1:M10)/(SUM(Hilfstabelle!M1:M10)))","v":""},{"$f":"IF(SUM(Hilfstabelle!N1:N10)=0,\"\",SUMIF(Auswertung_I!$H$6:$H$15,\"Sonstige\",Hilfstabelle!N1:N10)/(SUM(Hilfstabelle!N1:N10)))","v":""}]
[null,"Stromverbrauch"]
[]
[null,"spezifischer Stromverbrauch Gesamtanlage","kWhel/MWhtherm",null,{"$f":"IF(SUM(Hilfstabelle!B1:B10)=0,\"\",'Betriebsdaten II'!E22/(SUM(Hilfstabelle!B1:B10)/1000))","v":""},{"$f":"IF(SUM(Hilfstabelle!C1:C10)=0,\"\",'Betriebsdaten II'!F22/(SUM(Hilfstabelle!C1:C10)/1000))","v":""},{"$f":"IF(SUM(Hilfstabelle!D1:D10)=0,\"\",'Betriebsdaten II'!G22/(SUM(Hilfstabelle!D1:D10)/1000))","v":""},{"$f":"IF(SUM(Hilfstabelle!E1:E10)=0,\"\",'Betriebsdaten II'!H22/(SUM(Hilfstabelle!E1:E10)/1000))","v":""},{"$f":"IF(SUM(Hilfstabelle!F1:F10)=0,\"\",'Betriebsdaten II'!I22/(SUM(Hilfstabelle!F1:F10)/1000))","v":""},{"$f":"IF(SUM(Hilfstabelle!G1:G10)=0,\"\",'Betriebsdaten II'!J22/(SUM(Hilfstabelle!G1:G10)/1000))","v":""},{"$f":"IF(SUM(Hilfstabelle!H1:H10)=0,\"\",'Betriebsdaten II'!K22/(SUM(Hilfstabelle!H1:H10)/1000))","v":""},{"$f":"IF(SUM(Hilfstabelle!I1:I10)=0,\"\",'Betriebsdaten II'!L22/(SUM(Hilfstabelle!I1:I10)/1000))","v":""},{"$f":"IF(SUM(Hilfstabelle!J1:J10)=0,\"\",'Betriebsdaten II'!M22/(SUM(Hilfstabelle!J1:J10)/1000))","v":""},{"$f":"IF(SUM(Hilfstabelle!K1:K10)=0,\"\",'Betriebsdaten II'!N22/(SUM(Hilfstabelle!K1:K10)/1000))","v":""},{"$f":"IF(SUM(Hilfstabelle!L1:L10)=0,\"\",'Betriebsdaten II'!O22/(SUM(Hilfstabelle!L1:L10)/1000))","v":""},{"$f":"IF(SUM(Hilfstabelle!M1:M10)=0,\"\",'Betriebsdaten II'!P22/(SUM(Hilfstabelle!M1:M10)/1000))","v":""},{"$f":"IF(SUM(Hilfstabelle!N1:N10)=0,\"\",'Betriebsdaten II'!Q22/(SUM(Hilfstabelle!N1:N10)/1000))","v":""}]
[null,"spezifischer Stromverbrauch E-Filter","kWhel/MWhtherm",null,{"$f":"IF(SUM(Hilfstabelle!B1:B10)=0,\"\",'Betriebsdaten II'!E20/(SUM(Hilfstabelle!B1:B10)/1000))","v":""},{"$f":"IF(SUM(Hilfstabelle!C1:C10)=0,\"\",'Betriebsdaten II'!F20/(SUM(Hilfstabelle!C1:C10)/1000))","v":""},{"$f":"IF(SUM(Hilfstabelle!D1:D10)=0,\"\",'Betriebsdaten II'!G20/(SUM(Hilfstabelle!D1:D10)/1000))","v":""},{"$f":"IF(SUM(Hilfstabelle!E1:E10)=0,\"\",'Betriebsdaten II'!H20/(SUM(Hilfstabelle!E1:E10)/1000))","v":""},{"$f":"IF(SUM(Hilfstabelle!F1:F10)=0,\"\",'Betriebsdaten II'!I20/(SUM(Hilfstabelle!F1:F10)/1000))","v":""},{"$f":"IF(SUM(Hilfstabelle!G1:G10)=0,\"\",'Betriebsdaten II'!J20/(SUM(Hilfstabelle!G1:G10)/1000))","v":""},{"$f":"IF(SUM(Hilfstabelle!H1:H10)=0,\"\",'Betriebsdaten II'!K20/(SUM(Hilfstabelle!H1:H10)/1000))","v":""},{"$f":"IF(SUM(Hilfstabelle!I1:I10)=0,\"\",'Betriebsdaten II'!L20/(SUM(Hilfstabelle!I1:I10)/1000))","v":""},{"$f":"IF(SUM(Hilfstabelle!J1:J10)=0,\"\",'Betriebsdaten II'!M20/(SUM(Hilfstabelle!J1:J10)/1000))","v":""},{"$f":"IF(SUM(Hilfstabelle!K1:K10)=0,\"\",'Betriebsdaten II'!N20/(SUM(Hilfstabelle!K1:K10)/1000))","v":""},{"$f":"IF(SUM(Hilfstabelle!L1:L10)=0,\"\",'Betriebsdaten II'!O20/(SUM(Hilfstabelle!L1:L10)/1000))","v":""},{"$f":"IF(SUM(Hilfstabelle!M1:M10)=0,\"\",'Betriebsdaten II'!P20/(SUM(Hilfstabelle!M1:M10)/1000))","v":""},{"$f":"IF(SUM(Hilfstabelle!N1:N10)=0,\"\",'Betriebsdaten II'!Q20/(SUM(Hilfstabelle!N1:N10)/1000))","v":""}]
[null,"spezifischer Stromverbrauch Sonstige","kWhel/MWhtherm",null,{"$f":"IF(SUM(Hilfstabelle!B1:B10)=0,\"\",'Betriebsdaten II'!E21/(SUM(Hilfstabelle!B1:B10)/1000))","v":""},{"$f":"IF(SUM(Hilfstabelle!C1:C10)=0,\"\",'Betriebsdaten II'!F21/(SUM(Hilfstabelle!C1:C10)/1000))","v":""},{"$f":"IF(SUM(Hilfstabelle!D1:D10)=0,\"\",'Betriebsdaten II'!G21/(SUM(Hilfstabelle!D1:D10)/1000))","v":""},{"$f":"IF(SUM(Hilfstabelle!E1:E10)=0,\"\",'Betriebsdaten II'!H21/(SUM(Hilfstabelle!E1:E10)/1000))","v":""},{"$f":"IF(SUM(Hilfstabelle!F1:F10)=0,\"\",'Betriebsdaten II'!I21/(SUM(Hilfstabelle!F1:F10)/1000))","v":""},{"$f":"IF(SUM(Hilfstabelle!G1:G10)=0,\"\",'Betriebsdaten II'!J21/(SUM(Hilfstabelle!G1:G10)/1000))","v":""},{"$f":"IF(SUM(Hilfstabelle!H1:H10)=0,\"\",'Betriebsdaten II'!K21/(SUM(Hilfstabelle!H1:H10)/1000))","v":""},{"$f":"IF(SUM(Hilfstabelle!I1:I10)=0,\"\",'Betriebsdaten II'!L21/(SUM(Hilfstabelle!I1:I10)/1000))","v":""},{"$f":"IF(SUM(Hilfstabelle!J1:J10)=0,\"\",'Betriebsdaten II'!M21/(SUM(Hilfstabelle!J1:J10)/1000))","v":""},{"$f":"IF(SUM(Hilfstabelle!K1:K10)=0,\"\",'Betriebsdaten II'!N21/(SUM(Hilfstabelle!K1:K10)/1000))","v":""},{"$f":"IF(SUM(Hilfstabelle!L1:L10)=0,\"\",'Betriebsdaten II'!O21/(SUM(Hilfstabelle!L1:L10)/1000))","v":""},{"$f":"IF(SUM(Hilfstabelle!M1:M10)=0,\"\",'Betriebsdaten II'!P21/(SUM(Hilfstabelle!M1:M10)/1000))","v":""},{"$f":"IF(SUM(Hilfstabelle!N1:N10)=0,\"\",'Betriebsdaten II'!Q21/(SUM(Hilfstabelle!N1:N10)/1000))","v":""}]
[]
[]
[null,"Projektnummer:",{"$f":"IF(Titelblatt!$D$6=\"\",\"\",Titelblatt!$D$6)","v":""},null,null,"Jahr:",{"$f":"IF(Titelblatt!$D$8=\"\",YEAR(TODAY()),Titelblatt!$D$8)","v":2022},null,null,null,"Anfangsmonat:",{"$f":"IF(Titelblatt!$D$10=\"\",1,Titelblatt!$D$10)","v":1}]
[null,"Biomassekessel ","Nr.","Einheit",{"$f":"DATE($G$26,$L$26,1)","v":"2022-01-01"},{"$f":"IF($L$26+1>12,DATE($G$26+1,$L$26+1-12,1),DATE($G$26,$L$26+1,1))","v":"2022-02-01"},{"$f":"IF($L$26+2>12,DATE($G$26+1,$L$26+2-12,1),DATE($G$26,$L$26+2,1))","v":"2022-03-01"},{"$f":"IF($L$26+3>12,DATE($G$26+1,$L$26+3-12,1),DATE($G$26,$L$26+3,1))","v":"2022-04-01"},{"$f":"IF($L$26+4>12,DATE($G$26+4,$L$26+1-12,1),DATE($G$26,$L$26+4,1))","v":"2022-05-01"},{"$f":"IF($L$26+5>12,DATE($G$26+5,$L$26+1-12,1),DATE($G$26,$L$26+5,1))","v":"2022-06-01"},{"$f":"IF($L$26+6>12,DATE($G$26+1,$L$26+6-12,1),DATE($G$26,$L$26+6,1))","v":"2022-07-01"},{"$f":"IF($L$26+7>12,DATE($G$26+1,$L$26+7-12,1),DATE($G$26,$L$26+7,1))","v":"2022-08-01"},{"$f":"IF($L$26+8>12,DATE($G$26+1,$L$26+8-12,1),DATE($G$26,$L$26+8,1))","v":"2022-09-01"},{"$f":"IF($L$26+9>12,DATE($G$26+1,$L$26+9-12,1),DATE($G$26,$L$26+9,1))","v":"2022-10-01"},{"$f":"IF($L$26+10>12,DATE($G$26+1,$L$26+10-12,1),DATE($G$26,$L$26+10,1))","v":"2022-11-01"},{"$f":"IF($L$26+11>12,DATE($G$26+1,$L$26+11-12,1),DATE($G$26,$L$26+11,1))","v":"2022-12-01"},"Jahr"]
[]
[null,{"$f":"IF(ISBLANK(BezeichnungBMKessel1),\"\",BezeichnungBMKessel1)","v":""},{"$f":"'Betriebsdaten I'!C7","v":0}]
[null,"Volllaststunden",null,"h",{"$f":"IF(OR(ISBLANK(Auswertung_I!$I$6),Auswertung_I!$I$6=0,ISBLANK('Betriebsdaten I'!E7)),\"-\",'Betriebsdaten I'!E7/Auswertung_I!$I$6)","v":"-"},{"$f":"IF(OR(ISBLANK(Auswertung_I!$I$6),Auswertung_I!$I$6=0,ISBLANK('Betriebsdaten I'!F7)),\"-\",'Betriebsdaten I'!F7/Auswertung_I!$I$6)","v":"-"},{"$f":"IF(OR(ISBLANK(Auswertung_I!$I$6),Auswertung_I!$I$6=0,ISBLANK('Betriebsdaten I'!G7)),\"-\",'Betriebsdaten I'!G7/Auswertung_I!$I$6)","v":"-"},{"$f":"IF(OR(ISBLANK(Auswertung_I!$I$6),Auswertung_I!$I$6=0,ISBLANK('Betriebsdaten I'!H7)),\"-\",'Betriebsdaten I'!H7/Auswertung_I!$I$6)","v":"-"},{"$f":"IF(OR(ISBLANK(Auswertung_I!$I$6),Auswertung_I!$I$6=0,ISBLANK('Betriebsdaten I'!I7)),\"-\",'Betriebsdaten I'!I7/Auswertung_I!$I$6)","v":"-"},{"$f":"IF(OR(ISBLANK(Auswertung_I!$I$6),Auswertung_I!$I$6=0,ISBLANK('Betriebsdaten I'!J7)),\"-\",'Betriebsdaten I'!J7/Auswertung_I!$I$6)","v":"-"},{"$f":"IF(OR(ISBLANK(Auswertung_I!$I$6),Auswertung_I!$I$6=0,ISBLANK('Betriebsdaten I'!K7)),\"-\",'Betriebsdaten I'!K7/Auswertung_I!$I$6)","v":"-"},{"$f":"IF(OR(ISBLANK(Auswertung_I!$I$6),Auswertung_I!$I$6=0,ISBLANK('Betriebsdaten I'!L7)),\"-\",'Betriebsdaten I'!L7/Auswertung_I!$I$6)","v":"-"},{"$f":"IF(OR(ISBLANK(Auswertung_I!$I$6),Auswertung_I!$I$6=0,ISBLANK('Betriebsdaten I'!M7)),\"-\",'Betriebsdaten I'!M7/Auswertung_I!$I$6)","v":"-"},{"$f":"IF(OR(ISBLANK(Auswertung_I!$I$6),Auswertung_I!$I$6=0,ISBLANK('Betriebsdaten I'!N7)),\"-\",'Betriebsdaten I'!N7/Auswertung_I!$I$6)","v":"-"},{"$f":"IF(OR(ISBLANK(Auswertung_I!$I$6),Auswertung_I!$I$6=0,ISBLANK('Betriebsdaten I'!O7)),\"-\",'Betriebsdaten I'!O7/Auswertung_I!$I$6)","v":"-"},{"$f":"IF(OR(ISBLANK(Auswertung_I!$I$6),Auswertung_I!$I$6=0,ISBLANK('Betriebsdaten I'!P7)),\"-\",'Betriebsdaten I'!P7/Auswertung_I!$I$6)","v":"-"},{"$f":"IF(OR(ISBLANK(Auswertung_I!$I$6),Auswertung_I!$I$6=0,ISBLANK('Betriebsdaten I'!Q7)),\"-\",'Betriebsdaten I'!Q7/Auswertung_I!$I$6)","v":"-"}]
[null,"spezifischer Stromverbrauch",null,"kWhel/MWhtherm",{"$f":"IF(OR(ISBLANK('Betriebsdaten I'!E7),'Betriebsdaten I'!E7=0,'Betriebsdaten II'!E16=0),\"-\",'Betriebsdaten II'!E16/'Betriebsdaten I'!E7*1000)","v":"-"},{"$f":"IF(OR(ISBLANK('Betriebsdaten I'!F7),'Betriebsdaten I'!F7=0,'Betriebsdaten II'!F16=0),\"-\",'Betriebsdaten II'!F16/'Betriebsdaten I'!F7*1000)","v":"-"},{"$f":"IF(OR(ISBLANK('Betriebsdaten I'!G7),'Betriebsdaten I'!G7=0,'Betriebsdaten II'!G16=0),\"-\",'Betriebsdaten II'!G16/'Betriebsdaten I'!G7*1000)","v":"-"},{"$f":"IF(OR(ISBLANK('Betriebsdaten I'!H7),'Betriebsdaten I'!H7=0,'Betriebsdaten II'!H16=0),\"-\",'Betriebsdaten II'!H16/'Betriebsdaten I'!H7*1000)","v":"-"},{"$f":"IF(OR(ISBLANK('Betriebsdaten I'!I7),'Betriebsdaten I'!I7=0,'Betriebsdaten II'!I16=0),\"-\",'Betriebsdaten II'!I16/'Betriebsdaten I'!I7*1000)","v":"-"},{"$f":"IF(OR(ISBLANK('Betriebsdaten I'!J7),'Betriebsdaten I'!J7=0,'Betriebsdaten II'!J16=0),\"-\",'Betriebsdaten II'!J16/'Betriebsdaten I'!J7*1000)","v":"-"},{"$f":"IF(OR(ISBLANK('Betriebsdaten I'!K7),'Betriebsdaten I'!K7=0,'Betriebsdaten II'!K16=0),\"-\",'Betriebsdaten II'!K16/'Betriebsdaten I'!K7*1000)","v":"-"},{"$f":"IF(OR(ISBLANK('Betriebsdaten I'!L7),'Betriebsdaten I'!L7=0,'Betriebsdaten II'!L16=0),\"-\",'Betriebsdaten II'!L16/'Betriebsdaten I'!L7*1000)","v":"-"},{"$f":"IF(OR(ISBLANK('Betriebsdaten I'!M7),'Betriebsdaten I'!M7=0,'Betriebsdaten II'!M16=0),\"-\",'Betriebsdaten II'!M16/'Betriebsdaten I'!M7*1000)","v":"-"},{"$f":"IF(OR(ISBLANK('Betriebsdaten I'!N7),'Betriebsdaten I'!N7=0,'Betriebsdaten II'!N16=0),\"-\",'Betriebsdaten II'!N16/'Betriebsdaten I'!N7*1000)","v":"-"},{"$f":"IF(OR(ISBLANK('Betriebsdaten I'!O7),'Betriebsdaten I'!O7=0,'Betriebsdaten II'!O16=0),\"-\",'Betriebsdaten II'!O16/'Betriebsdaten I'!O7*1000)","v":"-"},{"$f":"IF(OR(ISBLANK('Betriebsdaten I'!P7),'Betriebsdaten I'!P7=0,'Betriebsdaten II'!P16=0),\"-\",'Betriebsdaten II'!P16/'Betriebsdaten I'!P7*1000)","v":"-"},{"$f":"IF(OR(ISBLANK('Betriebsdaten I'!Q7),'Betriebsdaten I'!Q7=0,'Betriebsdaten II'!Q16=0),\"-\",'Betriebsdaten II'!Q16/'Betriebsdaten I'!Q7*1000)","v":"-"}]
[null,{"$f":"IF(ISBLANK(BezeichnungBMKessel2),\"\",BezeichnungBMKessel2)","v":""},{"$f":"'Betriebsdaten I'!C8","v":0}]
[null,"Volllaststunden",null,"h",{"$f":"IF(OR(ISBLANK(Auswertung_I!$I$7),Auswertung_I!$I$7=0,ISBLANK('Betriebsdaten I'!E8)),\"-\",Auswertung_I!$I$7/'Betriebsdaten I'!E8)","v":"-"},{"$f":"IF(OR(ISBLANK(Auswertung_I!$I$7),Auswertung_I!$I$7=0,ISBLANK('Betriebsdaten I'!F8)),\"-\",'Betriebsdaten I'!F8/Auswertung_I!$I$7)","v":"-"},{"$f":"IF(OR(ISBLANK(Auswertung_I!$I$7),Auswertung_I!$I$7=0,ISBLANK('Betriebsdaten I'!G8)),\"-\",'Betriebsdaten I'!G8/Auswertung_I!$I$7)","v":"-"},{"$f":"IF(OR(ISBLANK(Auswertung_I!$I$7),Auswertung_I!$I$7=0,ISBLANK('Betriebsdaten I'!H8)),\"-\",'Betriebsdaten I'!H8/Auswertung_I!$I$7)","v":"-"},{"$f":"IF(OR(ISBLANK(Auswertung_I!$I$7),Auswertung_I!$I$7=0,ISBLANK('Betriebsdaten I'!I8)),\"-\",'Betriebsdaten I'!I8/Auswertung_I!$I$7)","v":"-"},{"$f":"IF(OR(ISBLANK(Auswertung_I!$I$7),Auswertung_I!$I$7=0,ISBLANK('Betriebsdaten I'!J8)),\"-\",'Betriebsdaten I'!J8/Auswertung_I!$I$7)","v":"-"},{"$f":"IF(OR(ISBLANK(Auswertung_I!$I$7),Auswertung_I!$I$7=0,ISBLANK('Betriebsdaten I'!K8)),\"-\",'Betriebsdaten I'!K8/Auswertung_I!$I$7)","v":"-"},{"$f":"IF(OR(ISBLANK(Auswertung_I!$I$7),Auswertung_I!$I$7=0,ISBLANK('Betriebsdaten I'!L8)),\"-\",'Betriebsdaten I'!L8/Auswertung_I!$I$7)","v":"-"},{"$f":"IF(OR(ISBLANK(Auswertung_I!$I$7),Auswertung_I!$I$7=0,ISBLANK('Betriebsdaten I'!M8)),\"-\",'Betriebsdaten I'!M8/Auswertung_I!$I$7)","v":"-"},{"$f":"IF(OR(ISBLANK(Auswertung_I!$I$7),Auswertung_I!$I$7=0,ISBLANK('Betriebsdaten I'!N8)),\"-\",'Betriebsdaten I'!N8/Auswertung_I!$I$7)","v":"-"},{"$f":"IF(OR(ISBLANK(Auswertung_I!$I$7),Auswertung_I!$I$7=0,ISBLANK('Betriebsdaten I'!O8)),\"-\",'Betriebsdaten I'!O8/Auswertung_I!$I$7)","v":"-"},{"$f":"IF(OR(ISBLANK(Auswertung_I!$I$7),Auswertung_I!$I$7=0,ISBLANK('Betriebsdaten I'!P8)),\"-\",'Betriebsdaten I'!P8/Auswertung_I!$I$7)","v":"-"},{"$f":"IF(OR(ISBLANK(Auswertung_I!$I$7),Auswertung_I!$I$7=0,ISBLANK('Betriebsdaten I'!Q8)),\"-\",'Betriebsdaten I'!Q8/Auswertung_I!$I$7)","v":"-"}]
[null,"spezifischer Stromverbrauch",null,"kWhel/MWhtherm",{"$f":"IF(OR(ISBLANK('Betriebsdaten I'!E8),'Betriebsdaten I'!E8=0,'Betriebsdaten II'!E17=0),\"-\",'Betriebsdaten II'!E17/'Betriebsdaten I'!E8*1000)","v":"-"},{"$f":"IF(OR(ISBLANK('Betriebsdaten I'!F8),'Betriebsdaten I'!F8=0,'Betriebsdaten II'!F17=0),\"-\",'Betriebsdaten II'!F17/'Betriebsdaten I'!F8*1000)","v":"-"},{"$f":"IF(OR(ISBLANK('Betriebsdaten I'!G8),'Betriebsdaten I'!G8=0,'Betriebsdaten II'!G17=0),\"-\",'Betriebsdaten II'!G17/'Betriebsdaten I'!G8*1000)","v":"-"},{"$f":"IF(OR(ISBLANK('Betriebsdaten I'!H8),'Betriebsdaten I'!H8=0,'Betriebsdaten II'!H17=0),\"-\",'Betriebsdaten II'!H17/'Betriebsdaten I'!H8*1000)","v":"-"},{"$f":"IF(OR(ISBLANK('Betriebsdaten I'!I8),'Betriebsdaten I'!I8=0,'Betriebsdaten II'!I17=0),\"-\",'Betriebsdaten II'!I17/'Betriebsdaten I'!I8*1000)","v":"-"},{"$f":"IF(OR(ISBLANK('Betriebsdaten I'!J8),'Betriebsdaten I'!J8=0,'Betriebsdaten II'!J17=0),\"-\",'Betriebsdaten II'!J17/'Betriebsdaten I'!J8*1000)","v":"-"},{"$f":"IF(OR(ISBLANK('Betriebsdaten I'!K8),'Betriebsdaten I'!K8=0,'Betriebsdaten II'!K17=0),\"-\",'Betriebsdaten II'!K17/'Betriebsdaten I'!K8*1000)","v":"-"},{"$f":"IF(OR(ISBLANK('Betriebsdaten I'!L8),'Betriebsdaten I'!L8=0,'Betriebsdaten II'!L17=0),\"-\",'Betriebsdaten II'!L17/'Betriebsdaten I'!L8*1000)","v":"-"},{"$f":"IF(OR(ISBLANK('Betriebsdaten I'!M8),'Betriebsdaten I'!M8=0,'Betriebsdaten II'!M17=0),\"-\",'Betriebsdaten II'!M17/'Betriebsdaten I'!M8*1000)","v":"-"},{"$f":"IF(OR(ISBLANK('Betriebsdaten I'!N8),'Betriebsdaten I'!N8=0,'Betriebsdaten II'!N17=0),\"-\",'Betriebsdaten II'!N17/'Betriebsdaten I'!N8*1000)","v":"-"},{"$f":"IF(OR(ISBLANK('Betriebsdaten I'!O8),'Betriebsdaten I'!O8=0,'Betriebsdaten II'!O17=0),\"-\",'Betriebsdaten II'!O17/'Betriebsdaten I'!O8*1000)","v":"-"},{"$f":"IF(OR(ISBLANK('Betriebsdaten I'!P8),'Betriebsdaten I'!P8=0,'Betriebsdaten II'!P17=0),\"-\",'Betriebsdaten II'!P17/'Betriebsdaten I'!P8*1000)","v":"-"},{"$f":"IF(OR(ISBLANK('Betriebsdaten I'!Q8),'Betriebsdaten I'!Q8=0,'Betriebsdaten II'!Q17=0),\"-\",'Betriebsdaten II'!Q17/'Betriebsdaten I'!Q8*1000)","v":"-"}]
[null,{"$f":"IF(ISBLANK(BezeichnungBMKessel3),\"\",BezeichnungBMKessel3)","v":""},{"$f":"'Betriebsdaten I'!C9","v":0}]
[null,"Volllaststunden",null,"h",{"$f":"IF(OR(ISBLANK(Auswertung_I!$I$8),Auswertung_I!$I$8=0,ISBLANK('Betriebsdaten I'!E9)),\"-\",Auswertung_I!$I$8/'Betriebsdaten I'!E9)","v":"-"},{"$f":"IF(OR(ISBLANK(Auswertung_I!$I$8),Auswertung_I!$I$8=0,ISBLANK('Betriebsdaten I'!F9)),\"-\",Auswertung_I!$I$8/'Betriebsdaten I'!F9)","v":"-"},{"$f":"IF(OR(ISBLANK(Auswertung_I!$I$8),Auswertung_I!$I$8=0,ISBLANK('Betriebsdaten I'!G9)),\"-\",Auswertung_I!$I$8/'Betriebsdaten I'!G9)","v":"-"},{"$f":"IF(OR(ISBLANK(Auswertung_I!$I$8),Auswertung_I!$I$8=0,ISBLANK('Betriebsdaten I'!H9)),\"-\",Auswertung_I!$I$8/'Betriebsdaten I'!H9)","v":"-"},{"$f":"IF(OR(ISBLANK(Auswertung_I!$I$8),Auswertung_I!$I$8=0,ISBLANK('Betriebsdaten I'!I9)),\"-\",Auswertung_I!$I$8/'Betriebsdaten I'!I9)","v":"-"},{"$f":"IF(OR(ISBLANK(Auswertung_I!$I$8),Auswertung_I!$I$8=0,ISBLANK('Betriebsdaten I'!J9)),\"-\",Auswertung_I!$I$8/'Betriebsdaten I'!J9)","v":"-"},{"$f":"IF(OR(ISBLANK(Auswertung_I!$I$8),Auswertung_I!$I$8=0,ISBLANK('Betriebsdaten I'!K9)),\"-\",Auswertung_I!$I$8/'Betriebsdaten I'!K9)","v":"-"},{"$f":"IF(OR(ISBLANK(Auswertung_I!$I$8),Auswertung_I!$I$8=0,ISBLANK('Betriebsdaten I'!L9)),\"-\",Auswertung_I!$I$8/'Betriebsdaten I'!L9)","v":"-"},{"$f":"IF(OR(ISBLANK(Auswertung_I!$I$8),Auswertung_I!$I$8=0,ISBLANK('Betriebsdaten I'!M9)),\"-\",Auswertung_I!$I$8/'Betriebsdaten I'!M9)","v":"-"},{"$f":"IF(OR(ISBLANK(Auswertung_I!$I$8),Auswertung_I!$I$8=0,ISBLANK('Betriebsdaten I'!N9)),\"-\",Auswertung_I!$I$8/'Betriebsdaten I'!N9)","v":"-"},{"$f":"IF(OR(ISBLANK(Auswertung_I!$I$8),Auswertung_I!$I$8=0,ISBLANK('Betriebsdaten I'!O9)),\"-\",Auswertung_I!$I$8/'Betriebsdaten I'!O9)","v":"-"},{"$f":"IF(OR(ISBLANK(Auswertung_I!$I$8),Auswertung_I!$I$8=0,ISBLANK('Betriebsdaten I'!P9)),\"-\",Auswertung_I!$I$8/'Betriebsdaten I'!P9)","v":"-"},{"$f":"IF(OR(ISBLANK(Auswertung_I!$I$8),Auswertung_I!$I$8=0,ISBLANK('Betriebsdaten I'!Q9)),\"-\",Auswertung_I!$I$8/'Betriebsdaten I'!Q9)","v":"-"}]
[null,"spezifischer Stromverbrauch",null,"kWhel/MWhtherm",{"$f":"IF(OR(ISBLANK('Betriebsdaten I'!E10),'Betriebsdaten I'!E10=0,'Betriebsdaten II'!E18=0),\"-\",'Betriebsdaten II'!E18/'Betriebsdaten I'!E10*1000)","v":"-"},{"$f":"IF(OR(ISBLANK('Betriebsdaten I'!F10),'Betriebsdaten I'!F10=0,'Betriebsdaten II'!F18=0),\"-\",'Betriebsdaten II'!F18/'Betriebsdaten I'!F10*1000)","v":"-"},{"$f":"IF(OR(ISBLANK('Betriebsdaten I'!G10),'Betriebsdaten I'!G10=0,'Betriebsdaten II'!G18=0),\"-\",'Betriebsdaten II'!G18/'Betriebsdaten I'!G10*1000)","v":"-"},{"$f":"IF(OR(ISBLANK('Betriebsdaten I'!H10),'Betriebsdaten I'!H10=0,'Betriebsdaten II'!H18=0),\"-\",'Betriebsdaten II'!H18/'Betriebsdaten I'!H10*1000)","v":"-"},{"$f":"IF(OR(ISBLANK('Betriebsdaten I'!I10),'Betriebsdaten I'!I10=0,'Betriebsdaten II'!I18=0),\"-\",'Betriebsdaten II'!I18/'Betriebsdaten I'!I10*1000)","v":"-"},{"$f":"IF(OR(ISBLANK('Betriebsdaten I'!J10),'Betriebsdaten I'!J10=0,'Betriebsdaten II'!J18=0),\"-\",'Betriebsdaten II'!J18/'Betriebsdaten I'!J10*1000)","v":"-"},{"$f":"IF(OR(ISBLANK('Betriebsdaten I'!K10),'Betriebsdaten I'!K10=0,'Betriebsdaten II'!K18=0),\"-\",'Betriebsdaten II'!K18/'Betriebsdaten I'!K10*1000)","v":"-"},{"$f":"IF(OR(ISBLANK('Betriebsdaten I'!L10),'Betriebsdaten I'!L10=0,'Betriebsdaten II'!L18=0),\"-\",'Betriebsdaten II'!L18/'Betriebsdaten I'!L10*1000)","v":"-"},{"$f":"IF(OR(ISBLANK('Betriebsdaten I'!M10),'Betriebsdaten I'!M10=0,'Betriebsdaten II'!M18=0),\"-\",'Betriebsdaten II'!M18/'Betriebsdaten I'!M10*1000)","v":"-"},{"$f":"IF(OR(ISBLANK('Betriebsdaten I'!N10),'Betriebsdaten I'!N10=0,'Betriebsdaten II'!N18=0),\"-\",'Betriebsdaten II'!N18/'Betriebsdaten I'!N10*1000)","v":"-"},{"$f":"IF(OR(ISBLANK('Betriebsdaten I'!O10),'Betriebsdaten I'!O10=0,'Betriebsdaten II'!O18=0),\"-\",'Betriebsdaten II'!O18/'Betriebsdaten I'!O10*1000)","v":"-"},{"$f":"IF(OR(ISBLANK('Betriebsdaten I'!P10),'Betriebsdaten I'!P10=0,'Betriebsdaten II'!P18=0),\"-\",'Betriebsdaten II'!P18/'Betriebsdaten I'!P10*1000)","v":"-"},{"$f":"IF(OR(ISBLANK('Betriebsdaten I'!Q10),'Betriebsdaten I'!Q10=0,'Betriebsdaten II'!Q18=0),\"-\",'Betriebsdaten II'!Q18/'Betriebsdaten I'!Q10*1000)","v":"-"}]
[]
[]
[null,"Projektnummer:",{"$f":"IF(Titelblatt!$D$6=\"\",\"\",Titelblatt!$D$6)","v":""},null,null,"Jahr:",{"$f":"IF(Titelblatt!$D$8=\"\",YEAR(TODAY()),Titelblatt!$D$8)","v":2022},null,null,null,"Anfangsmonat:",{"$f":"IF(Titelblatt!$D$10=\"\",1,Titelblatt!$D$10)","v":1}]
[null,"Wärmenetz","Einheit",null,{"$f":"DATE($G$26,$L$26,1)","v":"2022-01-01"},{"$f":"IF($L$26+1>12,DATE($G$26+1,$L$26+1-12,1),DATE($G$26,$L$26+1,1))","v":"2022-02-01"},{"$f":"IF($L$26+2>12,DATE($G$26+1,$L$26+2-12,1),DATE($G$26,$L$26+2,1))","v":"2022-03-01"},{"$f":"IF($L$26+3>12,DATE($G$26+1,$L$26+3-12,1),DATE($G$26,$L$26+3,1))","v":"2022-04-01"},{"$f":"IF($L$26+4>12,DATE($G$26+4,$L$26+1-12,1),DATE($G$26,$L$26+4,1))","v":"2022-05-01"},{"$f":"IF($L$26+5>12,DATE($G$26+5,$L$26+1-12,1),DATE($G$26,$L$26+5,1))","v":"2022-06-01"},{"$f":"IF($L$26+6>12,DATE($G$26+1,$L$26+6-12,1),DATE($G$26,$L$26+6,1))","v":"2022-07-01"},{"$f":"IF($L$26+7>12,DATE($G$26+1,$L$26+7-12,1),DATE($G$26,$L$26+7,1))","v":"2022-08-01"},{"$f":"IF($L$26+8>12,DATE($G$26+1,$L$26+8-12,1),DATE($G$26,$L$26+8,1))","v":"2022-09-01"},{"$f":"IF($L$26+9>12,DATE($G$26+1,$L$26+9-12,1),DATE($G$26,$L$26+9,1))","v":"2022-10-01"},{"$f":"IF($L$26+10>12,DATE($G$26+1,$L$26+10-12,1),DATE($G$26,$L$26+10,1))","v":"2022-11-01"},{"$f":"IF($L$26+11>12,DATE($G$26+1,$L$26+11-12,1),DATE($G$26,$L$26+11,1))","v":"2022-12-01"},"Jahr"]
[]
[null,"Wärmeverluste Netz","%",null,{"$f":"IF('Betriebsdaten II'!E8=0,\"\",('Betriebsdaten II'!E8-'Betriebsdaten II'!E10)/'Betriebsdaten II'!E8)","v":""},{"$f":"IF('Betriebsdaten II'!F8=0,\"\",('Betriebsdaten II'!F8-'Betriebsdaten II'!F10)/'Betriebsdaten II'!F8)","v":""},{"$f":"IF('Betriebsdaten II'!G8=0,\"\",('Betriebsdaten II'!G8-'Betriebsdaten II'!G10)/'Betriebsdaten II'!G8)","v":""},{"$f":"IF('Betriebsdaten II'!H8=0,\"\",('Betriebsdaten II'!H8-'Betriebsdaten II'!H10)/'Betriebsdaten II'!H8)","v":""},{"$f":"IF('Betriebsdaten II'!I8=0,\"\",('Betriebsdaten II'!I8-'Betriebsdaten II'!I10)/'Betriebsdaten II'!I8)","v":""},{"$f":"IF('Betriebsdaten II'!J8=0,\"\",('Betriebsdaten II'!J8-'Betriebsdaten II'!J10)/'Betriebsdaten II'!J8)","v":""},{"$f":"IF('Betriebsdaten II'!K8=0,\"\",('Betriebsdaten II'!K8-'Betriebsdaten II'!K10)/'Betriebsdaten II'!K8)","v":""},{"$f":"IF('Betriebsdaten II'!L8=0,\"\",('Betriebsdaten II'!L8-'Betriebsdaten II'!L10)/'Betriebsdaten II'!L8)","v":""},{"$f":"IF('Betriebsdaten II'!M8=0,\"\",('Betriebsdaten II'!M8-'Betriebsdaten II'!M10)/'Betriebsdaten II'!M8)","v":""},{"$f":"IF('Betriebsdaten II'!N8=0,\"\",('Betriebsdaten II'!N8-'Betriebsdaten II'!N10)/'Betriebsdaten II'!N8)","v":""},{"$f":"IF('Betriebsdaten II'!O8=0,\"\",('Betriebsdaten II'!O8-'Betriebsdaten II'!O10)/'Betriebsdaten II'!O8)","v":""},{"$f":"IF('Betriebsdaten II'!P8=0,\"\",('Betriebsdaten II'!P8-'Betriebsdaten II'!P10)/'Betriebsdaten II'!P8)","v":""},{"$f":"IF('Betriebsdaten II'!Q8=0,\"\",('Betriebsdaten II'!Q8-'Betriebsdaten II'!Q10)/'Betriebsdaten II'!Q8)","v":""}]
[null,"mittlere Spreizung","K",null,{"$f":"IF(ISBLANK('Betriebsdaten II'!E9),\"-\",'Betriebsdaten II'!E8/(980*'Betriebsdaten II'!E9*4.2/3600))","v":"-"},{"$f":"IF(ISBLANK('Betriebsdaten II'!F9),\"-\",'Betriebsdaten II'!F8/(980*'Betriebsdaten II'!F9*4.2/3600))","v":"-"},{"$f":"IF(ISBLANK('Betriebsdaten II'!G9),\"-\",'Betriebsdaten II'!G8/(980*'Betriebsdaten II'!G9*4.2/3600))","v":"-"},{"$f":"IF(ISBLANK('Betriebsdaten II'!H9),\"-\",'Betriebsdaten II'!H8/(980*'Betriebsdaten II'!H9*4.2/3600))","v":"-"},{"$f":"IF(ISBLANK('Betriebsdaten II'!I9),\"-\",'Betriebsdaten II'!I8/(980*'Betriebsdaten II'!I9*4.2/3600))","v":"-"},{"$f":"IF(ISBLANK('Betriebsdaten II'!J9),\"-\",'Betriebsdaten II'!J8/(980*'Betriebsdaten II'!J9*4.2/3600))","v":"-"},{"$f":"IF(ISBLANK('Betriebsdaten II'!K9),\"-\",'Betriebsdaten II'!K8/(980*'Betriebsdaten II'!K9*4.2/3600))","v":"-"},{"$f":"IF(ISBLANK('Betriebsdaten II'!L9),\"-\",'Betriebsdaten II'!L8/(980*'Betriebsdaten II'!L9*4.2/3600))","v":"-"},{"$f":"IF(ISBLANK('Betriebsdaten II'!M9),\"-\",'Betriebsdaten II'!M8/(980*'Betriebsdaten II'!M9*4.2/3600))","v":"-"},{"$f":"IF(ISBLANK('Betriebsdaten II'!N9),\"-\",'Betriebsdaten II'!N8/(980*'Betriebsdaten II'!N9*4.2/3600))","v":"-"},{"$f":"IF(ISBLANK('Betriebsdaten II'!O9),\"-\",'Betriebsdaten II'!O8/(980*'Betriebsdaten II'!O9*4.2/3600))","v":"-"},{"$f":"IF(ISBLANK('Betriebsdaten II'!P9),\"-\",'Betriebsdaten II'!P8/(980*'Betriebsdaten II'!P9*4.2/3600))","v":"-"},{"$f":"IF(ISBLANK('Betriebsdaten II'!Q9),\"-\",'Betriebsdaten II'!Q8/(980*'Betriebsdaten II'!Q9*4.2/3600))","v":"-"}]
[null,"spezifischer Volumenstrom","m³/MWh",null,{"$f":"IF('Betriebsdaten II'!E8=0,\"\",'Betriebsdaten II'!E9/('Betriebsdaten II'!E8/1000))","v":""},{"$f":"IF('Betriebsdaten II'!F8=0,\"\",'Betriebsdaten II'!F9/('Betriebsdaten II'!F8/1000))","v":""},{"$f":"IF('Betriebsdaten II'!G8=0,\"\",'Betriebsdaten II'!G9/('Betriebsdaten II'!G8/1000))","v":""},{"$f":"IF('Betriebsdaten II'!H8=0,\"\",'Betriebsdaten II'!H9/('Betriebsdaten II'!H8/1000))","v":""},{"$f":"IF('Betriebsdaten II'!I8=0,\"\",'Betriebsdaten II'!I9/('Betriebsdaten II'!I8/1000))","v":""},{"$f":"IF('Betriebsdaten II'!J8=0,\"\",'Betriebsdaten II'!J9/('Betriebsdaten II'!J8/1000))","v":""},{"$f":"IF('Betriebsdaten II'!K8=0,\"\",'Betriebsdaten II'!K9/('Betriebsdaten II'!K8/1000))","v":""},{"$f":"IF('Betriebsdaten II'!L8=0,\"\",'Betriebsdaten II'!L9/('Betriebsdaten II'!L8/1000))","v":""},{"$f":"IF('Betriebsdaten II'!M8=0,\"\",'Betriebsdaten II'!M9/('Betriebsdaten II'!M8/1000))","v":""},{"$f":"IF('Betriebsdaten II'!N8=0,\"\",'Betriebsdaten II'!N9/('Betriebsdaten II'!N8/1000))","v":""},{"$f":"IF('Betriebsdaten II'!O8=0,\"\",'Betriebsdaten II'!O9/('Betriebsdaten II'!O8/1000))","v":""},{"$f":"IF('Betriebsdaten II'!P8=0,\"\",'Betriebsdaten II'!P9/('Betriebsdaten II'!P8/1000))","v":""},{"$f":"IF('Betriebsdaten II'!Q8=0,\"\",'Betriebsdaten II'!Q9/('Betriebsdaten II'!Q8/1000))","v":""}]
[null,"spezifischer Stromverbrauch Netzpumpen","kWhel/MWhtherm",null,{"$f":"IF(SUM(Hilfstabelle!B1:B10)=0,\"\",'Betriebsdaten II'!E19/(SUM(Hilfstabelle!B1:B10)/1000))","v":""},{"$f":"IF(SUM(Hilfstabelle!C1:C10)=0,\"\",'Betriebsdaten II'!F19/(SUM(Hilfstabelle!C1:C10)/1000))","v":""},{"$f":"IF(SUM(Hilfstabelle!D1:D10)=0,\"\",'Betriebsdaten II'!G19/(SUM(Hilfstabelle!D1:D10)/1000))","v":""},{"$f":"IF(SUM(Hilfstabelle!E1:E10)=0,\"\",'Betriebsdaten II'!H19/(SUM(Hilfstabelle!E1:E10)/1000))","v":""},{"$f":"IF(SUM(Hilfstabelle!F1:F10)=0,\"\",'Betriebsdaten II'!I19/(SUM(Hilfstabelle!F1:F10)/1000))","v":""},{"$f":"IF(SUM(Hilfstabelle!G1:G10)=0,\"\",'Betriebsdaten II'!J19/(SUM(Hilfstabelle!G1:G10)/1000))","v":""},{"$f":"IF(SUM(Hilfstabelle!H1:H10)=0,\"\",'Betriebsdaten II'!K19/(SUM(Hilfstabelle!H1:H10)/1000))","v":""},{"$f":"IF(SUM(Hilfstabelle!I1:I10)=0,\"\",'Betriebsdaten II'!L19/(SUM(Hilfstabelle!I1:I10)/1000))","v":""},{"$f":"IF(SUM(Hilfstabelle!J1:J10)=0,\"\",'Betriebsdaten II'!M19/(SUM(Hilfstabelle!J1:J10)/1000))","v":""},{"$f":"IF(SUM(Hilfstabelle!K1:K10)=0,\"\",'Betriebsdaten II'!N19/(SUM(Hilfstabelle!K1:K10)/1000))","v":""},{"$f":"IF(SUM(Hilfstabelle!L1:L10)=0,\"\",'Betriebsdaten II'!O19/(SUM(Hilfstabelle!L1:L10)/1000))","v":""},{"$f":"IF(SUM(Hilfstabelle!M1:M10)=0,\"\",'Betriebsdaten II'!P19/(SUM(Hilfstabelle!M1:M10)/1000))","v":""},{"$f":"IF(SUM(Hilfstabelle!N1:N10)=0,\"\",'Betriebsdaten II'!Q19/(SUM(Hilfstabelle!N1:N10)/1000))","v":""}]

{"sheet":"Hilfe","index":7,"n_rows":52,"n_cols":6,"rows_kept":52,"cut":false,"hidden":false,"merged":[[21,1,21,3],[22,1,22,3],[47,5,47,7],[44,1,44,3],[15,1,15,3],[23,1,23,3],[18,1,18,3],[15,5,15,7],[17,5,17,7],[18,5,18,7],[19,5,19,7],[16,5,16,7],[21,5,21,7],[22,5,22,7],[20,5,20,7],[20,1,20,3],[13,1,13,3],[3,5,3,7],[8,1,8,3],[2,1,2,3],[4,1,4,3],[5,1,5,3],[6,1,6,3],[7,1,7,3],[19,1,19,3],[14,1,14,3],[2,5,2,7],[9,5,9,7],[11,5,11,7],[12,5,12,7],[14,5,14,7],[4,5,4,7],[5,5,5,7],[6,5,6,7],[7,5,7,7],[8,5,8,7],[9,1,9,2],[10,1,10,3],[11,1,11,3],[12,1,12,3],[24,1,24,3],[26,1,26,3],[27,1,27,3],[33,1,33,3],[32,1,32,3],[28,1,28,3],[29,1,29,3],[30,1,30,3],[23,5,23,7],[24,5,24,7],[25,5,25,7],[29,5,29,7],[39,5,39,7],[38,5,38,7],[30,5,30,7],[31,5,31,7],[32,5,32,7],[33,5,33,7],[43,5,43,7],[43,1,43,3],[51,1,51,3],[48,1,48,3],[50,1,50,3],[50,5,50,7],[48,5,48,7],[44,5,45,7],[52,5,52,7],[47,1,47,3],[49,1,49,3],[46,5,46,7],[51,5,51,7],[49,5,49,7],[41,1,41,3],[42,1,42,3],[35,1,35,3],[40,5,40,7],[34,1,34,3],[38,1,38,3],[40,1,40,3],[39,1,39,3],[41,5,42,7]]}
[null,"Erläuterung zur Erstellung von Betriebsberichten"]
[null,"Ablauf",null,null,null,"Wichtige Eingabefelder"]
[null,"- Speichern Sie diese Excel-Datei auf Ihrem Computer.",null,null,null,"- Projektnummer (Titelblatt)"]
[null,"- Aktivieren Sie die BEARBEITUNG und die Excel-MAKROS beim Öffnen der Excel-Datei!",null,null,null,"          - UNBEDINGT ERFORDERLICH, damit der Betriebsbericht dem richtigen Projekt zugeordnet werden kann."]
[null,"- Geben Sie alle erforderlichen Daten in die gelben Eingabefelder ein (Farbe ändert sich nach erfolgter Eingabe)!",null,null,null,"- Welches Projekt, wenn mehrere Ausbauprojekte vorhanden sind?"]
[null,"- Per Klick auf die Schaltfläche \"XML-Datei erstellen\" werden Dateien zum Hochladen erstellt.",null,null,null,"          - Betriebsberichte sind immer für die Gesamtanlage zu erstellen (auch bei Ausbauprojekten)."]
[null,"          - Nur die XML-Dateien können in die QM-Datenbank hochgeladen werden.          ",null,null,null,"          - Jedes Kalender- bzw. Betriebsjahr ist pro Anlage NUR EINMAL ZU ERFASSEN."]
[null,"          - Für die Betriebsdaten und die Abnehmerverbräuche werden separate Dateien erstellt.",null,null,null,"          - Im Betriebsbericht müssen ALLE Abnehmer aufscheinen, die in diesem Betriebsjahr Wärme bezogen haben."]
[null,"          - XML-Dateien werden am gleichen Ort wie die Excel-Datei gespeichert.        ",null,null,null,"          - Der Betriebsbericht muss in dem Ausbauprojekt hochgeladen werden, wo diese Abnehmer bereits erfasst sind."]
[null,"- Erstellen und Hochladen eines Betriebsberichtes in die QM-Datenbank",null,"https://qm-datenbank.at/",null,"- Betriebsberichtsjahr und Anfangsmonat (Titelblatt)"]
[null,"          - In der QM-Datenbank Menüpunkt \"Betriebsbericht-Betriebsbericht NEU\" auswählen",null,null,null,"          - Betriebsberichte können entweder für ein Kalenderjahr ODER ein Betriebsjahr (Betriebsperiode) erstellt werden."]
[null,"          - Die erstellte XML-Datei \"Betriebsbericht\" auswählen und hochladen",null,null,null,"          - Ein Betriebsjahr ist ein Zeitraum von 12 Monaten mit beliebigem Anfangsmonat."]
[null,"          - Beim Hochladen wird automatisch ein neuer Betriebsbericht in der Datenbank erstellt.",null,null,null,"          - Als Betriebsberichtsjahr ist das Jahr anzulegen, in dem der Anfangsmonat des Betriebsjahres liegt."]
[null,"          - Überprüfen Sie nach dem Hochladen die Daten in der QM-Datenbank.",null,null,null,"          - Beispiel: Beginn des Betriebsjahres 06/2016: Betriebsberichtsjahr ist dann 2016 (beinhaltet Betriebsdaten von 06/2016 - 05/2017)"]
[null,"          - Durch Klick auf \"Abschließen\", wird der Betriebsbericht endgültig übermittelt.",null,null,null,"- Komponentennummer (Betriebsdaten I)"]
[null,"          - Nur abgeschlossene Betrichsberichte werden anerkannt!",null,null,null,"          - Jeder Wärmeerzeuger MUSS in der QM-Datenbank als \"Anlagenkomponente\" angelegt sein!"]
[null,null,null,null,null,"          - Jede Anlagenkomponente in der QM-Datenbank (siehe Blatt \"Anlagenkomponenten\") bekommt eine fortlaufende KOMPONENTENNUMMER."]
[null,"Prüfung der Eingabe und Fehlermeldungen",null,null,null,"          - Jeder Wärmeerzeuger (der Wärme produziert hat) MUSS im Betriebsbericht erfasst werden."]
[null,"- Beim Erstellen der XML-Datei werden die Eingaben automatisch geprüft.",null,null,null,"          - In der Excel-Betriebsberichtsvorlage MUSS DIESE KOMPONENTENNUMMER eingetragen werden."]
[null,"- Per Klick auf die Schaltfläche \"Fehlerprüfung\" können die Eingaben vorab geprüft werden.",null,null,null,"          - Nur dann können die Wärmemengen richtig zugeordnet werden!"]
[null,"          - Bei Fehlern wird KEINE XML-Datei erstellt.",null,null,null,"- Abnehmernummer (Abnehmerverbräuche)"]
[null,"- Unvollständige Eingaben und Fehler werden angezeigt:",null,null,null,"          - Bei der Erstellung der Abnehmerliste in der QM-Datenbank vergibt der Betreiber eine eindeutige Abnehmernummer."]
[null,"          - Liste mit Fehlermeldungen (mit Doppelklick springt man zur betroffenen Eingabezelle)",null,null,null,"          - Diese Abnehmernummer ist auch bei der Erfassung der Abnehmerverbräuche zu verwenden."]
[null,"          - Zellen mit fehlenden oder falschen Eingaben werden ROT markiert.",null,null,null,"          - Nur so können die Abnehmerverbräuche richtig zugeordnet werden."]
[null,"- Prüfung beim Hochladen in die QM-Datenbank",null,null,null,"          - Die Abnehmernummern findet man in der Abnehmeliste - relevant sind nur die letzten drei Stellen (fortlaufende Nummer)."]
[null,"          - Grundvoraussetzung ist die richtige Projektnummer!",null,null,null,"          - Die Abnehmerliste kann unter Menüpunkt \"Extras-Formulare\" aus der QM-Datenbank exportiert werden."]
[null,"          - Fehlerfrei erstellte XML-Dateien sollten problemlos in die QB-Datenbank hochgeladen werden können.",null,null,null,"- Emissionsmessungen sind dem letzten vorliegenden Messgutachten zu entnehmen."]
[null,"          - Tritt dennoch ein Fehler auf, beachten Sie die Fehlermeldung und korrigieren Sie die Eingaben.",null,null,null,"          - Periodische Messungen sind entsprechend behördlichen Vorgaben durchzuführen."]
[null,"- Bereits hochgeladene Betriebsberichte können durch erneutes Hochladen überschrieben werden.",null,null,null,"          - Bei typengeprüften (klein-)Kesseln sind keine Emissionswerte erforderlich (0 eintragen)."]
[null,"- Bereits hochgeladene Betriebsberichte können gelöscht werden.",null,null,null,"- Wärmepreise - Eingabe typischer Wärmepreise für Privatkunden < 25kW"]
[null,"- Beim Abschluss von Betriebsberichten erfolgt gleich wie in der Excel-Vorlagen eine Plausibilitätsprüfung der Eingaben.",null,null,null,"          - Grundpreis in €/a; Bitte järhliche Grundkosten für einen typischen Kunden (25kW) angeben (ggf. von €/kW umrechnen)."]
[null,"          - Abnehmerverbräuche müssen vollständig vorhanden sein.",null,null,null,"          - Messpreis in €/a; Bitte järhliche Messkosten für einen typischen Kunden (25kW) angeben (ggf. von €/Monat, €/kW, … umrechnen)."]
[null,"          - Komponenten- und Abnehmernummern müssen übereinstimmen.",null,null,null,"          - Arbeitspreis (Energiepreis) in €/kWh"]
[null,"          - Summe der Monatswerte müssen den Jahreswerten entsprechen (Toleranz wird berücksichtigt).",null,null,null,"- Preisindex: Angabe der verwendeten Preisindexierung inkl. Bezugsjahr und Gewichtung"]
[null,"          - Die eingespeiste Wärmemenge (+ druckloser Verteiler) darf nicht größer sein als die Summe der Wärmeproduktion.",null,null,null,"- Heizwerksbetreuung: Personalkosten für Heizwerksbetreuung (Anlagenbetrieb)"]
[null,"          - Summe der Abnehmerverbräuche muss gleich wie die Jahressumme der Abnehmer am Netz (Gesamtwärmeverkauf) sein.",null,null,null,"- Kosten Verwaltung: Personalkosten für alle Verwaltungsaufgaben (Einkauf, Abrechnung, sonstige Tätigkeiten, inkl. externer Leistungen)."]
[]
[null,"Mindestanforderungen",null,null,null,"Tipps und Tricks"]
[null,"- Das Erstellen und Hochladen jähricher Betriebsberichte ist im Rahmen der Umweltförderung im Inland verpflichtend.",null,null,null,"- Verwenden Sie immer die aktuellste Betriebsberichtsvorlage (wird beim Hochladen geprüft)."]
[null,"- Sie sind als Nachweis für Betrieb und CO2-Einsparung der Anlage gegenüber den Förderstellen erforderlich!",null,null,null,"- Aktivieren Sie die Excel-MAKROS beim Öffnen der Excel-Datei!"]
[null,"- Die Betreiberin/der Betreiber haben für eine entsprechende Datenaufzeichnung zu sorgen!",null,null,null,"- Die Excel-Vorlage darf NICHT VERÄNDERT werden!"]
[null,"- Das Titelblatt, die Betriebsdaten I & II sind entsprechend der vorgegebenen Eingabemaske VOLLSTÄNDIG auszufüllen!",null,null,null,"- Beim Kopieren/Einfügen von Daten (z.B. aus anderen Excel-Dateien) bitte die Funktion \"Einfügen-nur Werte\" verwenden und\n   KEINE Formatierungen kopieren."]
[null,"      - Emissionswerte für typengeprüfte (Klein-)Kessel können entfallen."]
[null,"- Abnehmerverbräuche sind verpflichtend anzugeben (Nachweis der CO2-Einsparung!!) - Pflichtspalten sind gekennzeichnet.",null,null,null,"- Die Eingabe von Dezimalzahlen ist möglich. Wärmemengen, Stromverbräuche und Volumenströme werden jedoch automatisch gerundet."]
[null,"- Fehlen verpflichtend anzugebende Daten, kontaktieren Sie bitte das Team von AEE INTEC und der KPC (Kontaktdaten siehe unten).",null,null,null,"- KWK-Anlagen mit der richtigen Komponentennummer und der ausgekoppelten Wärmemenge im Blatt \"Betriebsdaten I\" erfassen. \n   Bei Bedarf können Zusatzangaben zum Stromverbrauch nach dem Hochladen direkt in der QM-Datenbank ergänzt werden."]
[]
[null,"Weiterführende Hilfe",null,null,null,"- BEACHTEN SIE DIE HINWEISE UND FEHLERMELDUNGEN!"]
[null,"Kontaktieren Sie das klimaaktiv QM Heizwerke - Team von AEE INTEC für alle Fragen zu:",null,null,null,"- XML – Dateien können mit Text-Editoren und herkömmlichen Browsern geöffnet und bearbeitet werden."]
[null,"          - allgemeinem Ablauf, Projektzuordnung, Mindestanforderungen und der Excel-Vorlage",null,null,null,"- ACHTUNG: Änderungen an der Datenstruktur der XML-Datei ergeben Fehler beim Hochladen."]
[null,"          - qm-heizwerke@aee.at, 03112 5886 -234 oder -262",null,null,null,"- XML-Dateien können auch direkt aus anderen Quellen (Anlagenregelung, Datenerfassungssoftware, eigene Programme) erstellt werden."]
[null,"- Kontaktieren sie das QM-Team der KPC für alle Fragen zum Hochladen des Betriebsberichtes in die QM-Datenbank.",null,null,null,"          - Manche Regelungs- und Softwarehersteller haben entsprechende Schnittstellen integriert."]
[null,"          - qm@kommunalkredit.at, 01 31631 739",null,null,null,"          - Die extern erstellte XML-Datei MUSS die gleiche Datenstruktur aufweisen!"]

{"sheet":"DatenTransformierung","index":8,"n_rows":15,"n_cols":220,"rows_kept":15,"cut":false,"hidden":true,"merged":[]}
["JahrMonat","/Biomasse1/Text","/Biomasse1/ID","/Biomasse1/WM","/Biomasse2/Text","/Biomasse2/ID","/Biomasse2/WM","/Biomasse3/Text","/Biomasse3/ID","/Biomasse3/WM","/Öl1/Text","/Öl1/ID","/Öl1/WM","/Öl1/BH","/Gas1/Text","/Gas1/ID","/Gas1/WM","/Gas1/BH","/Sonstige1/Text","/Sonstige1/ID","/Sonstige1/WM","/Sonstige2/Text","/Sonstige2/ID","/Sonstige2/WM","/Sonstige3/Text","/Sonstige3/ID","/Sonstige3/WM","/Sonstige4/Text","/Sonstige4/ID","/Sonstige4/WM","/Sonstige5/Text","/Sonstige5/ID","/Sonstige5/WM","/Emissionen1/Text","/Emissionen1/ID","/Emissionen1/O213","/Emissionen1/O2","/Emissionen1/CO","/Emissionen1/NOx","/Emissionen1/CxHy","/Emissionen1/Staub","/Emissionen1/O213_TL","/Emissionen1/O2_TL","/Emissionen1/CO_TL","/Emissionen1/NOx_TL","/Emissionen1/CxHy_TL","/Emissionen1/Staub_TL","/Emissionen2/Text","/Emissionen2/ID","/Emissionen2/O213","/Emissionen2/O2","/Emissionen2/CO","/Emissionen2/NOx","/Emissionen2/CxHy","/Emissionen2/Staub","/Emissionen2/O213_TL","/Emissionen2/O2_TL","/Emissionen2/CO_TL","/Emissionen2/NOx_TL","/Emissionen2/CxHy_TL","/Emissionen2/Staub_TL","/Emissionen3/Text","/Emissionen3/ID","/Emissionen3/O213","/Emissionen3/O2","/Emissionen3/CO","/Emissionen3/NOx","/Emissionen3/CxHy","/Emissionen3/Staub","/Emissionen3/O213_TL","/Emissionen3/O2_TL","/Emissionen3/CO_TL","/Emissionen3/NOx_TL","/Emissionen3/CxHy_TL","/Emissionen3/Staub_TL","WMEingespart","VolumenNetzgefoerdert","WMAbnehmerNetz","WMEigenverbrauch","EVerbrauchWE_ID1","EVerbrauchWE_ID2","EVerbrauchWE_ID3","EVerbrauchWE1","EVerbrauchWE2","EVerbrauchWE3","EVerbrauchNetzPumpe","EVerbrauchEFilter","EVerbrauchSonstige_ID","EVerbrauchSonstige","EVerbrauchGesamt","/Brennstoffeinsatz1/Brennstoffart","/Brennstoffeinsatz1/Einheit","/Brennstoffeinsatz1/Menge","/Brennstoffeinsatz1/PreisEinheit","/Brennstoffeinsatz2/Brennstoffart","/Brennstoffeinsatz2/Einheit","/Brennstoffeinsatz2/Menge","/Brennstoffeinsatz2/PreisEinheit","/Brennstoffeinsatz3/Brennstoffart","/Brennstoffeinsatz3/Einheit","/Brennstoffeinsatz3/Menge","/Brennstoffeinsatz3/PreisEinheit","/Brennstoffeinsatz4/Brennstoffart","/Brennstoffeinsatz4/Einheit","/Brennstoffeinsatz4/Menge","/Brennstoffeinsatz4/PreisEinheit","/Brennstoffeinsatz5/Brennstoffart","/Brennstoffeinsatz5/Einheit","/Brennstoffeinsatz5/Menge","/Brennstoffeinsatz5/PreisEinheit","/Brennstoffeinsatz6/Brennstoffart","/Brennstoffeinsatz6/Einheit","/Brennstoffeinsatz6/ID","/Brennstoffeinsatz6/Menge","/Brennstoffeinsatz6/PreisEinheit","/Brennstoffeinsatz7/Brennstoffart","/Brennstoffeinsatz7/Einheit","/Brennstoffeinsatz7/ID","/Brennstoffeinsatz7/Menge","/Brennstoffeinsatz7/PreisEinheit","/Reststoffe/Asche","/Reststoffe/Kondensatschlamm","/Analyse/pHWert","/Analyse/Haertegrad","/Analyse/Chloride","/Analyse/Eisen","/Analyse/Kupfer","/Analyse/Aluminium","/Analyse/Ammonium","Grundpreis","Messpreis","Arbeitspreis","PreisIndex1Name","PreisIndex1BasisJahr","PreisIndex1Gewichtung","PreisIndex2Name","PreisIndex2BasisJahr","PreisIndex2Gewichtung","Heizwerkbetreuung","Heizwerkverwaltung","InvestitionenText","Investitionen","WartungText","Wartung","StoerungenText","GeplanteWartungText","/Anmerkung/Waermemenge","/Anmerkung/Brennstoffeinsatz","/Anmerkung/BetriebsoptimierungText","/Anmerkung/Messergebnisse","/Anmerkung/Waermepreis","/Anmerkung/Heizwerkbetreuung","/Anmerkung/Heizwerkverwaltung","/Anmerkung/Investitionen","/Anmerkung/Wartung","/Anmerkung/KWK","AenderungenQMDaten",null,null,null,null,null,null,"/KWK1/Text","/KWK1/ID","/KWK1/BSW","/KWK1/Strom","/KWK1/WM","/KWK2/Text","/KWK2/ID","/KWK2/BSW","/KWK2/Strom","/KWK2/WM","/KWK3/Text","/KWK3/ID","/KWK3/BSW","/KWK3/Strom","/KWK3/WM","/EmissionenKWK1/Text","/EmissionenKWK1/ID","/EmissionenKWK1/O213","/EmissionenKWK1/O2","/EmissionenKWK1/CO","/EmissionenKWK1/NOx","/EmissionenKWK1/CxHy","/EmissionenKWK1/Staub","/EmissionenKWK1/O213_TL","/EmissionenKWK1/O2_TL","/EmissionenKWK1/CO_TL","/EmissionenKWK1/NOx_TL","/EmissionenKWK1/CxHy_TL","/EmissionenKWK1/Staub_TL","/EmissionenKWK2/Text","/EmissionenKWK2/ID","/EmissionenKWK2/O213","/EmissionenKWK2/O2","/EmissionenKWK2/CO","/EmissionenKWK2/Nox","/EmissionenKWK2/CxHy","/EmissionenKWK2/Staub","/EmissionenKWK2/O213_TL","/EmissionenKWK2/O2_TL","/EmissionenKWK2/CO_TL","/EmissionenKWK2/NOx_TL","/EmissionenKWK2/CxHy_TL","/EmissionenKWK2/Staub_TL","/EmissionenKWK3/Text","/EmissionenKWK3/ID","/EmissionenKWK3/O213","/EmissionenKWK3/O2","/EmissionenKWK3/CO","/EmissionenKWK3/Nox","/EmissionenKWK3/CxHy","/EmissionenKWK3/Staub","/EmissionenKWK3/O213_TL","/EmissionenKWK3/O2_TL","/EmissionenKWK3/CO_TL","/EmissionenKWK3/NOx_TL","/EmissionenKWK3/CxHy_TL","/EmissionenKWK3/Staub_TL"]
["2030-01-01",null,null,null,null,null,null,null,null,null,null,1,1000,null,null,2,2000,null,null,3,1,null,4,2,null,5,3,null,6,4,null,7,5,null,null,null,null,null,null,null,null,null,null,null,null,null,null,null,null,null,null,null,null,null,null,null,null,null,null,null,null,null,null,null,null,null,null,null,null,null,null,null,null,null,null,0,null,0,null,"","","",null,null,null,null,null,null,null,0]
["2030-02-01",null,null,null,null,null,null,null,null,null,null,1,1000,null,null,2,2000,null,null,3,1,null,4,2,null,5,3,null,6,4,null,7,5,null,null,null,null,null,null,null,null,null,null,null,null,null,null,null,null,null,null,null,null,null,null,null,null,null,null,null,null,null,null,null,null,null,null,null,null,null,null,null,null,null,null,0,null,0,null,"","","",null,null,null,null,null,null,null,0]
["2030-03-01",null,null,null,null,null,null,null,null,null,null,1,1000,null,null,2,2000,null,null,3,1,null,4,2,null,5,3,null,6,4,null,7,5,null,null,null,null,null,null,null,null,null,null,null,null,null,null,null,null,null,null,null,null,null,null,null,null,null,null,null,null,null,null,null,null,null,null,null,null,null,null,null,null,null,null,0,null,0,null,"","","",null,null,null,null,null,null,null,0]
["2030-04-01",null,null,null,null,null,null,null,null,null,null,1,1000,null,null,2,2000,null,null,3,1,null,4,2,null,5,3,null,6,4,null,7,5,null,null,null,null,null,null,null,null,null,null,null,null,null,null,null,null,null,null,null,null,null,null,null,null,null,null,null,null,null,null,null,null,null,null,null,null,null,null,null,null,null,null,0,null,0,null,"","","",null,null,null,null,null,null,null,0]
["2030-05-01",null,null,null,null,null,null,null,null,null,null,1,1000,null,null,2,2000,null,null,3,1,null,4,2,null,5,3,null,6,4,null,7,5,null,null,null,null,null,null,null,null,null,null,null,null,null,null,null,null,null,null,null,null,null,null,null,null,null,null,null,null,null,null,null,null,null,null,null,null,null,null,null,null,null,null,0,null,0,null,"","","",null,null,null,null,null,null,null,0]
["2030-06-01",null,null,null,null,null,null,null,null,null,null,1,1000,null,null,2,2000,null,null,3,1,null,4,2,null,5,3,null,6,4,null,7,5,null,null,null,null,null,null,null,null,null,null,null,null,null,null,null,null,null,null,null,null,null,null,null,null,null,null,null,null,null,null,null,null,null,null,null,null,null,null,null,null,null,null,0,null,0,null,"","","",null,null,null,null,null,null,null,0]
["2030-07-01",null,null,null,null,null,null,null,null,null,null,1,1000,null,null,2,2000,null,null,3,1,null,4,2,null,5,3,null,6,4,null,7,5,null,null,null,null,null,null,null,null,null,null,null,null,null,null,null,null,null,null,null,null,null,null,null,null,null,null,null,null,null,null,null,null,null,null,null,null,null,null,null,null,null,null,0,null,0,null,"","","",null,null,null,null,null,null,null,0]
["2030-08-01",null,null,null,null,null,null,null,null,null,null,1,1000,null,null,2,2000,null,null,3,1,null,4,2,null,5,3,null,6,4,null,7,5,null,null,null,null,null,null,null,null,null,null,null,null,null,null,null,null,null,null,null,null,null,null,null,null,null,null,null,null,null,null,null,null,null,null,null,null,null,null,null,null,null,null,0,null,0,null,"","","",null,null,null,null,null,null,null,0]
["2030-09-01",null,null,null,null,null,null,null,null,null,null,1,1000,null,null,2,2000,null,null,3,1,null,4,2,null,5,3,null,6,4,null,7,5,null,null,null,null,null,null,null,null,null,null,null,null,null,null,null,null,null,null,null,null,null,null,null,null,null,null,null,null,null,null,null,null,null,null,null,null,null,null,null,null,null,null,0,null,0,null,"","","",null,null,null,null,null,null,null,0]
["2030-10-01",null,null,null,null,null,null,null,null,null,null,1,1000,null,null,2,2000,null,null,3,1,null,4,2,null,5,3,null,6,4,null,7,5,null,null,null,null,null,null,null,null,null,null,null,null,null,null,null,null,null,null,null,null,null,null,null,null,null,null,null,null,null,null,null,null,null,null,null,null,null,null,null,null,null,null,0,null,0,null,"","","",null,null,null,null,null,null,null,0]
["2030-11-01",null,null,null,null,null,null,null,null,null,null,1,1000,null,null,2,2000,null,null,3,1,null,4,2,null,5,3,null,6,4,null,7,5,null,null,null,null,null,null,null,null,null,null,null,null,null,null,null,null,null,null,null,null,null,null,null,null,null,null,null,null,null,null,null,null,null,null,null,null,null,null,null,null,null,null,0,null,0,null,"","","",null,null,null,null,null,null,null,0]
["2030-12-01",null,null,null,null,null,null,null,null,null,null,1,1000,null,null,2,2000,null,null,3,1,null,4,2,null,5,3,null,6,4,null,7,5,null,null,null,null,null,null,null,null,null,null,null,null,null,null,null,null,null,null,null,null,null,null,null,null,null,null,null,null,null,null,null,null,null,null,null,null,null,null,null,null,null,null,0,null,0,null,"","","",null,null,null,null,null,null,null,0]
[203000,null,null,null,null,null,null,null,null,null,"Oel",1,12000,null,"Gas",2,24000,null,"Sonstige 3",3,12,"Sonstige 4",4,24,"Sonstige 5",5,36,"Sonstige 6",6,48,"Sonstige 7",7,60,null,null,null,null,null,null,null,null,null,null,null,null,null,null,null,null,null,null,null,null,null,null,null,null,null,null,null,null,null,null,null,null,null,null,null,null,null,null,null,null,null,null,3000,null,2400,null,"","","",null,null,null,null,null,null,null,800]
[null,null,null,null,null,null,null,null,null,null,null,null,null,null,null,null,null,null,null,null,null,null,null,null,null,null,null,null,null,null,null,null,null,null,"",null,0,0,0,0,0,null,0,0,0,0,0,null,"",null,0,0,0,0,0,null,0,0,0,0,0,null,"",null,0,0,0,0,0,null,0,0,0,0,0,null,null,null,null,null,null,null,null,null,null,null,null,null,null,null,"fein WS-P16S-M20-WH ","srm",1000,15,null,null,null,null,null,null,null,null,null,null,null,null,null,null,null,null,null,null,null,null,null,null,null,null,null,null,null,null,null,null,null,null,null,null,null,null,null,null,null,null,null,null,null,null,null,null,null,null,null,null,null,null,null,null,null,null,null,null,null,null,null,null,null,null,null,null,null,null,null,null,null,null,null,null,null,null,null,null,null,null,null,null,null,null,null,"",null,"","","","","",null,"","","","","",null,"",null,"","","","","",null,"","","","","",null,"",null,"","","","","",null,"","","","",""]

{"sheet":"DatenTransformierung2","index":9,"n_rows":2,"n_cols":9,"rows_kept":2,"cut":false,"hidden":true,"merged":[]}
[]
["Abn.\n - Nr.","Liegenschafts-bezeichnung","Verbrauch","Zählerstand","Volumen","Zählerstand \nVolumen","Änderungs- \nAblesedatum","Vorlauf- \ntemperatur Mittel","Rücklauf- \ntemperatur Mittel"]

{"sheet":"Brennstoff","index":10,"n_rows":76,"n_cols":3,"rows_kept":76,"cut":false,"hidden":false,"merged":[]}
[null,"Brennstoffbezeichnungen für Brennstoffauswahl"]
[]
[null,"Qualitäts-Hackschnitzel aus Waldrest(rund)holz ","fein WS-P16S-M20-WH "]
[null,"Qualitäts-Hackschnitzel aus Waldrest(rund)holz ","grob WS-P16S-M21-WH"]
[null,"Qualitäts-Hackschnitzel aus Industrierestholz ","fein IS-P16S-M20-WH"]
[null,"Qualitäts-Hackschnitzel aus Industrierestholz ","grob IS-P16S-M21-WH"]
[null,"Qualitäts-Hackschnitzel aus Waldrest(rund)holz ","fein WS-P16S-M20-HH "]
[null,"Qualitäts-Hackschnitzel aus Waldrest(rund)holz ","grob WS-P16S-M21-HH"]
[null,"Qualitäts-Hackschnitzel aus Industrierestholz ","fein IS-P16S-M20-HH"]
[null,"Qualitäts-Hackschnitzel aus Industrierestholz ","grob IS-P16S-M21-HH"]
[null,"Hackschnitzel aus Waldrestholz","WS-P31S-M35-WH"]
[null,"Hackschnitzel aus Waldrestholz","WS-P31S-M50-WH"]
[null,"Hackschnitzel aus Waldrestholz","WS-P31S-M55+-WH"]
[null,"Hackschnitzel aus Waldrestholz","WS-P45S-M35-WH"]
[null,"Hackschnitzel aus Waldrestholz","WS-P45S-M50-WH"]
[null,"Hackschnitzel aus Waldrestholz","WS-P45S-M55+-WH"]
[null,"Hackschnitzel aus Waldrestholz","WS-P63-M50-WH"]
[null,"Hackschnitzel aus Waldrestholz","WS-P63-M55+-WH"]
[null,"Hackschnitzel aus Waldrestholz","WS-P31S-M35-HH"]
[null,"Hackschnitzel aus Waldrestholz","WS-P31S-M50-HH"]
[null,"Hackschnitzel aus Waldrestholz","WS-P31S-M55+-HH"]
[null,"Hackschnitzel aus Waldrestholz","WS-P45S-M35-HH"]
[null,"Hackschnitzel aus Waldrestholz","WS-P45S-M50-HH"]
[null,"Hackschnitzel aus Waldrestholz","WS-P45S-M55+-HH"]
[null,"Hackschnitzel aus Waldrestholz","WS-P63-M50-HH"]
[null,"Hackschnitzel aus Waldrestholz","WS-P63-M55+-HH"]
[null,"Hackschnitzel aus Industrierestholz","IS-P31S-M35-WH"]
[null,"Hackschnitzel aus Industrierestholz","IS-P31S-M50-WH"]
[null,"Hackschnitzel aus Industrierestholz","S-P31S-M55+-WH"]
[null,"Hackschnitzel aus Industrierestholz","IS-P45S-M35-WH"]
[null,"Hackschnitzel aus Industrierestholz","IS-P45S-M50-WH"]
[null,"Hackschnitzel aus Industrierestholz","IS-P45S-M55+-WH"]
[null,"Hackschnitzel aus Industrierestholz","IS-P63-M50-WH"]
[null,"Hackschnitzel aus Industrierestholz","IS-P63-M55+-WH"]
[null,"Hackschnitzel aus Industrierestholz","IS-P31S-M35-HH"]
[null,"Hackschnitzel aus Industrierestholz","IS-P31S-M50-HH"]
[null,"Hackschnitzel aus Industrierestholz","S-P31S-M55+-HH"]
[null,"Hackschnitzel aus Industrierestholz","IS-P45S-M35-HH"]
[null,"Hackschnitzel aus Industrierestholz","IS-P45S-M50-HH"]
[null,"Hackschnitzel aus Industrierestholz","IS-P45S-M55+-HH"]
[null,"Hackschnitzel aus Industrierestholz","IS-P63-M50-HH"]
[null,"Hackschnitzel aus Industrierestholz","IS-P63-M55+-HH"]
[null,"Pappeln und Weiden aus Wald und Landschaft","PWW-31S"]
[null,"Pappeln und Weiden aus Wald und Landschaft","PWW-45S"]
[null,"Pappeln und Weiden aus Wald und Landschaft","PWW-63"]
[null,"Pappeln und Weiden aus Kurzumtriebsflächen","PWK-31"]
[null,"Pappeln und Weiden aus Kurzumtriebsflächen","PWK-45"]
[null,"Pappeln und Weiden aus Kurzumtriebsflächen","PWK-63"]
[null,"Holz aus Landschaftspflege","LH-31"]
[null,"Holz aus Landschaftspflege","LH-45"]
[null,"Holz aus Landschaftspflege","LH-63"]
[null,"Durchforstungsrestholz von Nadel- und Laubbäumen ∅ <80 mm und Kronenholz","DH-31-WH"]
[null,"Durchforstungsrestholz von Nadel- und Laubbäumen ∅ <80 mm und Kronenholz","DH-45-WH"]
[null,"Durchforstungsrestholz von Nadel- und Laubbäumen ∅ <80 mm und Kronenholz","DH-63-WH"]
[null,"Durchforstungsrestholz von Nadel- und Laubbäumen ∅ <80 mm und Kronenholz","DH-31-HH"]
[null,"Durchforstungsrestholz von Nadel- und Laubbäumen ∅ <80 mm und Kronenholz","DH-45-HH"]
[null,"Durchforstungsrestholz von Nadel- und Laubbäumen ∅ <80 mm und Kronenholz","DH-63-HH"]
[null,"Sägespäne","SP-WH"]
[null,"Sägespäne","SP-HH"]
[null,"Rinde zerkleinert max. Grobanteil 5%","Rz-45-WH"]
[null,"Rinde zerkleinert max. Grobanteil 5%","Rz-63-WH"]
[null,"Rinde zerkleinert max. Grobanteil 5%","Rz-45-HH"]
[null,"Rinde zerkleinert max. Grobanteil 5%","Rz-63-HH"]
[null,"Rinde unzerkleinert","Ruz"]
[null,"Restholz aus der Holzverarbeitung","RHH"]
[null,"Altholz","AH-45"]
[null,"Altholz","AH-63"]
[null,"Pellets","PEL"]
[null,"Holz undefiniert","UH"]
[null,"Stroh","Stroh"]
[null,"Pflanzenoel","POEL"]
[null,"Biodiesel","RME-OEL"]
[null,"Miscanthus","Misc"]
[null,"Heizöl","Heizöl"]
[null,"Erdgas","Erdgas"]
[null,"Biogas","Biogas"]

{"sheet":"Hilfstabelle","index":11,"n_rows":70,"n_cols":19,"rows_kept":70,"cut":false,"hidden":true,"merged":[[0,15,0,18]]}
[{"$f":"Auswertung_I!G6","v":""},{"$f":"'Betriebsdaten I'!E7","v":0},{"$f":"'Betriebsdaten I'!F7","v":0},{"$f":"'Betriebsdaten I'!G7","v":0},{"$f":"'Betriebsdaten I'!H7","v":0},{"$f":"'Betriebsdaten I'!I7","v":0},{"$f":"'Betriebsdaten I'!J7","v":0},{"$f":"'Betriebsdaten I'!K7","v":0},{"$f":"'Betriebsdaten I'!L7","v":0},{"$f":"'Betriebsdaten I'!M7","v":0},{"$f":"'Betriebsdaten I'!N7","v":0},{"$f":"'Betriebsdaten I'!O7","v":0},{"$f":"'Betriebsdaten I'!P7","v":0},{"$f":"WM_BM_1Jahr","v":0},null,"Programmierung"]
[{"$f":"Auswertung_I!G7","v":""},{"$f":"'Betriebsdaten I'!E8","v":0},{"$f":"'Betriebsdaten I'!F8","v":0},{"$f":"'Betriebsdaten I'!G8","v":0},{"$f":"'Betriebsdaten I'!H8","v":0},{"$f":"'Betriebsdaten I'!I8","v":0},{"$f":"'Betriebsdaten I'!J8","v":0},{"$f":"'Betriebsdaten I'!K8","v":0},{"$f":"'Betriebsdaten I'!L8","v":0},{"$f":"'Betriebsdaten I'!M8","v":0},{"$f":"'Betriebsdaten I'!N8","v":0},{"$f":"'Betriebsdaten I'!O8","v":0},{"$f":"'Betriebsdaten I'!P8","v":0},{"$f":"WM_BM_2Jahr","v":0},null,"Bezeichnung","Wert","Anmerkung"]
[{"$f":"Auswertung_I!G8","v":""},{"$f":"'Betriebsdaten I'!E9","v":0},{"$f":"'Betriebsdaten I'!F9","v":0},{"$f":"'Betriebsdaten I'!G9","v":0},{"$f":"'Betriebsdaten I'!H9","v":0},{"$f":"'Betriebsdaten I'!I9","v":0},{"$f":"'Betriebsdaten I'!J9","v":0},{"$f":"'Betriebsdaten I'!K9","v":0},{"$f":"'Betriebsdaten I'!L9","v":0},{"$f":"'Betriebsdaten I'!M9","v":0},{"$f":"'Betriebsdaten I'!N9","v":0},{"$f":"'Betriebsdaten I'!O9","v":0},{"$f":"'Betriebsdaten I'!P9","v":0},{"$f":"WM_BM_3Jahr","v":0},null,"Status Schutz",null,"0…inaktiv; 1….aktiv"]
[{"$f":"Auswertung_I!G9","v":""},{"$f":"'Betriebsdaten I'!E13","v":0},{"$f":"'Betriebsdaten I'!F13","v":0},{"$f":"'Betriebsdaten I'!G13","v":0},{"$f":"'Betriebsdaten I'!H13","v":0},{"$f":"'Betriebsdaten I'!I13","v":0},{"$f":"'Betriebsdaten I'!J13","v":0},{"$f":"'Betriebsdaten I'!K13","v":0},{"$f":"'Betriebsdaten I'!L13","v":0},{"$f":"'Betriebsdaten I'!M13","v":0},{"$f":"'Betriebsdaten I'!N13","v":0},{"$f":"'Betriebsdaten I'!O13","v":0},{"$f":"'Betriebsdaten I'!P13","v":0},{"$f":"WM_Sonstige_1Jahr","v":0},null,"Status Fehler",0,"0… kein Fehler, 1 …. Fehler"]
[{"$f":"Auswertung_I!G10","v":""},{"$f":"'Betriebsdaten I'!E14","v":0},{"$f":"'Betriebsdaten I'!F14","v":0},{"$f":"'Betriebsdaten I'!G14","v":0},{"$f":"'Betriebsdaten I'!H14","v":0},{"$f":"'Betriebsdaten I'!I14","v":0},{"$f":"'Betriebsdaten I'!J14","v":0},{"$f":"'Betriebsdaten I'!K14","v":0},{"$f":"'Betriebsdaten I'!L14","v":0},{"$f":"'Betriebsdaten I'!M14","v":0},{"$f":"'Betriebsdaten I'!N14","v":0},{"$f":"'Betriebsdaten I'!O14","v":0},{"$f":"'Betriebsdaten I'!P14","v":0},{"$f":"WM_Sonstige_2Jahr","v":0},null,"Status Fehler",1,"0… kein Fehler, 1 …. Fehler"]
[{"$f":"Auswertung_I!G11","v":""},{"$f":"'Betriebsdaten I'!E15","v":0},{"$f":"'Betriebsdaten I'!F15","v":0},{"$f":"'Betriebsdaten I'!G15","v":0},{"$f":"'Betriebsdaten I'!H15","v":0},{"$f":"'Betriebsdaten I'!I15","v":0},{"$f":"'Betriebsdaten I'!J15","v":0},{"$f":"'Betriebsdaten I'!K15","v":0},{"$f":"'Betriebsdaten I'!L15","v":0},{"$f":"'Betriebsdaten I'!M15","v":0},{"$f":"'Betriebsdaten I'!N15","v":0},{"$f":"'Betriebsdaten I'!O15","v":0},{"$f":"'Betriebsdaten I'!P15","v":0},{"$f":"WM_Sonstige_3Jahr","v":0},null,"Bezug O2",11,10,6]
[{"$f":"Auswertung_I!G12","v":""},{"$f":"'Betriebsdaten I'!E16","v":0},{"$f":"'Betriebsdaten I'!F16","v":0},{"$f":"'Betriebsdaten I'!G16","v":0},{"$f":"'Betriebsdaten I'!H16","v":0},{"$f":"'Betriebsdaten I'!I16","v":0},{"$f":"'Betriebsdaten I'!J16","v":0},{"$f":"'Betriebsdaten I'!K16","v":0},{"$f":"'Betriebsdaten I'!L16","v":0},{"$f":"'Betriebsdaten I'!M16","v":0},{"$f":"'Betriebsdaten I'!N16","v":0},{"$f":"'Betriebsdaten I'!O16","v":0},{"$f":"'Betriebsdaten I'!P16","v":0},{"$f":"WM_Sonstige_4Jahr","v":0}]
[{"$f":"Auswertung_I!G13","v":""},{"$f":"'Betriebsdaten I'!E17","v":0},{"$f":"'Betriebsdaten I'!F17","v":0},{"$f":"'Betriebsdaten I'!G17","v":0},{"$f":"'Betriebsdaten I'!H17","v":0},{"$f":"'Betriebsdaten I'!I17","v":0},{"$f":"'Betriebsdaten I'!J17","v":0},{"$f":"'Betriebsdaten I'!K17","v":0},{"$f":"'Betriebsdaten I'!L17","v":0},{"$f":"'Betriebsdaten I'!M17","v":0},{"$f":"'Betriebsdaten I'!N17","v":0},{"$f":"'Betriebsdaten I'!O17","v":0},{"$f":"'Betriebsdaten I'!P17","v":0},{"$f":"WM_Sonstige_5Jahr","v":0}]
[{"$f":"Auswertung_I!G14","v":""},{"$f":"'Betriebsdaten I'!E18","v":0},{"$f":"'Betriebsdaten I'!F18","v":0},{"$f":"'Betriebsdaten I'!G18","v":0},{"$f":"'Betriebsdaten I'!H18","v":0},{"$f":"'Betriebsdaten I'!I18","v":0},{"$f":"'Betriebsdaten I'!J18","v":0},{"$f":"'Betriebsdaten I'!K18","v":0},{"$f":"'Betriebsdaten I'!L18","v":0},{"$f":"'Betriebsdaten I'!M18","v":0},{"$f":"'Betriebsdaten I'!N18","v":0},{"$f":"'Betriebsdaten I'!O18","v":0},{"$f":"'Betriebsdaten I'!P18","v":0},{"$f":"WM_Sonstige_6Jahr","v":0}]
[{"$f":"Auswertung_I!G15","v":""},{"$f":"'Betriebsdaten I'!E19","v":0},{"$f":"'Betriebsdaten I'!F19","v":0},{"$f":"'Betriebsdaten I'!G19","v":0},{"$f":"'Betriebsdaten I'!H19","v":0},{"$f":"'Betriebsdaten I'!I19","v":0},{"$f":"'Betriebsdaten I'!J19","v":0},{"$f":"'Betriebsdaten I'!K19","v":0},{"$f":"'Betriebsdaten I'!L19","v":0},{"$f":"'Betriebsdaten I'!M19","v":0},{"$f":"'Betriebsdaten I'!N19","v":0},{"$f":"'Betriebsdaten I'!O19","v":0},{"$f":"'Betriebsdaten I'!P19","v":0},{"$f":"WM_Sonstige_7Jahr","v":0}]
[]
[null,null,null,null,null,null,null,null,null,null,null,null,null,null,null,"Toleranz Eingabeprüfung",0.03]
["Tage ",31,31,30,31,30,31,31,28,31,30,31,30,365]
[null,{"$f":"'Betriebsdaten I'!E5","v":"2022-01-01"},{"$f":"'Betriebsdaten I'!F5","v":"2022-02-01"},{"$f":"'Betriebsdaten I'!G5","v":"2022-03-01"},{"$f":"'Betriebsdaten I'!H5","v":"2022-04-01"},{"$f":"'Betriebsdaten I'!I5","v":"2022-05-01"},{"$f":"'Betriebsdaten I'!J5","v":"2022-06-01"},{"$f":"'Betriebsdaten I'!K5","v":"2022-07-01"},{"$f":"'Betriebsdaten I'!L5","v":"2022-08-01"},{"$f":"'Betriebsdaten I'!M5","v":"2022-09-01"},{"$f":"'Betriebsdaten I'!N5","v":"2022-10-01"},{"$f":"'Betriebsdaten I'!O5","v":"2022-11-01"},{"$f":"'Betriebsdaten I'!P5","v":"2022-12-01"},{"$f":"'Betriebsdaten I'!Q5","v":"Jahr"}]
["erzeugt",{"$f":"'Betriebsdaten I'!E7+'Betriebsdaten I'!E8+'Betriebsdaten I'!E9+'Betriebsdaten I'!E13+'Betriebsdaten I'!E14+'Betriebsdaten I'!E15+'Betriebsdaten I'!E16+'Betriebsdaten I'!E17+'Betriebsdaten I'!E18+'Betriebsdaten I'!E19","v":0},{"$f":"'Betriebsdaten I'!F7+'Betriebsdaten I'!F8+'Betriebsdaten I'!F9+'Betriebsdaten I'!F13+'Betriebsdaten I'!F14+'Betriebsdaten I'!F15+'Betriebsdaten I'!F16+'Betriebsdaten I'!F17+'Betriebsdaten I'!F18+'Betriebsdaten I'!F19","v":0},{"$f":"'Betriebsdaten I'!G7+'Betriebsdaten I'!G8+'Betriebsdaten I'!G9+'Betriebsdaten I'!G13+'Betriebsdaten I'!G14+'Betriebsdaten I'!G15+'Betriebsdaten I'!G16+'Betriebsdaten I'!G17+'Betriebsdaten I'!G18+'Betriebsdaten I'!G19","v":0},{"$f":"'Betriebsdaten I'!H7+'Betriebsdaten I'!H8+'Betriebsdaten I'!H9+'Betriebsdaten I'!H13+'Betriebsdaten I'!H14+'Betriebsdaten I'!H15+'Betriebsdaten I'!H16+'Betriebsdaten I'!H17+'Betriebsdaten I'!H18+'Betriebsdaten I'!H19","v":0},{"$f":"'Betriebsdaten I'!I7+'Betriebsdaten I'!I8+'Betriebsdaten I'!I9+'Betriebsdaten I'!I13+'Betriebsdaten I'!I14+'Betriebsdaten I'!I15+'Betriebsdaten I'!I16+'Betriebsdaten I'!I17+'Betriebsdaten I'!I18+'Betriebsdaten I'!I19","v":0},{"$f":"'Betriebsdaten I'!J7+'Betriebsdaten I'!J8+'Betriebsdaten I'!J9+'Betriebsdaten I'!J13+'Betriebsdaten I'!J14+'Betriebsdaten I'!J15+'Betriebsdaten I'!J16+'Betriebsdaten I'!J17+'Betriebsdaten I'!J18+'Betriebsdaten I'!J19","v":0},{"$f":"'Betriebsdaten I'!K7+'Betriebsdaten I'!K8+'Betriebsdaten I'!K9+'Betriebsdaten I'!K13+'Betriebsdaten I'!K14+'Betriebsdaten I'!K15+'Betriebsdaten I'!K16+'Betriebsdaten I'!K17+'Betriebsdaten I'!K18+'Betriebsdaten I'!K19","v":0},{"$f":"'Betriebsdaten I'!L7+'Betriebsdaten I'!L8+'Betriebsdaten I'!L9+'Betriebsdaten I'!L13+'Betriebsdaten I'!L14+'Betriebsdaten I'!L15+'Betriebsdaten I'!L16+'Betriebsdaten I'!L17+'Betriebsdaten I'!L18+'Betriebsdaten I'!L19","v":0},{"$f":"'Betriebsdaten I'!M7+'Betriebsdaten I'!M8+'Betriebsdaten I'!M9+'Betriebsdaten I'!M13+'Betriebsdaten I'!M14+'Betriebsdaten I'!M15+'Betriebsdaten I'!M16+'Betriebsdaten I'!M17+'Betriebsdaten I'!M18+'Betriebsdaten I'!M19","v":0},{"$f":"'Betriebsdaten I'!N7+'Betriebsdaten I'!N8+'Betriebsdaten I'!N9+'Betriebsdaten I'!N13+'Betriebsdaten I'!N14+'Betriebsdaten I'!N15+'Betriebsdaten I'!N16+'Betriebsdaten I'!N17+'Betriebsdaten I'!N18+'Betriebsdaten I'!N19","v":0},{"$f":"'Betriebsdaten I'!O7+'Betriebsdaten I'!O8+'Betriebsdaten I'!O9+'Betriebsdaten I'!O13+'Betriebsdaten I'!O14+'Betriebsdaten I'!O15+'Betriebsdaten I'!O16+'Betriebsdaten I'!O17+'Betriebsdaten I'!O18+'Betriebsdaten I'!O19","v":0},{"$f":"'Betriebsdaten I'!P7+'Betriebsdaten I'!P8+'Betriebsdaten I'!P9+'Betriebsdaten I'!P13+'Betriebsdaten I'!P14+'Betriebsdaten I'!P15+'Betriebsdaten I'!P16+'Betriebsdaten I'!P17+'Betriebsdaten I'!P18+'Betriebsdaten I'!P19","v":0},{"$f":"'Betriebsdaten I'!Q7+'Betriebsdaten I'!Q8+'Betriebsdaten I'!Q9+'Betriebsdaten I'!Q13+'Betriebsdaten I'!Q14+'Betriebsdaten I'!Q15+'Betriebsdaten I'!Q16+'Betriebsdaten I'!Q17+'Betriebsdaten I'!Q18+'Betriebsdaten I'!Q19","v":0}]
["eingespeist",{"$f":"'Betriebsdaten II'!E8","v":0},{"$f":"'Betriebsdaten II'!F8","v":0},{"$f":"'Betriebsdaten II'!G8","v":0},{"$f":"'Betriebsdaten II'!H8","v":0},{"$f":"'Betriebsdaten II'!I8","v":0},{"$f":"'Betriebsdaten II'!J8","v":0},{"$f":"'Betriebsdaten II'!K8","v":0},{"$f":"'Betriebsdaten II'!L8","v":0},{"$f":"'Betriebsdaten II'!M8","v":0},{"$f":"'Betriebsdaten II'!N8","v":0},{"$f":"'Betriebsdaten II'!O8","v":0},{"$f":"'Betriebsdaten II'!P8","v":0},{"$f":"'Betriebsdaten II'!Q8","v":0}]
["abgenommen",{"$f":"'Betriebsdaten II'!E10","v":0},{"$f":"'Betriebsdaten II'!F10","v":0},{"$f":"'Betriebsdaten II'!G10","v":0},{"$f":"'Betriebsdaten II'!H10","v":0},{"$f":"'Betriebsdaten II'!I10","v":0},{"$f":"'Betriebsdaten II'!J10","v":0},{"$f":"'Betriebsdaten II'!K10","v":0},{"$f":"'Betriebsdaten II'!L10","v":0},{"$f":"'Betriebsdaten II'!M10","v":0},{"$f":"'Betriebsdaten II'!N10","v":0},{"$f":"'Betriebsdaten II'!O10","v":0},{"$f":"'Betriebsdaten II'!P10","v":0},{"$f":"'Betriebsdaten II'!Q10","v":0}]
["Heizhausverluste",{"$f":"B15-(B16+'Betriebsdaten II'!E11)","v":0},{"$f":"C15-(C16+'Betriebsdaten II'!F11)","v":0},{"$f":"D15-(D16+'Betriebsdaten II'!G11)","v":0},{"$f":"E15-(E16+'Betriebsdaten II'!H11)","v":0},{"$f":"F15-(F16+'Betriebsdaten II'!I11)","v":0},{"$f":"G15-(G16+'Betriebsdaten II'!J11)","v":0},{"$f":"H15-(H16+'Betriebsdaten II'!K11)","v":0},{"$f":"I15-(I16+'Betriebsdaten II'!L11)","v":0},{"$f":"J15-(J16+'Betriebsdaten II'!M11)","v":0},{"$f":"K15-(K16+'Betriebsdaten II'!N11)","v":0},{"$f":"L15-(L16+'Betriebsdaten II'!O11)","v":0},{"$f":"M15-(M16+'Betriebsdaten II'!P11)","v":0},{"$f":"N15-(N16+'Betriebsdaten II'!Q11)","v":0}]
["Netzverluste",{"$f":"B16-B17","v":0},0,0,0,0,0,0,0,0,0,0,0,0]
["mittlere Netzverlustleistung [kW]",{"$f":"B19/(B13*24)","v":0},{"$f":"C19/(C13*24)","v":0},0,0,0,0,0,0,0,0,0,0,0]
["mittlere Heizhausverlustleistung [kW]",{"$f":"B18/(B13*24)","v":0},{"$f":"C18/(C13*24)","v":0},0,0,0,0,0,0,0,0,0,0,0]
[]
["Netzverluste",{"$f":"IF(B16=0,\"\",B19/B16)","v":""},{"$f":"IF(C16=0,\"\",C19/C16)","v":""},"","","","","","","","","","",""]
["Heizhausverluste",{"$f":"IF(B15=0,\"\",B18/B15)","v":""},{"$f":"IF(C15=0,\"\",C18/C15)","v":""},"","","","","","","","","","",""]
[]
[]
[]
["abgenommen",{"$f":"IF($N$17=0,\"\",B17/$N$17)","v":""},{"$f":"IF($N$17=0,\"\",C17/$N$17)","v":""},"","","","","","","","","","",""]
["Netzverluste",{"$f":"IF($N$16=0,\"\",B19/$N$16)","v":""},{"$f":"IF($N$16=0,\"\",C19/$N$16)","v":""},"","","","","","","","","","",""]
[]
[]
[null,"erzeugt","verkauft","Heizhausverluste","Netzverluste"]
[{"$f":"B14","v":"2022-01-01"},{"$f":"B15/1000","v":0}]
[null,null,{"$f":"B17/1000","v":0},{"$f":"B18/1000","v":0},{"$f":"B19/1000","v":0}]
[]
[{"$f":"C14","v":"2022-02-01"},{"$f":"C15/1000","v":0}]
[null,null,{"$f":"C17/1000","v":0},{"$f":"C18/1000","v":0},{"$f":"C19/1000","v":0}]
[]
[{"$f":"D14","v":"2022-03-01"},{"$f":"D15/1000","v":0}]
[null,null,{"$f":"D17/1000","v":0},{"$f":"D18/1000","v":0},{"$f":"D19/1000","v":0}]
[]
[{"$f":"E14","v":"2022-04-01"},{"$f":"E15/1000","v":0}]
[null,null,{"$f":"E17/1000","v":0},{"$f":"E18/1000","v":0},{"$f":"E19/1000","v":0}]
[]
[{"$f":"F14","v":"2022-05-01"},{"$f":"F15/1000","v":0}]
[null,null,{"$f":"F17/1000","v":0},{"$f":"F18/1000","v":0},{"$f":"F19/1000","v":0}]
[]
[{"$f":"G14","v":"2022-06-01"},{"$f":"G15/1000","v":0}]
[null,null,{"$f":"G17/1000","v":0},{"$f":"G18/1000","v":0},{"$f":"G19/1000","v":0}]
[]
[{"$f":"H14","v":"2022-07-01"},{"$f":"H15/1000","v":0}]
[null,null,{"$f":"H17/1000","v":0},{"$f":"H18/1000","v":0},{"$f":"H19/1000","v":0}]
[]
[{"$f":"I14","v":"2022-08-01"},{"$f":"I15/1000","v":0}]
[null,null,{"$f":"I17/1000","v":0},{"$f":"I18/1000","v":0},{"$f":"I19/1000","v":0}]
[]
[{"$f":"J14","v":"2022-09-01"},{"$f":"J15/1000","v":0}]
[null,null,{"$f":"J17/1000","v":0},{"$f":"J18/1000","v":0},{"$f":"J19/1000","v":0}]
[]
[{"$f":"K14","v":"2022-10-01"},{"$f":"K15/1000","v":0}]
[null,null,{"$f":"K17/1000","v":0},{"$f":"K18/1000","v":0},{"$f":"K19/1000","v":0}]
[]
[{"$f":"L14","v":"2022-11-01"},{"$f":"L15/1000","v":0}]
[null,null,{"$f":"L17/1000","v":0},{"$f":"L18/1000","v":0},{"$f":"L19/1000","v":0}]
[]
[{"$f":"M14","v":"2022-12-01"},{"$f":"M15/1000","v":0}]
[null,null,{"$f":"M17/1000","v":0},{"$f":"M18/1000","v":0},{"$f":"M19/1000","v":0}]
[]
[{"$f":"N14","v":"Jahr"},{"$f":"N15/1000","v":0}]
[null,null,{"$f":"N17/1000","v":0},{"$f":"N18/1000","v":0},{"$f":"N19/1000","v":0}]