{"text_format":"1","workbook":"xlsx","n_sheets":9,"sheets":["Aktualisierungen","Erläuterungen","Eingabe","Ausrichtung","Berechnungen","Förderungen","Wetterdaten","PLZ-Zuordnung","Strompreis"],"not_rendered":{"charts":8,"images":29,"macros":1,"external_links":1,"defined_names":27,"comments":0,"pivot_tables":0},"unopened":[],"bounds":{"document_bytes":16777216,"sheet_cells":100000,"rows_first":2000,"rows_last":500,"rows_between":2000,"halvings":0,"cell_chars":16384,"cell_head_chars":4096},"cells_cut":0,"cells_raw":0,"read":"whole","date_system":"1900"}

{"sheet":"Aktualisierungen","index":0,"n_rows":5,"n_cols":1,"rows_kept":5,"cut":false,"hidden":false,"merged":[[4,0,4,8],[5,0,5,8]]}
[]
[]
[]
[]
["Photovoltaik - Berechnungstool der Österreichischen Energieagentur"]

{"sheet":"Erläuterungen","index":1,"n_rows":22,"n_cols":2,"rows_kept":22,"cut":false,"hidden":false,"merged":[[4,0,4,8],[5,0,5,8],[21,1,21,4],[22,1,22,7],[20,1,20,2]]}
[]
[]
[]
[]
["Photovoltaik - Berechnungstool der Österreichischen Energieagentur"]
[]
[]
[]
[]
[]
[]
[]
[]
[]
[]
[]
[]
[]
[]
["  Kontakt:","DI (FH) Franz Jetzinger"]
[null,"f.jetzinger@linzag.at"]
[null,"http://www.klimaaktiv.at/tools/erneuerbare/pv_rechner.html"]

{"sheet":"Eingabe","index":2,"n_rows":271,"n_cols":44,"rows_kept":271,"cut":false,"hidden":false,"merged":[[0,2,4,5],[53,3,53,4],[24,7,27,9],[10,7,10,8],[18,7,21,9],[5,1,5,18],[6,0,6,18],[28,12,28,13],[20,14,20,18],[53,5,53,6],[53,7,53,8],[231,23,231,24],[231,25,231,26],[125,2,125,18],[124,2,124,13],[66,7,66,8],[127,2,127,18],[128,2,128,18],[54,5,54,6],[65,2,65,3],[62,7,62,8],[64,7,64,8],[70,6,70,8]]}
[]
[]
[]
[]
[]
[null,"Photovoltaik - Berechnungstool der Österreichischen Energieagentur"]
["aktualisiert und ergänzt in Kooperation mit LINZ STROM GAS WÄRME GmbH"]
[null,null," "]
[null,"1. Allgemeine Eingaben",null,null,null,null,null,null,null,null,null,null,{"$f":"IF(AND(H63=\"Invest- inkl. Tarifförderung\",H37>=5),\"6. Übersicht zum Eigenverbrauch während des Fördertarifs\",IF(H63=\"Investzuschuss\",\"6. Förderquote Investitionsförderung\",\"6. Keine Tarifförderung möglich!\"))","v":"6. Keine Tarifförderung möglich!"}]
[]
[null,null,null,null,null,null,"Ort des Gebäudes:",{"$f":"'PLZ-Zuordnung'!J5","v":"Steyr"}]
[null,null,null,null,null,null,"PLZ:",4400]
[]
[]
[null,null,null,null,null,null,"Einstrahlung (horizontale Fläche):",{"$f":"Wetterdaten!L5","v":1068},"kWh/m²a"]
[null,null,null,null,null,null,"Einstrahlung nach Angabe der Ausrichtung:",{"$f":"Ausrichtung!H51","v":1193.6470588235293},"kWh/m²a"]
[]
[]
[null,null,"Ausrichtung:",null,null,null,null,"Die Angabe der Ausrichtung der Anlage erfolgt von Osten nach Westen von -90° bis +90° (zB.: -45° = SO)"]
[]
[null,null,null,null,null,null,null,null,null,null,null,null,null,null,{"$f":"\"Gesamte Investitionsförderung: \"&ROUND((1-($H$92/$H$89))*100,0)&\" %\"","v":"Gesamte Investitionsförderung: 15 %"}]
[]
[null,null,null,null,null,null,null,0,"°"]
[]
[null,null,"Aufstellung:",null,null,null,null,"Die Angabe zur Neigung der Anlage erfolgt von 0° bis 90° (z.B.: 90° = Fassadenanlage)",null,null,null,null,{"$f":"IF(AND(H63=\"Invest- inkl. Tarifförderung\",H65=\"Überschusseinspeisung\"),\"7. Übersicht zum Eigenverbrauch nach Fördertarif (dzt. 13 Jahre)\",\"7. Übersicht zum Eigenverbrauch\")","v":"7. Übersicht zum Eigenverbrauch"}]
[]
[]
[]
[null,null,null,null,null,null,null,45,"°"]
[]
[null,null,"Randbedingungen:",null,"Es kommt in keinster Weise zu einer Verschattung der Anlage!"]
[null,null,null,null,{"$f":"IF(C55=\"Gebäudeintegriert\",\"Die Anlage ist gebäudeintegriert!\",IF(C55=\"Aufdach\",\"Die Anlage ist hinterlüftet!\",\"Es handelt sich um eine Freiflächenanlage!\"))","v":"Die Anlage ist hinterlüftet!"}]
[]
[]
[null,null,"2. Technische Rahmenbedingungen"]
[]
[null,null,"Größe der Anlage:",null,null,null,"Anlagenleistung:",10,"[kWp]"]
[null,null,null,null,null,null,"Gesamtfläche:",{"$f":"H37/H45*H44","v":59.642857142857132},"[m²]"]
[null,null,null,null,null,null,"Gesamtwirkungsgrad:",{"$f":"(H46*H49)/100","v":16.26347305389222},"[%]"]
[null,null,null,null,null,null,"Systemnutzungsgrad:",{"$f":"IF(C55=\"Gebäudeintegriert\",H39*0.81,IF(C55=\"Aufdach\",H39*0.86,H39*0.87))","v":13.98658682634731},"[%]"]
[null,null,null,null,null,null,"Anzahl der Module:",{"$f":"ROUND(H37/H45,0)","v":36},"[Module]"]
[]
[]
[null,null,"Moduldaten:",null,null,null,"Modulfläche:",1.67,"[m²/Modul]",null,null,null,"8. Übersicht über die jährlichen Einnahmen (Barwerte)"]
[null,null,null,null,null,null,"Nennleistung:",0.28000000000000003,"[kWp/Modul]"]
[null,null,null,null,null,null,"Modulwirkungsgrad (STC-Bedingungen):",{"$f":"(H45/H44)*100","v":16.766467065868266},"[%]"]
[]
[]
[null,null,"Wechselrichterdaten:",null,null,null,"europ. Wirkungsgrad:",97,"[%]"]
[]
[]
[null,null,{"$f":"\"3. Förderungen für \"&IF(H12=\"\",\"??? - PLZ erforderlich!\",'PLZ-Zuordnung'!J4)","v":"3. Förderungen für Oberösterreich"}]
[]
[null,null,"Anlagenart","Anlagengröße",null,"Landesförderung",null,"Bundesförderung"]
[null,null,"Aufdach","","","Investition",null,"Investition",{"$f":"IF(C57=C196,C196,IF(C57=C197,C197,\"Zu-/Abschläge\"))","v":"Zu-/Abschläge"}]
[null,null,"Zu- oder Abschlag?",{"$f":"IF($C$52=\"3. Förderungen für Burgenland\",Förderungen!C8,IF($C$52=\"3. Förderungen für Kärnten\",Förderungen!C20,IF($C$52=\"3. Förderungen für Niederösterreich\",Förderungen!C32,IF($C$52=\"3. Förderungen für Oberösterreich\",Förderungen!C44,IF($C$52=\"3. Förderungen für Salzburg\",Förderungen!C56,IF($C$52=\"3. Förderungen für Steiermark\",Förderungen!C70,IF($C$52=\"3. Förderungen für Tirol\",Förderungen!C82,IF($C$52=\"3. Förderungen für Vorarlberg\",Förderungen!C94,Förderungen!C106))))))))","v":"0,01-10"},{"$f":"IF($C$52=\"3. Förderungen für Burgenland\",Förderungen!D8,IF($C$52=\"3. Förderungen für Kärnten\",Förderungen!D20,IF($C$52=\"3. Förderungen für Niederösterreich\",Förderungen!D32,IF($C$52=\"3. Förderungen für Oberösterreich\",Förderungen!D44,IF($C$52=\"3. Förderungen für Salzburg\",Förderungen!D56,IF($C$52=\"3. Förderungen für Steiermark\",Förderungen!D70,IF($C$52=\"3. Förderungen für Tirol\",Förderungen!D82,IF($C$52=\"3. Förderungen für Vorarlberg\",Förderungen!D94,Förderungen!D106))))))))","v":"kWp"},{"$f":"IF($C$52=\"3. Förderungen für Burgenland\",Förderungen!E8,IF($C$52=\"3. Förderungen für Kärnten\",Förderungen!E20,IF($C$52=\"3. Förderungen für Niederösterreich\",Förderungen!E32,IF($C$52=\"3. Förderungen für Oberösterreich\",Förderungen!E44,IF($C$52=\"3. Förderungen für Salzburg\",Förderungen!E56,IF($C$52=\"3. Förderungen für Steiermark\",Förderungen!E70,IF($C$52=\"3. Förderungen für Tirol\",Förderungen!E82,IF($C$52=\"3. Förderungen für Vorarlberg\",Förderungen!E94,Förderungen!E106))))))))","v":"-"},{"$f":"IF($C$52=\"3. Förderungen für Burgenland\",Förderungen!F8,IF($C$52=\"3. Förderungen für Kärnten\",Förderungen!F20,IF($C$52=\"3. Förderungen für Niederösterreich\",Förderungen!F32,IF($C$52=\"3. Förderungen für Oberösterreich\",Förderungen!F44,IF($C$52=\"3. Förderungen für Salzburg\",Förderungen!F56,IF($C$52=\"3. Förderungen für Steiermark\",Förderungen!F70,IF($C$52=\"3. Förderungen für Tirol\",Förderungen!F82,IF($C$52=\"3. Förderungen für Vorarlberg\",Förderungen!F94,Förderungen!F106))))))))","v":"-"},{"$f":"IF($C$52=\"3. Förderungen für Burgenland\",Förderungen!G8,IF($C$52=\"3. Förderungen für Kärnten\",Förderungen!G20,IF($C$52=\"3. Förderungen für Niederösterreich\",Förderungen!G32,IF($C$52=\"3. Förderungen für Oberösterreich\",Förderungen!G44,IF($C$52=\"3. Förderungen für Salzburg\",Förderungen!G56,IF($C$52=\"3. Förderungen für Steiermark\",Förderungen!G70,IF($C$52=\"3. Förderungen für Tirol\",Förderungen!G82,IF($C$52=\"3. Förderungen für Vorarlberg\",Förderungen!G94,Förderungen!G106))))))))","v":285},{"$f":"IF($C$57=$C$196,H56*0.3,IF($C$57=$C$197,H56*0.25,0))","v":0}]
[null,null,"weder noch",{"$f":"IF($C$52=\"3. Förderungen für Burgenland\",Förderungen!C9,IF($C$52=\"3. Förderungen für Kärnten\",Förderungen!C21,IF($C$52=\"3. Förderungen für Niederösterreich\",Förderungen!C33,IF($C$52=\"3. Förderungen für Oberösterreich\",Förderungen!C45,IF($C$52=\"3. Förderungen für Salzburg\",Förderungen!C57,IF($C$52=\"3. Förderungen für Steiermark\",Förderungen!C71,IF($C$52=\"3. Förderungen für Tirol\",Förderungen!C83,IF($C$52=\"3. Förderungen für Vorarlberg\",Förderungen!C95,Förderungen!C107))))))))","v":">10-20"},{"$f":"IF($C$52=\"3. Förderungen für Burgenland\",Förderungen!D9,IF($C$52=\"3. Förderungen für Kärnten\",Förderungen!D21,IF($C$52=\"3. Förderungen für Niederösterreich\",Förderungen!D33,IF($C$52=\"3. Förderungen für Oberösterreich\",Förderungen!D45,IF($C$52=\"3. Förderungen für Salzburg\",Förderungen!D57,IF($C$52=\"3. Förderungen für Steiermark\",Förderungen!D71,IF($C$52=\"3. Förderungen für Tirol\",Förderungen!D83,IF($C$52=\"3. Förderungen für Vorarlberg\",Förderungen!D95,Förderungen!D107))))))))","v":"kWp"},{"$f":"IF($C$52=\"3. Förderungen für Burgenland\",Förderungen!E9,IF($C$52=\"3. Förderungen für Kärnten\",Förderungen!E21,IF($C$52=\"3. Förderungen für Niederösterreich\",Förderungen!E33,IF($C$52=\"3. Förderungen für Oberösterreich\",Förderungen!E45,IF($C$52=\"3. Förderungen für Salzburg\",Förderungen!E57,IF($C$52=\"3. Förderungen für Steiermark\",Förderungen!E71,IF($C$52=\"3. Förderungen für Tirol\",Förderungen!E83,IF($C$52=\"3. Förderungen für Vorarlberg\",Förderungen!E95,Förderungen!E107))))))))","v":"-"},{"$f":"IF($C$52=\"3. Förderungen für Burgenland\",Förderungen!F9,IF($C$52=\"3. Förderungen für Kärnten\",Förderungen!F21,IF($C$52=\"3. Förderungen für Niederösterreich\",Förderungen!F33,IF($C$52=\"3. Förderungen für Oberösterreich\",Förderungen!F45,IF($C$52=\"3. Förderungen für Salzburg\",Förderungen!F57,IF($C$52=\"3. Förderungen für Steiermark\",Förderungen!F71,IF($C$52=\"3. Förderungen für Tirol\",Förderungen!F83,IF($C$52=\"3. Förderungen für Vorarlberg\",Förderungen!F95,Förderungen!F107))))))))","v":"-"},{"$f":"IF($C$52=\"3. Förderungen für Burgenland\",Förderungen!G9,IF($C$52=\"3. Förderungen für Kärnten\",Förderungen!G21,IF($C$52=\"3. Förderungen für Niederösterreich\",Förderungen!G33,IF($C$52=\"3. Förderungen für Oberösterreich\",Förderungen!G45,IF($C$52=\"3. Förderungen für Salzburg\",Förderungen!G57,IF($C$52=\"3. Förderungen für Steiermark\",Förderungen!G71,IF($C$52=\"3. Förderungen für Tirol\",Förderungen!G83,IF($C$52=\"3. Förderungen für Vorarlberg\",Förderungen!G95,Förderungen!G107))))))))","v":250},{"$f":"IF($C$57=$C$196,H57*0.3,IF($C$57=$C$197,H57*0.25,0))","v":0}]
[null,null,null,{"$f":"IF($C$52=\"3. Förderungen für Burgenland\",Förderungen!C10,IF($C$52=\"3. Förderungen für Kärnten\",Förderungen!C22,IF($C$52=\"3. Förderungen für Niederösterreich\",Förderungen!C34,IF($C$52=\"3. Förderungen für Oberösterreich\",Förderungen!C46,IF($C$52=\"3. Förderungen für Salzburg\",Förderungen!C58,IF($C$52=\"3. Förderungen für Steiermark\",Förderungen!C72,IF($C$52=\"3. Förderungen für Tirol\",Förderungen!C84,IF($C$52=\"3. Förderungen für Vorarlberg\",Förderungen!C96,Förderungen!C108))))))))","v":">20-100"},{"$f":"IF($C$52=\"3. Förderungen für Burgenland\",Förderungen!D10,IF($C$52=\"3. Förderungen für Kärnten\",Förderungen!D22,IF($C$52=\"3. Förderungen für Niederösterreich\",Förderungen!D34,IF($C$52=\"3. Förderungen für Oberösterreich\",Förderungen!D46,IF($C$52=\"3. Förderungen für Salzburg\",Förderungen!D58,IF($C$52=\"3. Förderungen für Steiermark\",Förderungen!D72,IF($C$52=\"3. Förderungen für Tirol\",Förderungen!D84,IF($C$52=\"3. Förderungen für Vorarlberg\",Förderungen!D96,Förderungen!D108))))))))","v":"kWp"},{"$f":"IF($C$52=\"3. Förderungen für Burgenland\",Förderungen!E10,IF($C$52=\"3. Förderungen für Kärnten\",Förderungen!E22,IF($C$52=\"3. Förderungen für Niederösterreich\",Förderungen!E34,IF($C$52=\"3. Förderungen für Oberösterreich\",Förderungen!E46,IF($C$52=\"3. Förderungen für Salzburg\",Förderungen!E58,IF($C$52=\"3. Förderungen für Steiermark\",Förderungen!E72,IF($C$52=\"3. Förderungen für Tirol\",Förderungen!E84,IF($C$52=\"3. Förderungen für Vorarlberg\",Förderungen!E96,Förderungen!E108))))))))","v":"-"},{"$f":"IF($C$52=\"3. Förderungen für Burgenland\",Förderungen!F10,IF($C$52=\"3. Förderungen für Kärnten\",Förderungen!F22,IF($C$52=\"3. Förderungen für Niederösterreich\",Förderungen!F34,IF($C$52=\"3. Förderungen für Oberösterreich\",Förderungen!F46,IF($C$52=\"3. Förderungen für Salzburg\",Förderungen!F58,IF($C$52=\"3. Förderungen für Steiermark\",Förderungen!F72,IF($C$52=\"3. Förderungen für Tirol\",Förderungen!F84,IF($C$52=\"3. Förderungen für Vorarlberg\",Förderungen!F96,Förderungen!F108))))))))","v":"-"},{"$f":"IF($C$52=\"3. Förderungen für Burgenland\",Förderungen!G10,IF($C$52=\"3. Förderungen für Kärnten\",Förderungen!G22,IF($C$52=\"3. Förderungen für Niederösterreich\",Förderungen!G34,IF($C$52=\"3. Förderungen für Oberösterreich\",Förderungen!G46,IF($C$52=\"3. Förderungen für Salzburg\",Förderungen!G58,IF($C$52=\"3. Förderungen für Steiermark\",Förderungen!G72,IF($C$52=\"3. Förderungen für Tirol\",Förderungen!G84,IF($C$52=\"3. Förderungen für Vorarlberg\",Förderungen!G96,Förderungen!G108))))))))","v":180},0]
[null,null,null,{"$f":"IF($C$52=\"3. Förderungen für Burgenland\",Förderungen!C11,IF($C$52=\"3. Förderungen für Kärnten\",Förderungen!C23,IF($C$52=\"3. Förderungen für Niederösterreich\",Förderungen!C35,IF($C$52=\"3. Förderungen für Oberösterreich\",Förderungen!C47,IF($C$52=\"3. Förderungen für Salzburg\",Förderungen!C59,IF($C$52=\"3. Förderungen für Steiermark\",Förderungen!C73,IF($C$52=\"3. Förderungen für Tirol\",Förderungen!C85,IF($C$52=\"3. Förderungen für Vorarlberg\",Förderungen!C97,Förderungen!C109))))))))","v":">100-1000"},{"$f":"IF($C$52=\"3. Förderungen für Burgenland\",Förderungen!D11,IF($C$52=\"3. Förderungen für Kärnten\",Förderungen!D23,IF($C$52=\"3. Förderungen für Niederösterreich\",Förderungen!D35,IF($C$52=\"3. Förderungen für Oberösterreich\",Förderungen!D47,IF($C$52=\"3. Förderungen für Salzburg\",Förderungen!D59,IF($C$52=\"3. Förderungen für Steiermark\",Förderungen!D73,IF($C$52=\"3. Förderungen für Tirol\",Förderungen!D85,IF($C$52=\"3. Förderungen für Vorarlberg\",Förderungen!D97,Förderungen!D109))))))))","v":"kWp"},{"$f":"IF($C$52=\"3. Förderungen für Burgenland\",Förderungen!E11,IF($C$52=\"3. Förderungen für Kärnten\",Förderungen!E23,IF($C$52=\"3. Förderungen für Niederösterreich\",Förderungen!E35,IF($C$52=\"3. Förderungen für Oberösterreich\",Förderungen!E47,IF($C$52=\"3. Förderungen für Salzburg\",Förderungen!E59,IF($C$52=\"3. Förderungen für Steiermark\",Förderungen!E73,IF($C$52=\"3. Förderungen für Tirol\",Förderungen!E85,IF($C$52=\"3. Förderungen für Vorarlberg\",Förderungen!E97,Förderungen!E109))))))))","v":"-"},{"$f":"IF($C$52=\"3. Förderungen für Burgenland\",Förderungen!F11,IF($C$52=\"3. Förderungen für Kärnten\",Förderungen!F23,IF($C$52=\"3. Förderungen für Niederösterreich\",Förderungen!F35,IF($C$52=\"3. Förderungen für Oberösterreich\",Förderungen!F47,IF($C$52=\"3. Förderungen für Salzburg\",Förderungen!F59,IF($C$52=\"3. Förderungen für Steiermark\",Förderungen!F73,IF($C$52=\"3. Förderungen für Tirol\",Förderungen!F85,IF($C$52=\"3. Förderungen für Vorarlberg\",Förderungen!F97,Förderungen!F109))))))))","v":"-"},{"$f":"IF($C$52=\"3. Förderungen für Burgenland\",Förderungen!G11,IF($C$52=\"3. Förderungen für Kärnten\",Förderungen!G23,IF($C$52=\"3. Förderungen für Niederösterreich\",Förderungen!G35,IF($C$52=\"3. Förderungen für Oberösterreich\",Förderungen!G47,IF($C$52=\"3. Förderungen für Salzburg\",Förderungen!G59,IF($C$52=\"3. Förderungen für Steiermark\",Förderungen!G73,IF($C$52=\"3. Förderungen für Tirol\",Förderungen!G85,IF($C$52=\"3. Förderungen für Vorarlberg\",Förderungen!G97,Förderungen!G109))))))))","v":170},0]
[]
[null,null,{"$f":"IF($C$52=\"3. Förderungen für Burgenland\",Förderungen!B13,IF($C$52=\"3. Förderungen für Kärnten\",Förderungen!B25,IF($C$52=\"3. Förderungen für Niederösterreich\",Förderungen!B37,IF($C$52=\"3. Förderungen für Oberösterreich\",Förderungen!B49,IF($C$52=\"3. Förderungen für Salzburg\",Förderungen!B61,IF($C$52=\"3. Förderungen für Steiermark\",Förderungen!B75,IF($C$52=\"3. Förderungen für Tirol\",Förderungen!B87,IF($C$52=\"3. Förderungen für Vorarlberg\",Förderungen!B99,Förderungen!B111))))))))","v":"Information:"}]
[null,null,{"$f":"IF($C$52=\"3. Förderungen für Burgenland\",Förderungen!B14,IF($C$52=\"3. Förderungen für Kärnten\",Förderungen!B26,IF($C$52=\"3. Förderungen für Niederösterreich\",Förderungen!B38,IF($C$52=\"3. Förderungen für Oberösterreich\",Förderungen!B50,IF($C$52=\"3. Förderungen für Salzburg\",Förderungen!B62,IF($C$52=\"3. Förderungen für Steiermark\",Förderungen!B76,IF($C$52=\"3. Förderungen für Tirol\",Förderungen!B88,IF($C$52=\"3. Förderungen für Vorarlberg\",Förderungen!B100,Förderungen!B112))))))))","v":"keine Landesförderung"}]
[null,null,null,null,null,null,"Gewünschte Vergütung:  ","EAG Investzuschuss"]
[null,null,null,null,null,null,{"$f":"IF(H63=\"Fördertarif\",\"*\",\"\")","v":""},{"$f":"IF(H63=\"Fördertarif\",\"Achtung: siehe Hinweis!\",\"\")","v":""}]
[null,null,null,null,null,null,"Vorgehensweise während Fördertarif:  ","Überschusseinspeisung",null,null,null,null,"9. Darstellung des Tarifs über den Betrachtungszeitraum"]
[]
[null,null,null,null,null,null,"Vorgehensweise nach Fördertarif:  ","Überschusseinspeisung"]
[]
[]
[null,null,{"$f":"IF(H63=C169,\"Tarif - wurde gewählt!\",\"Angaben zur Überschusseinspeisung\")","v":"Angaben zur Überschusseinspeisung"}]
[null,null,"Hilfestellung - Abschätzung des Eigenverbrauchs:",null,null,null,"http://www.energieinstitut.at/tools/susi/"]
[]
[null,null,null,null,null,null,"Angabe des Strom-Eigenverbrauches:",30]
[null,null,null,null,null,null,"Einspeisung in das öffentliche Netz:",{"$f":"100-$H$73","v":70},"[%]"]
[null,null,null,null,null,null,null,{"$f":"IF(H73>100,\"Vorsicht! Fehler in der %-Angabe!\",\"\")","v":""}]
[null,null,null,null,null,null,{"$f":"IF(AND(H63=\"Fördertarif\",H67=\"Überschusseinspeisung\"),\"Prognose Strompreis:\",\"Strompreis der aktuell bezogen wird:\")","v":"Strompreis der aktuell bezogen wird:"},{"$f":"IF(AND(H63=\"Fördertarif\",H67=\"Überschusseinspeisung\"),Berechnungen!Q24,H103)","v":0.35},"[€/kWh]",null,null,null,null,null,null,null,null,null,null,null,null,null,{"$f":"IF(W77>0,1,0)","v":0}]
[null,null,null,null,null,null,{"$f":"IF(AND(H63=\"Fördertarif\",H67=\"Überschusseinspeisung\"),\"Prognose Vergütung bei Überschusseinspeisung:\",\"Vergütung bei Überschusseinspeisung:\")","v":"Vergütung bei Überschusseinspeisung:"},{"$f":"IF(AND(H63=\"Fördertarif\",H67=\"Überschusseinspeisung\"),Berechnungen!P24,H104)","v":0.25600000000000001},"[€/kWh]",null,null,null,null,null,null,null,null,null,null,null,null,null,{"$f":"(IF(Eingabe!H112*Eingabe!H73/100>25000,IF((Eingabe!H112*Eingabe!H73/100-25000)*0.015<=50,0,(Eingabe!H112*Eingabe!H73/100-25000)*0.015),0))","v":0}]
[]
[null,null,null,null,null,null,"Errechnete Vergütung:",{"$f":"H76*H73/100+H77*H74/100","v":0.28420000000000001},"[€/kWh]"]
[]
[]
[null,null,"4. Wirtschaftliche Rahmenbedingungen"]
[]
[null,null,"Investitionskosten:"]
[]
[null,null,null,null,null,null,"Spezifische Kosten pro kWp:",1900,"[€/kWp]"]
[null,null,null,null,null,null,{"$f":"IF(H87<100%,\"Eigenkapitalquote / Zinsen Fremdkapital:\",\"Eigenkapitalquote:\")","v":"Eigenkapitalquote:"},1,0.03]
[null,null,null,null,null,null,{"$f":"IF(H87<100%,\"Kreditlaufzeit / Tilgungsfreie Jahre:\",\"\")","v":""},10,3,{"$f":"I88+1","v":4}]
[null,null,null,null,null,null,"Gesamtkosten der Anlage:",{"$f":"H86*H37","v":19000},"[€]",{"$f":"H88-I88","v":7}]
[null,null,null,null,null,null,{"$f":"IF(AND(F218=0,OR(G218<>0,H218<>0)),\"- Investitionsförderung Bund:\",IF(AND(F218<>0,G218=0),\"- Investitionsförderung Land:\",\"- Investförderung des Landes & Bundes:\"))","v":"- Investitionsförderung Bund:"},{"$f":"IF(AND(H63=C172,E66=C204),R183,$I$218)","v":2850},"[€]"]
[null,null,null,null,null,null,{"$f":"IF(G90=\"- Investitionsförderung Bund:\",\"Sonstige Förderung:\",\"- sonstige Förderung (z.B.: Gemeinde):\")","v":"Sonstige Förderung:"},null,"[€]","EK [€]:"]
[null,null,null,null,null,null,"Investitionskosten:",{"$f":"H89-(H90+H91)","v":16150},"[€]",{"$f":"H87*H92","v":16150},null,null,"10. Kapitalwerteverlauf"]
[]
[null,null,"Laufende Kosten:"]
[]
[null,null,null,null,null,"Wechselrichteraustausch in 25 Jahren:","einmal",2500,"[€/Austausch]"]
[null,null,null,null,null,null,"Laufende Kosten (Wartung, Versicherung):",0.4,"[%]"]
[null,null,null,null,null,null,"Ertragsminderung (Degradation) pro Jahr:",0.5,"[%]"]
[]
[null,null,"Entwicklung:"]
[]
[null,null,null,null,null,null,"Inflationsrate/Jahr:",4,"[%]"]
[null,null,null,null,null,null,"Aktueller Strompreis:",0.35,"[€/kWh]"]
[null,null,null,null,null,null,"Aktuelle Vergütung für Einspeiser (EVU):",0.25600000000000001,"[€/kWh]"]
[null,null,null,null,null,null,"Strompreissteigerung/Jahr:",-2,"[%]"]
[null,null,null,null,null,null,"Kalkulationszinssatz:",1.5,"[%]"]
[]
[]
[null,null,"5. Zusammenfassung"]
[]
[null,null,"Energie:",null,null,null,"Spezifischer Energieertrag:",{"$f":"H16*(H38/H37)*(H40/100)","v":995.74037647058844},"[kWh/kWp]"]
[null,null,null,null,null,null,"Energieertrag (1. Jahr):",{"$f":"H111*H37","v":9957.4037647058849},"[kWh/a]"]
[null,null,null,null,null,null,"Energieertrag nach 25 Jahren:",{"$f":"Berechnungen!D37","v":234624.97282387773},"[kWh]"]
[]
[]
[null,null,"Kosten:",null,null,null,"Investitionskosten:",{"$f":"H92","v":16150},"[€]"]
[null,null,null,null,null,null,"Mehreinnahmen nach 25 Jahren:",{"$f":"Berechnungen!$L$40","v":24156.279581580864},"[€]"]
[null,null,null,null,null,null,"Amortisationsdauer:",{"$f":"Berechnungen!M37","v":7},"[Jahre]"]
[]
[]
[null,null,"CO2:",null,null,null,"CO2-Einsparungen nach 25 Jahren:",{"$f":"ROUND(H113*0.45,0)","v":105581},"[kg CO2]"]
[]
[]
[null,null,"* Hinweis: Der Fördertarif wird vom Bund getragen und ist für Anlagen > 5kWp erhältlich; die Fördermittel des Bundes sind in nachfolgendem Link (tagesaktuelles Kontingent) ersichtlich."]
[null,null,"http://www.oem-ag.at/fileadmin/user_upload/Dokumente/kontingent/Kontingent_tagesaktuelles_Unterstuetzungsvolumen_in_EUR.xls"]
[]
[]
[]
[]
[]
[]
[]
[]
[]
[]
[]
[]
[]
[]
[]
[]
[]
[]
[]
[]
[]
[]
[]
[]
[]
[]
[]
[]
[]
[]
[]
[]
[]
[]
[]
[]
[]
[]
[]
[null,null,"Formel unterhalb zum Makrostart"]
[null,null,{"$f":"IF(AND(H63=\"Invest- inkl. Tarifförderung\",H37>=5),Startmakro1(),Startmakro2())","v":""}]
[]
[]
[null,null,"Invest- inkl. Tarifförderung",1,null,"Neigung:",0,"Azimut:",-90]
[null,null,"EAG Investzuschuss",2,null,null,15,null,-75,null,"Berrechnung des Überschuß-Einspeisetarifes:",null,null,null,null,null,null,"Ausgangswert","Prozent Steigerung",null,"Jahre"]
[null,null,"Ohne Förderung",3,null,null,30,null,-60,null,{"$f":"$H$73","v":30},null,{"$f":"$K$174/100*K171","v":0.10499999999999998},null,null,null,null,49.94,19,null,5]
[null,null,"Landesförderung",4,null,null,45,null,-45,null,{"$f":"$H$74","v":70},null,{"$f":"$K$175/100*K172","v":0.17920000000000003}]
[null,null,null,5,null,null,60,null,-30,null,null,null,{"$f":"SUM(M171:M172)","v":0.28420000000000001}]
[null,null,null,6,null,null,75,null,-15,null,{"$f":"$H$76","v":0.35},null,null,null,null,null,null,{"$f":"R171*((1+S171/100))^U171","v":119.17450177540599}]
[null,null,null,7,null,null,90,null,0,null,{"$f":"$H$77","v":0.25600000000000001}]
[null,null,null,8,null,null,null,null,15]
[null,null,null,9,null,null,null,null,30]
[null,null,null,10,null,null,null,null,45]
[null,null,null,11,null,null,null,null,60,null,"Fehlermeldung:",null,{"$f":"IF(Berechnungen!L87=0,1,0)","v":1}]
[null,null,null,12,null,null,null,null,75,null,null,null,{"$f":"IF(Berechnungen!C7=\"Fördertarif\",1,0)","v":0},null,null,null,null,null,{"$f":"R182-40","v":-30},null,{"$f":"R182-30","v":-20}]
[null,null,null,13,null,null,null,null,90,null,null,null,{"$f":"SUM(M179:M180)","v":1},null,null,null,null,"KLIEN2021","0-10",null,"10-20","20-50"]
[null,null,null,14,null,null,null,null,null,null,null,null,null,null,null,null,null,{"$f":"H37","v":10},250,null,200,150]
[null,null,null,15,null,null,null,null,null,null,null,null,null,null,null,null,null,{"$f":"SUM(IF(R182<=10,R182*S182,IF(R182<=20,10*S182+(R182-10)*U182,IF(R182<=50,10*S182+10*U182+(R182-20)*V182,0)))+(IF(AND(C55=C222,R182<=50),R182*100,0)))","v":2500}]
[]
[]
[null,null,null,null,null,null,"Bundesland:",{"$f":"Berechnungen!F6","v":"O"}]
[null,null,"einmal"]
[null,null,"zweimal"]
[null,null,"dreimal"]
[null,null,"viermal",null,null,null,null,null,"Sonstige Förderungen (z.B.: Gemeinde)","Fördermittel Land",null,null,"Investitionsförderung - Bund","Eigenmittel"]
[null,null,null,null,null,null,null,"Fördequote",{"$f":"H91","v":0},{"$f":"F218","v":0},null,null,{"$f":"G218","v":2850},{"$f":"H92","v":16150}]
[]
[]
[null,null,null,null,null,null,"Tarifförderung","> 20 kWp",{"$f":"H104","v":0.25600000000000001},null,null,null,{"$f":"IF($H$63=\"Überschusseinspeisung\",0,I60-I194)","v":-0.25600000000000001},null,null,"Markt/EVU"]
[null,null,null,null,null,null,null,"> 5 - 20 kWp",{"$f":"H104","v":0.25600000000000001},null,null,null,{"$f":"IF($H$63=\"Überschusseinspeisung\",0,I59-I195)","v":-0.25600000000000001},null,null,"Förderungsanteil"]
[null,null,"Zuschlag",null,null,null,null,"<= 5 kWp",{"$f":"H104","v":0.25600000000000001},null,null,null,{"$f":"H79-I196","v":2.8200000000000003E-2},null,null,"Mischpreis aus Markt/EVU und Eigenverbrauch"]
[null,null,"Abschlag"]
[null,null,"weder noch"]
[null,null,"Volleinspeisung"]
[null,null,"Überschusseinspeisung"]
[null,null,"Einspeisetarif"]
[]
[null,null,"LAND",null,null,null,"Alte Formeln für die Berechnung der Klien-förderung",null,null,null,null,null,null,null,null,null,null,null,null,null,null,null,"Das Ausmaß der Förderung beträgt maximal 40 Prozent der förderfähigen Gesamtkosten in Form eines einmaligen Investitionskostenzuschusses. Für Photovoltaikanlagen ist eine Förderobergrenze von 800 Euro pro kWp bzw. 80.000 Euro pro Förderfall vorgesehen."]
[null,null,"BUND",null,null,null,{"$f":"IF(AND($H$63<>\"Fördertarif\",D209=$H$186,$E$66=$C$204),IF(H37*800>4000,4000,H37*800),0)","v":0}]
[null,null,null,null,null,null,{"$f":"IF(AND($H$63<>\"Fördertarif\",D210=$H$186),IF(H37*800>4000,4000,H37*800),0)","v":0},null,null,null,null,null,null,null,null,null,null,null,null,null,null,null,"Voraussetzung dafür sind mindestens 900 Volllaststunden im Jahr unter Nachweis standardisierter Berechnungsmethoden und die Einspeisung ins öffentliche Netz muss möglich sein."]
[]
[null,null,"Investitionsförderung",null,null,"LAND","BUND",null,"Kommentar"]
[]
[null,null,null,"B",null,{"$f":"IF(AND($H$63<>C169,$H$186=D209,$E$66=$C$203),IF($H$37*275>0.3*$H$86*$H$37,0.3*$H$86*$H$37,$H$37*275),0)","v":0},{"$f":"IF(AND(D209=$H$186,$H$63=$C$170),IF($H$37<=10,$H$56*$H$37,IF($H$37<=20,$H$57*$H$37,IF($H$37<=100,$H$58*$H$37,IF($H$37<=1000,$H$59*$H$37,0)))),0)","v":0},{"$f":"IF(AND(D209=$H$186,$H$63=\"Fördertarif\",OR($C$55=\"Aufdach\",AND($C$55=\"Gebäudeintegriert\",$C$57=$C$197)),$H$37<=200,$H$37>5),IF($H$37*250>$H$89*0.4,$H$89*0.4,$H$37*250),0)","v":0},"keine Landesförderung"]
[null,null,null,"K",null,0,0,{"$f":"IF(AND(D210=$H$186,$H$63=\"Fördertarif\",OR($C$55=\"Aufdach\",AND($C$55=\"Gebäudeintegriert\",$C$57=$C$197)),$H$37<=200,$H$37>5),IF($H$37*250>$H$89*0.4,$H$89*0.4,$H$37*250),0)","v":0},"Förderprogramm im Zuge der Wohnbauförderung (Link im Register \"Förderungen\")"]
[null,null,null,"N",null,0,{"$f":"IF(AND(D211=$H$186,$H$63=$C$170),IF($H$37<=10,$H$56*$H$37,IF($H$37<=20,$H$57*$H$37,IF($H$37<=100,$H$58*$H$37,IF($H$37<=1000,$H$59*$H$37,0)))),0)","v":0},0,"keine Landesförderung"]
[null,null,null,"O",null,0,{"$f":"IF(AND(D212=$H$186,$H$63=$C$170),IF($H$37<=10,$H$56*$H$37,IF($H$37<=20,$H$57*$H$37,IF($H$37<=100,$H$58*$H$37,IF($H$37<=1000,$H$59*$H$37,0)))),0)","v":2850},0,"keine Landesförderung"]
[null,null,null,"Sa",null,{"$f":"IF(AND(D213=$H$186,H63=C172),IF(H37>15,0,IF(H37*F56>H89*0.4,H89*0.4,H37*F56)),0)","v":0},0,0,"Förderspanne 1-15 kWp; Förderprogramm Photovoltaik (private) und Speicher (Link im Register \"Förderungen\")"]
[null,null,null,"St",null,{"$f":"IF(AND($H$63<>\"Fördertarif\",D214=$H$186,G214=0,$H$37>=1,$H$37<=3),270*$H$37,0)","v":0},0,0,"keine Landesförderung"]
[null,null,null,"T",null,0,0,0,"keine Landesförderung"]
[null,null,null,"V",null,{"$f":"IF(AND($H$63<>\"Fördertarif\",$H$186=D216,$E$66=$C$203),IF($H$37>5,$F$56*5,$H$37*$F$56),0)","v":0},0,0,"keine Landesförderung"]
[null,null,null,"W",null,{"$f":"IF(AND($H$63=C172,$H$186=D217),IF(H37<=100,IF(H37*F56>H89*0.3,H89*0.3,H37*F56),IF(H37<=500,IF(H37*(F56-50)>H89*0.3,H89*0.3,H37*(F56-50)),100000)),0)","v":0},0,0,"Landesförderung max. 30% der Investkosten 250€/kWp bis 100kWp, 200€/kWp von 100 bis 500kWp",null,null,null,null,null,null,{"$f":"IF(H37<=5,F56*0.5*H37,F56*0.5*5+((H37-5)*F56))","v":{"$error":"#VALUE!"}}]
[null,null,null,null,null,{"$f":"SUM(F209:F217)","v":0},{"$f":"IF(C57=C196,SUM(G209:G217)*1.3,IF(C57=C197,SUM(G209:G217)*0.75,SUM(G209:G217)))","v":2850},{"$f":"SUM(H209:H217)","v":0},{"$f":"F218+G218+H218","v":2850},"Summe aus Bundes und Landesmittel"]
[null,null,null,null,null,null,null,null,null,null,null,null,null,null,null,null,null,null,null,null,null,null,"maxförderung 40%",null,null,"Faktor bund","Faktor land"]
[null,null,null,null,null,null,{"$f":"I218/H89","v":0.15},"Förderungsprozentsatz",null,null,null,null,null,null,null,null,null,null,null,null,null,null,{"$f":"H89*0.4","v":7600},null,null,{"$f":"S220/U221","v":{"$error":"#DIV/0!"}},{"$f":"U220/U221","v":{"$error":"#DIV/0!"}}]
[null,null,null,null,null,null,null,null,null,null,null,null,null,null,null,null,null,null,null,null,null,null,{"$f":"IF(W220>=U221,0,U221-W220)","v":0}]
[null,null,"Gebäudeintegriert"]
[null,null,"Aufdach",null,null,null,null,null,null,null,null,null,null,null,null,null,null,null,null,null,null,null,{"$f":"S223+U223","v":0}]
[null,null,"Freiland"]
[]
[null,null,null,null,null,null,null,null,null,null,null,null,null,null,null,null,null,null,null,null,null,null,null,null,null,null,"bis 2 WE"]
[null,null,null,null,null,null,null,null,null,null,null,null,null,null,null,null,null,null,null,null,null,null,null,null,null,null,"ab 3 WE"]
[]
[]
[null,null,null,"Aufdach <5",null,"Aufdach >20",null,"Freiland <20",null,"Freiland >20",null,null,null,null,null,null,null,null,null,null,null,null,null,null,375]
[null,null,"Wartelistenposition","Abschlag","Tarif","Abschlag","Tarif","Abschlag","Tarif","Abschlag",null,null,"Tarif"]
[null,null,null,null,null,null,null,null,null,null,null,null,null,null,null,null,null,null,null,null,null,null,"PV Fördersummen 2015","ab 3 WE",null,"bis 2 WE"]
[null,null,2013,0,7.0599999999999996E-2,0,0,0,0,0,null,null,0.19,null,null,null,null,null,null,null,null,null,"kWp","Erweiterung","Neubau","Erweiterung","Neubau"]
[null,null,null,null,null,null,null,null,null,null,null,null,null,null,null,null,null,null,null,null,null,null,1.5,{"$f":"55*(W234/0.5)","v":165},{"$f":"535+Y230","v":910},{"$f":"55*(W234/0.5)","v":165},{"$f":"535+Y230","v":910},null,"Anzahl","der","Wohneinheiten","(WE)","Förderungsfähige","–","neue","oder","erweiterte","Leistung","[ab","zurechenbaren,","erreichten","kWp]","Förderung","[€]"]
[null,null,null,null,null,null,null,null,null,null,null,null,null,null,null,null,null,null,null,null,null,{"$f":"H37","v":10},2,220,{"$f":"590+Y230","v":965},{"$f":"55*(W235/0.5)","v":220},{"$f":"590+Y230","v":965},null,"Gebäude","bis","zu",2,"WE","und","Gebäude","gem.","Punkt","2015-02-03"]
[null,null,null,null,null,null,null,null,null,null,null,null,null,null,null,null,null,null,null,null,null,{"$f":"ROUNDDOWN(V235,0)","v":10},2.5,275,{"$f":"645+Y230","v":1020},{"$f":"55*(W236/0.5)","v":275},{"$f":"645+Y230","v":1020},null,"Je",0.5,"erweitert"]
[null,null,null,null,null,null,null,null,null,null,null,null,null,null,null,null,null,null,null,null,null,{"$f":"V235-V236","v":0},3,330,{"$f":"700+Y230","v":1075},{"$f":"55*(W237/0.5)","v":330},{"$f":"700+Y230","v":1075},null,"55,--"]
[null,null,null,null,null,null,null,null,null,null,null,null,null,null,null,null,null,null,null,null,null,{"$f":"IF(V237>=0.5,V236+0.5,V236)","v":10},3.5,385,{"$f":"Y237+55","v":1130},null,null,null,1.5,"neu"]
[null,null,null,null,{"$f":"E233","v":7.0599999999999996E-2},null,{"$f":"G233","v":0},null,{"$f":"I233","v":0},null,null,null,{"$f":"M233","v":0.19},0.18,null,null,null,null,null,null,{"$f":"IF(F66=AA226,V240,V239)","v":1845},{"$f":"IF(OR(V238>15,H111<900),0,VLOOKUP(V238,W235:Y261,IF(X233=G66,2,3),TRUE))","v":1845},4,440,{"$f":"Y238+55","v":1185},null,null,null,"535,--"]
[null,null,null,null,{"$f":"IF(AND($H$37>5,$H$37<=20),E239,IF($H$37>20,G239,0))","v":7.0599999999999996E-2},null,null,null,{"$f":"IF(AND($H$37>5,$H$37<=20),I239,IF($H$37>20,M239,0))","v":0},null,null,null,null,null,null,null,null,null,null,null,null,{"$f":"IF(OR(V238>15,H111<900),0,VLOOKUP(V238,W235:AA261,IF(X233=G66,4,5),TRUE))","v":0},4.5,495,1240,null,null,null,2,"neu"]
[null,null,null,null,{"$f":"IF($C$55=C223,E240,I240)","v":7.0599999999999996E-2},null,null,null,null,null,null,null,null,null,null,null,null,null,null,null,null,null,5,550,1295,null,null,null,"590,--"]
[null,null,null,null,null,null,null,null,null,null,null,null,null,null,null,null,null,null,null,null,null,null,5.5,605,1350,null,null,null,2.5,"neu"]
[null,null,null,null,null,null,null,null,null,null,null,null,null,null,null,null,null,null,null,null,null,null,6,660,1405,null,null,null,"645,--"]
[null,null,null,null,"Aufdach","Freiland",null,null,null,null,null,null,null,null,null,null,null,null,null,null,null,null,6.5,715,1460,null,null,null,3,"neu"]
[null,null,2013,null,">5",">5",null,null,null,null,null,null,null,null,null,null,null,null,null,null,null,null,7,770,1515,null,null,null,"700,--"]
[null,null,null,null,0.1812,0.16589999999999999,null,null,null,null,null,null,null,null,null,null,null,null,null,null,null,null,7.5,825,1570,null,null,null,"Gebäude","ab",3,"WE"]
[null,null,"optieren:",null,0.18,0,null,null,null,null,null,null,null,null,null,null,null,null,null,null,null,null,8,880,1625,null,null,null,"Wie","oben"]
[null,null,"Invest:",null,200,null,null,null,null,null,null,null,"Salzburg",{"$f":"IF(OR(H37<1,H37>3,H111<800),0,600)","v":0},null,null,null,null,null,null,null,null,8.5,935,1680,null,null,null,">",3,"je","weitere",0.5,"kWp"]
[null,null,null,null,null,null,null,null,null,null,null,null,{"$f":"IF(H86>2000,2000,H86)","v":1900},null,null,null,null,null,null,null,null,null,9,990,1735,null,null,null,"55,--"]
[null,null,null,null,null,null,null,null,null,null,null,null,{"$f":"H111","v":995.74037647058844},{"$f":"IF(M250>1100,0.4,IF(M250<900,0,M250/27.5/100))","v":0.36208740962566849},{"$f":"M249*N250","v":687.96607828877018},{"$f":"IF($H$37>2,$O$250*2,$O$250*$H$37)","v":1375.9321565775404},null,null,null,null,null,null,9.5,1045,1790,null,null,null,"max.",3,"kWp","je","Wohnung","und","max.15","kWp","je","Gebäude","gesamt"]
[null,null,null,null,null,null,null,null,null,null,null,null,{"$f":"M250/27.5","v":36.20874096256685},null,null,null,null,"Wien",null,null,null,null,10,1100,1845,null,null,null,"max.","2.020,--"]
[null,null,null,null,null,null,null,null,null,null,null,null,null,null,null,null,null,"Land","Bund","Gesamt",null,null,10.5,1155,1900]
[null,null,null,null,null,null,null,null,null,null,null,null,null,null,null,null,1,500,800,{"$f":"SUM(R253:S253)","v":1300},null,null,11,1210,1955]
[null,null,null,null,null,null,null,null,null,null,null,null,null,null,null,null,2,500,800,{"$f":"SUM(R254:S254)","v":1300},null,null,11.5,1265,2010]
[null,null,null,null,null,null,null,null,"Förderhöhe:",null,null,null,null,null,null,null,3,500,800,1300,null,null,12,1320,2065]
[null,null,null,null,null,null,null,null,"Die Förderung kann in Form eines nicht rückzahlbaren Direktzuschusses abhängig vom Fördersatz (siehe Richtlinien) auf die tatsächlichen Investitionskosten (=Rechnungssumme) bis zur Höhe der förderbaren Investitionskosten gewährt werden.",null,null,null,null,null,null,null,4,500,800,1300,null,null,12.5,1375,2120]
[null,null,null,null,null,null,null,null,"Die Förderung besteht aus förderbaren Investitionskosten, die pro kWp 2.000 Euro beträgt. Davon ausgehen wird, je nach Jahresertrag der Anlage, der Fördersatz festgelegt und damit die Förderung berechnet.",null,null,null,null,null,null,null,5,500,800,1300,null,null,13,1430,2175]
[null,null,null,null,null,null,null,null,null,null,null,null,null,null,null,null,6,1000,0,1000,null,null,13.5,1485,2230]
[null,null,null,null,null,null,null,null,"Fördersatz in Abhängigkeit vom Jahresenergieertrag (berechnet laut Anlagenplanung) je kWp:",null,null,null,null,null,null,null,7,1000,0,1000,null,null,14,1540,2285]
[null,null,null,null,null,null,null,null,"- Beträgt der Jahresertrag zwischen 900 kWh/a und 1.100 kWh/a, wird der Fördersatz [%] wie folgt errechnet:",null,null,null,null,null,null,null,8,1000,0,1000,null,null,14.5,1595,2340]
[null,null,null,null,null,null,null,null,"Jahresertrag [kWh/a]/ 27,5",null,null,null,null,null,null,null,null,null,null,null,null,null,15,1650,2395]
[null,null,null,null,null,null,null,null,"- Ist der Jahresertrag > 1.100 kWh/a: Fördersatz = 40 %"]
[null,null,null,null,null,null,null,null,"- Ist der Jahresertrag < 900 kWh/a: Fördersatz = 0 %"]
[null,null,null,null,null,null,null,null,null,null,null,null,null,null,null,null,null,{"$f":"IF((IF(H37<=5,F56*0.5*H37+H37*H56,F56*0.5*5+((H37-5)*F56)+5*H56))>0.4*H89,IF(0.4*H89>100000,100000,0.4*H89),IF(H37<=5,F56*0.5*H37+H37*H56,F56*0.5*5+((H37-5)*F56)+5*H56))","v":{"$error":"#VALUE!"}}]
[null,null,null,null,null,null,null,null,null,null,null,null,null,null,null,null,null,{"$f":"IF(AND($H$63<>\"Fördertarif\",D217=$H$186),IF((IF(H37<=5,F56*0.5*H37+H37*H56,F56*0.5*5+(H37-5)*F56+5*H56))>0.4*H89,IF(0.4*H89>100000,100000,0.4*H89),IF(H37<=5,F56*0.5*H37+H37*H56,F56*0.5*5+((H37-5)*F56+5*H56))))","v":false}]
[null,null,null,null,null,null,null,null,"Beispiele",null,null,null,null,null,null,null,null,null,null,null,null,{"$f":"H37","v":10}]
[null,null,null,null,null,null,null,null,"- > 1.100 kWh - Fördersatz 40 %",null,null,null,null,null,null,null,null,null,null,null,null,{"$f":"ROUNDDOWN(V266,0)","v":10},1,500]
[null,null,null,null,null,null,null,null,"- > 1.000 kWh - Fördersatz 36,4 %",null,null,null,null,null,null,null,null,null,null,null,null,{"$f":"VLOOKUP(V267,W267:X271,2,TRUE)","v":900},2,600]
[null,null,null,null,null,null,null,null,"- 900 kWh - Fördersatz 32,7 %",null,null,null,null,null,null,null,null,null,null,null,null,null,3,700]
[null,null,null,null,null,null,null,null,"- < 900 kWh - Fördersatz 0 %",null,null,null,null,null,null,null,null,null,null,null,null,null,4,800]
[null,null,null,null,null,null,null,null,null,null,null,null,null,null,null,null,null,null,null,null,null,null,5,900]

{"sheet":"Ausrichtung","index":3,"n_rows":51,"n_cols":36,"rows_kept":51,"cut":false,"hidden":false,"merged":[[7,1,13,1],[23,1,29,1],[37,1,43,1]]}
[]
[null,null,null,null,null,null,null,null,null,null,null,null,null,null,null,null,null,null,null,null,null,null,null,null,null,null,null,null,null,null,null,null,{"$f":"HLOOKUP(AD13,D6:P7,2,TRUE)","v":8}]
[]
[null,null,null,null,null,null,null,null,null,null,null,null,null,null,null,null,null,null,null,null,null,null,null,null,null,null,"Neigung",78,{"$f":"C8","v":0},{"$f":"VLOOKUP(AB4,AC4:AC10,1)","v":75},"untere Grenze",{"$f":"AB4-AD4","v":3},{"$f":"VLOOKUP(AD5,C6:P14,AG2,TRUE)","v":65},null,null,{"$f":"HLOOKUP(AB4,C6:P14,3,TRUE)","v":85}]
[null,null,null,"Osten",null,null,null,null,null,"Azimut",null,null,null,null,null,"Westen",null,null,"Prozent",null,null,null,null,null,null,null,null,{"$f":"AB4","v":78},15,{"$f":"AD4+15","v":90},"obere Grenze",{"$f":"AD5-AB4","v":12},null,null,null,{"$f":"VLOOKUP(AB13,C6:P14,1,TRUE)","v":15}]
[null,null,null,-90,-75,-60,-45,-30,-15,0,15,30,45,60,75,90,null,null,55,null,null,null,null,null,null,null,null,78,30]
[null,null,null,1,2,3,4,5,6,7,8,9,10,11,12,13,null,null,65,null,null,null,null,null,null,null,null,78,45]
[null,"Neigung",0,85,85,85,85,85,85,85,85,85,85,85,85,85,null,null,75,null,null,null,null,null,null,null,null,78,60]
[null,null,15,85,85,85,95,95,95,95,95,95,95,85,85,85,null,null,85,null,null,null,null," ",null,null,null,78,75]
[null,null,30,85,85,85,95,95,95,100,95,95,95,85,85,85,null,null,95,null,null,null,null,null,null,null,null,78,90]
[null,null,45,75,85,85,85,95,95,95,95,95,85,85,85,75,null,null,100]
[null,null,60,75,75,75,85,85,85,85,85,85,85,75,75,75]
[null,null,75,65,65,75,75,75,75,75,75,75,75,75,65,65,null,null,null,null,null,null,null,null,null,null,"Azimut",20,-90,{"$f":"VLOOKUP(AB13,AC13:AC25,1)","v":15},"untere Grenze",{"$f":"AB13-AD13","v":5}]
[null,null,90,55,55,65,65,65,65,65,65,65,65,65,55,55,null,null,null,null,null,null,null,null,null,null,null,{"$f":"AB13","v":20},-75,{"$f":"AD13+15","v":30},"obere Grenze",{"$f":"AD14-AB13","v":10}]
[null,null,"Angaben in Prozent",null,null,null,null,null,null,null,null,null,null,null,null,null,null,null,null,null,null,null,null,null,null,null,null,{"$f":"AB14","v":20},-60]
[null,null,null,null,null,null,null,null,null,null,null,null,null,null,null,null,null,null,null,null,null,null,null,null,null,null,null,20,-45]
[null,null,"Einstrahlung auf die horizontale Fläche:",null,null,null,null,null,{"$f":"Eingabe!H15","v":1068},"kWh/m²a",null,null,{"$f":"I17/85","v":12.564705882352941},null,null,null,null,null,null,null,null,null,null,null,null,null,null,20,-30]
[null,null,null,null,null,null,null,null,null,null,null,null,null,null,null,null,null,null,null,null,null,null,null,null,null,null,null,20,-15]
[null,null,null,null,null,null,null,null,null,null,null,null,null,null,null,null,null,null,null,null,null,null,null,null,null,null,null,20,0]
[null,null,null,null,null,null,null,null,null,null,null,null,null,null,null,null,null,null,null,null,null,null,null,null,null,null,null,20,15]
[null,null,null,"Osten",null,null,null,null,null,"Azimut",null,null,null,null,null,"Westen",null,null,null,null,null,null,null,null,null,null,null,20,30]
[null,null,null,-90,-75,-60,-45,-30,-15,0,15,30,45,60,75,90,null,null,null,null,null,null,null,null,null,null,null,20,45]
[null,null,null,1,2,3,4,5,6,7,8,9,10,11,12,13,null,null,null,null,null,null,null,null,null,null,null,20,60]
[null,"Neigung",0,{"$f":"$M$17*D8","v":1068},1068,1068,1068,1068,1068,1068,1068,1068,1068,1068,1068,1068,null,null,null,null,null,null,null,null,null,null,null,20,75]
[null,null,15,{"$f":"$M$17*D9","v":1068},1068,1068,1193.6470588235293,1193.6470588235293,1193.6470588235293,1193.6470588235293,1193.6470588235293,1193.6470588235293,1193.6470588235293,1068,1068,1068,null,null,null,null,null,null,null,null,null,null,null,20,90]
[null,null,30,{"$f":"$M$17*D10","v":1068},1068,1068,1193.6470588235293,1193.6470588235293,1193.6470588235293,1256.4705882352941,1193.6470588235293,1193.6470588235293,1193.6470588235293,1068,1068,1068]
[null,null,45,{"$f":"$M$17*D11","v":942.35294117647061},1068,1068,1068,1193.6470588235293,1193.6470588235293,1193.6470588235293,1193.6470588235293,1193.6470588235293,1068,1068,1068,942.35294117647061]
[null,null,60,{"$f":"$M$17*D12","v":942.35294117647061},942.35294117647061,942.35294117647061,1068,1068,1068,1068,1068,1068,1068,942.35294117647061,942.35294117647061,942.35294117647061]
[null,null,75,{"$f":"$M$17*D13","v":816.70588235294122},816.70588235294122,942.35294117647061,942.35294117647061,942.35294117647061,942.35294117647061,942.35294117647061,942.35294117647061,942.35294117647061,942.35294117647061,942.35294117647061,816.70588235294122,816.70588235294122]
[null,null,90,{"$f":"$M$17*D14","v":691.05882352941171},691.05882352941171,816.70588235294122,816.70588235294122,816.70588235294122,816.70588235294122,816.70588235294122,816.70588235294122,816.70588235294122,816.70588235294122,816.70588235294122,691.05882352941171,691.05882352941171]
[null,null,"Angaben in kWh/m²a"]
[]
[]
[]
[null,null,null,"Osten",null,null,null,null,null,"Azimut",null,null,null,null,null,"Westen"]
[null,null,null,-90,-75,-60,-45,-30,-15,0,15,30,45,60,75,90]
[null,null,null,1,2,3,4,5,6,7,8,9,10,11,12,13]
[null,"Neigung",0,{"$f":"IF($F$51=0,D24,\"\")","v":""},"","","","","","","","","","","",""]
[null,null,15,{"$f":"IF($F$51=15,D25,\"\")","v":""},"","","","","","","","","","","",""]
[null,null,30,{"$f":"IF($F$51=30,D26,\"\")","v":""},"","","","","","","","","","","",""]
[null,null,45,{"$f":"IF($F$51=45,D27,\"\")","v":942.35294117647061},1068,1068,1068,1193.6470588235293,1193.6470588235293,1193.6470588235293,1193.6470588235293,1193.6470588235293,1068,1068,1068,942.35294117647061]
[null,null,60,{"$f":"IF($F$51=60,D28,\"\")","v":""},"","","","","","","","","","","",""]
[null,null,75,{"$f":"IF($F$51=75,D29,\"\")","v":""},"","","","","","","","","","","",""]
[null,null,90,{"$f":"IF($F$51=90,D30,\"\")","v":""},"","","","","","","","","","","",""]
[null,null,"Angaben in kWh/m²a"]
[]
[null,"Auswahl:",null,{"$f":"IF($F$50=-90,SUM(D38:D44),\"\")","v":""},{"$f":"IF($F$50=-75,SUM(E38:E44),\"\")","v":""},{"$f":"IF($F$50=-60,SUM(F38:F44),\"\")","v":""},{"$f":"IF($F$50=-45,SUM(G38:G44),\"\")","v":""},{"$f":"IF($F$50=-30,SUM(H38:H44),\"\")","v":""},{"$f":"IF($F$50=-15,SUM(I38:I44),\"\")","v":""},{"$f":"IF($F$50=0,SUM(J38:J44),\"\")","v":1193.6470588235293},{"$f":"IF($F$50=15,SUM(K38:K44),\"\")","v":""},{"$f":"IF($F$50=30,SUM(L38:L44),\"\")","v":""},{"$f":"IF($F$50=45,SUM(M38:M44),\"\")","v":""},{"$f":"IF($F$50=60,SUM(N38:N44),\"\")","v":""},{"$f":"IF($F$50=75,SUM(O38:O44),\"\")","v":""},{"$f":"IF($F$50=90,SUM(P38:P44),\"\")","v":""}]
[]
[null,null,"Zuteilung der Werte aus der Einagbemaske:"]
[null,null,null,null,"Ausrichtung:",{"$f":"Eingabe!$H$23","v":0},"°"]
[null,null,null,null,"Neigung:",{"$f":"Eingabe!$H$29","v":45},"°",{"$f":"SUM(D47:P47)","v":1193.6470588235293},"kWh/m²a"]

{"sheet":"Berechnungen","index":4,"n_rows":89,"n_cols":36,"rows_kept":89,"cut":false,"hidden":false,"merged":[[6,2,6,3]]}
[]
[]
[]
[]
[]
[null,"Anlage:",{"$f":"Eingabe!H37","v":10},"kWp","Bundesland:",{"$f":"'PLZ-Zuordnung'!J3","v":"O"}]
[null,"Tarif:",{"$f":"Eingabe!H63","v":"EAG Investzuschuss"},null,"Tarifhöhe:",{"$f":"H64","v":0},"Cent/kWh"]
[]
[null,"Jahre","Vergütung","Energieertrag","Energieerlös","Ausgaben","Tilgung","Zinsen","Tilg.+Zinsen","Cash Flow","Barwerte","Kapitalwert","Zeit",null,"Auswahl","Einspeisetarif","Bezugstarif","Fördertarif","Fördertarif 1","Sondertarif",null,"EV-Abgabe",null,null,null,null,null,"test",null,null,null,"test stat",null,null,null,"test dyn"]
[null,null,"[€/kWh]","[kWh]","[€]","[€]","[€]","[€]","[€]","[€]","[€]","[€]",null,null,"[€/kWh]","[€/kWh]","[€/kWh]","[€/kWh]","[€/kWh]","[€/kWh]",null,"[€]",null,null,"tarif","energie",null,"Ausgaben","Ausgaben","erzeugte kWh","€/kWh"]
[null,0,null,null,null,{"$f":"Eingabe!H92*Eingabe!H87","v":16150},null,null,{"$f":"G11+H11","v":0},{"$f":"E11-F11-I11","v":-16150},{"$f":"J11/(1+(Eingabe!H$106/100))^B11","v":-16150},{"$f":"K11","v":-16150},{"$f":"IF(L11<0,N11,0)","v":1},1,null,null,null,null,null,null,null,null,null,"Tarif","Energie",null,null,{"$f":"F11","v":16150},{"$f":"F11","v":16150}]
[null,1,{"$f":"IF($C$7=\"Invest- inkl. Tarifförderung\",O12,T12)","v":0.28420000000000001},{"$f":"Eingabe!$H$112*1/(1+(Eingabe!H$98/100))^B11","v":9957.4037647058849},{"$f":"C12*D12","v":2829.8941499294124},{"$f":"(Eingabe!H$89*(Eingabe!H$97/100))*((1+(Eingabe!H$102/100))^B11)","v":76},{"$f":"IF(AND(Eingabe!$J$88<=Berechnungen!B12,(Eingabe!$J$88+Eingabe!$J$89)>B12),(Eingabe!$H$92*(1-Eingabe!$H$87))/Eingabe!$J$89,0)","v":0},{"$f":"((Eingabe!$H$92*(1-Eingabe!$H$87))-SUM($G$11:G11))*Eingabe!$I$87","v":0},0,{"$f":"E12-F12-I12","v":2753.8941499294124},{"$f":"J12/(1+(Eingabe!H$106/100))^B12","v":2713.1962068270077},{"$f":"L11+K12","v":-13436.803793172992},{"$f":"IF(L12<0,N12,0)","v":2},2,{"$f":"IF(Eingabe!$H$63=Eingabe!$C$169,IF(R12<>0,IF(Eingabe!$H$65=Eingabe!$C$200,S12,R12),P12),IF(Eingabe!$H$63=Eingabe!$C$171,T12,IF(Eingabe!$H$63=Eingabe!$C$170,T12,IF(Eingabe!$H$63=Eingabe!$C$172,T12,\"Zuordnung!\"))))","v":0.28420000000000001},{"$f":"Eingabe!H$104*(1+(Eingabe!H$105/100))^B11","v":0.25600000000000001},{"$f":"Eingabe!H$103*(1+(Eingabe!H$105/100))^B11","v":0.35},{"$f":"$F$7","v":0},{"$f":"IF(Eingabe!$H$65=\"Volleinspeisung\",Berechnungen!R12,(R12*Eingabe!$H$74+Berechnungen!Q12*Eingabe!$H$73)/100)","v":0.105},{"$f":"(P12*Eingabe!$H$74+Berechnungen!Q12*Eingabe!$H$73)/100","v":0.28420000000000001},null,{"$f":"IF(Eingabe!$H$112*Eingabe!$H$73/100>25000,IF((Eingabe!$H$112*Eingabe!$H$73/100-25000)*0.015<=50,0,(Eingabe!$H$112*Eingabe!$H$73/100-25000)*0.015),0)","v":0},{"$f":"O12*100","v":28.42},{"$f":"(Q12*Eingabe!$H$73/100)/Eingabe!H79*100","v":36.945812807881772},{"$f":"Eingabe!$H$73","v":30},null,{"$f":"F12/(1+(Eingabe!H$106/100))^B12","v":74.876847290640399},{"$f":"AB11+AA12","v":16224.876847290641},{"$f":"F11+F12","v":16226},{"$f":"D12","v":9957.4037647058849},{"$f":"AC12/AD12","v":1.6295412321747176},{"$f":"AB12/AD12","v":1.6294284364364009},{"$f":"IF(AF12<O12,AF12,0)","v":0},{"$f":"IF(AG11=0,$AG$37,0)","v":0},1,{"$f":"AF12*(1+(Eingabe!H$106/100))^AI12","v":1.6538698629829467}]
[null,2,{"$f":"IF($C$7=\"Invest- inkl. Tarifförderung\",O13,T13)","v":0.27851599999999999},{"$f":"Eingabe!$H$112*1/(1+(Eingabe!H$98/100))^B12","v":9907.8644424934191},{"$f":"C13*D13","v":2759.4987730654971},{"$f":"(Eingabe!H$89*(Eingabe!H$97/100))*((1+(Eingabe!H$102/100))^B12)","v":79.040000000000006},{"$f":"IF(AND(Eingabe!$J$88<=Berechnungen!B13,(Eingabe!$J$88+Eingabe!$J$89)>B13),(Eingabe!$H$92*(1-Eingabe!$H$87))/Eingabe!$J$89,0)","v":0},{"$f":"((Eingabe!$H$92*(1-Eingabe!$H$87))-SUM($G$11:G12))*Eingabe!$I$87","v":0},0,2680.4587730654971,{"$f":"J13/(1+(Eingabe!H$106/100))^B13","v":2601.8187998403241},-10834.984993332668,{"$f":"IF(L13<0,N13,0)","v":3},3,{"$f":"IF(Eingabe!$H$63=Eingabe!$C$169,IF(R13<>0,IF(Eingabe!$H$65=Eingabe!$C$200,S13,R13),P13),IF(Eingabe!$H$63=Eingabe!$C$171,T13,IF(Eingabe!$H$63=Eingabe!$C$170,T13,IF(Eingabe!$H$63=Eingabe!$C$172,T13,\"Zuordnung!\"))))","v":0.27851599999999999},{"$f":"Eingabe!H$104*(1+(Eingabe!H$105/100))^B12","v":0.25087999999999999},{"$f":"Eingabe!H$103*(1+(Eingabe!H$105/100))^B12","v":0.34299999999999997},0,{"$f":"IF(Eingabe!$H$65=\"Volleinspeisung\",Berechnungen!R13,(R13*Eingabe!$H$74+Berechnungen!Q13*Eingabe!$H$73)/100)","v":0.10289999999999999},{"$f":"(P13*Eingabe!$H$74+Berechnungen!Q13*Eingabe!$H$73)/100","v":0.27851599999999999},null,{"$f":"IF(Eingabe!$H$112*Eingabe!$H$73/100>25000,IF((Eingabe!$H$112*Eingabe!$H$73/100-25000)*0.015<=50,0,(Eingabe!$H$112*Eingabe!$H$73/100-25000)*0.015),0)","v":0},{"$f":"O13*100","v":27.851599999999998},{"$f":"(P12*Eingabe!$H$74/100)/Eingabe!H79*100","v":63.054187192118235},{"$f":"Eingabe!$H$74","v":70},null,{"$f":"F13/(1+(Eingabe!H$106/100))^B13","v":76.721104613069983},{"$f":"AB12+AA13","v":16301.597951903712},{"$f":"AC12+F13","v":16305.04},{"$f":"AD12+D13","v":19865.268207199304},{"$f":"AC13/AD13","v":0.82078126657715833},{"$f":"AB13/AD13","v":0.82060799692580566},{"$f":"IF(AF13<O13,AF13,0)","v":0},0,2,{"$f":"AF13*(1+(Eingabe!H$106/100))^AI13","v":0.84541087363288792}]
[null,3,0.27294567999999997,{"$f":"Eingabe!$H$112*1/(1+(Eingabe!H$98/100))^B13","v":9858.5715845705672},2690.8545249792905,{"$f":"(Eingabe!H$89*(Eingabe!H$97/100))*((1+(Eingabe!H$102/100))^B13)","v":82.201600000000013},{"$f":"IF(AND(Eingabe!$J$88<=Berechnungen!B14,(Eingabe!$J$88+Eingabe!$J$89)>B14),(Eingabe!$H$92*(1-Eingabe!$H$87))/Eingabe!$J$89,0)","v":0},{"$f":"((Eingabe!$H$92*(1-Eingabe!$H$87))-SUM($G$11:G13))*Eingabe!$I$87","v":0},0,2608.6529249792907,{"$f":"J14/(1+(Eingabe!H$106/100))^B14","v":2494.6991229299274},-8340.2858704027403,4,4,{"$f":"IF(Eingabe!$H$63=Eingabe!$C$169,IF(R14<>0,IF(Eingabe!$H$65=Eingabe!$C$200,S14,R14),P14),IF(Eingabe!$H$63=Eingabe!$C$171,T14,IF(Eingabe!$H$63=Eingabe!$C$170,T14,IF(Eingabe!$H$63=Eingabe!$C$172,T14,\"Zuordnung!\"))))","v":0.27294567999999997},{"$f":"Eingabe!H$104*(1+(Eingabe!H$105/100))^B13","v":0.24586239999999998},{"$f":"Eingabe!H$103*(1+(Eingabe!H$105/100))^B13","v":0.33613999999999994},0,{"$f":"IF(Eingabe!$H$65=\"Volleinspeisung\",Berechnungen!R14,(R14*Eingabe!$H$74+Berechnungen!Q14*Eingabe!$H$73)/100)","v":0.10084199999999997},{"$f":"(P14*Eingabe!$H$74+Berechnungen!Q14*Eingabe!$H$73)/100","v":0.27294567999999997},null,{"$f":"IF(Eingabe!$H$112*Eingabe!$H$73/100>25000,IF((Eingabe!$H$112*Eingabe!$H$73/100-25000)*0.015<=50,0,(Eingabe!$H$112*Eingabe!$H$73/100-25000)*0.015),0)","v":0},27.294567999999998,{"$f":"P14*Eingabe!$H$74/100","v":0.17210367999999998},{"$f":"Q14*Eingabe!$H$73/100","v":0.10084199999999997},null,{"$f":"F14/(1+(Eingabe!H$106/100))^B14","v":78.610786992702273},16380.208738896414,16387.241600000001,29723.839791769871,0.55131644211517405,0.55107983536608451,0,0,3,{"$f":"AF14*(1+(Eingabe!H$106/100))^AI14","v":0.5762522667408746}]
[null,4,0.26748676640000002,{"$f":"Eingabe!$H$112*1/(1+(Eingabe!H$98/100))^B14","v":9809.5239647468352},2623.9178452534388,{"$f":"(Eingabe!H$89*(Eingabe!H$97/100))*((1+(Eingabe!H$102/100))^B14)","v":85.489664000000005},{"$f":"IF(AND(Eingabe!$J$88<=Berechnungen!B15,(Eingabe!$J$88+Eingabe!$J$89)>B15),(Eingabe!$H$92*(1-Eingabe!$H$87))/Eingabe!$J$89,0)","v":0},{"$f":"((Eingabe!$H$92*(1-Eingabe!$H$87))-SUM($G$11:G14))*Eingabe!$I$87","v":0},0,2538.4281812534387,{"$f":"J15/(1+(Eingabe!H$106/100))^B15","v":2391.6670020924012},-5948.6188683103392,5,5,{"$f":"IF(Eingabe!$H$63=Eingabe!$C$169,IF(R15<>0,IF(Eingabe!$H$65=Eingabe!$C$200,S15,R15),P15),IF(Eingabe!$H$63=Eingabe!$C$171,T15,IF(Eingabe!$H$63=Eingabe!$C$170,T15,IF(Eingabe!$H$63=Eingabe!$C$172,T15,\"Zuordnung!\"))))","v":0.26748676640000002},{"$f":"Eingabe!H$104*(1+(Eingabe!H$105/100))^B14","v":0.240945152},{"$f":"Eingabe!H$103*(1+(Eingabe!H$105/100))^B14","v":0.32941719999999997},0,{"$f":"IF(Eingabe!$H$65=\"Volleinspeisung\",Berechnungen!R15,(R15*Eingabe!$H$74+Berechnungen!Q15*Eingabe!$H$73)/100)","v":9.8825159999999995E-2},{"$f":"(P15*Eingabe!$H$74+Berechnungen!Q15*Eingabe!$H$73)/100","v":0.26748676640000002},null,{"$f":"IF(Eingabe!$H$112*Eingabe!$H$73/100>25000,IF((Eingabe!$H$112*Eingabe!$H$73/100-25000)*0.015<=50,0,(Eingabe!$H$112*Eingabe!$H$73/100-25000)*0.015),0)","v":0},26.748676640000003,{"$f":"P15*Eingabe!$H$74/100","v":0.1686616064},{"$f":"Q15*Eingabe!$H$73/100","v":9.8825159999999995E-2},null,{"$f":"F15/(1+(Eingabe!H$106/100))^B15","v":80.547013273310696},16460.755752169724,16472.731264000002,39533.363756516708,0.41667922227550458,0.41637630062421188,0,0,4,{"$f":"AF15*(1+(Eingabe!H$106/100))^AI15","v":0.44192662882661571}]
[null,5,0.26213703107199998,{"$f":"Eingabe!$H$112*1/(1+(Eingabe!H$98/100))^B15","v":9760.7203629321757},2558.6462570630547,{"$f":"(Eingabe!H$89*(Eingabe!H$97/100))*((1+(Eingabe!H$102/100))^B15)","v":88.909250560000018},{"$f":"IF(AND(Eingabe!$J$88<=Berechnungen!B16,(Eingabe!$J$88+Eingabe!$J$89)>B16),(Eingabe!$H$92*(1-Eingabe!$H$87))/Eingabe!$J$89,0)","v":0},{"$f":"((Eingabe!$H$92*(1-Eingabe!$H$87))-SUM($G$11:G15))*Eingabe!$I$87","v":0},0,2469.7370065030545,{"$f":"J16/(1+(Eingabe!H$106/100))^B16","v":2292.5588773228765},-3656.0599909874627,6,6,{"$f":"IF(Eingabe!$H$63=Eingabe!$C$169,IF(R16<>0,IF(Eingabe!$H$65=Eingabe!$C$200,S16,R16),P16),IF(Eingabe!$H$63=Eingabe!$C$171,T16,IF(Eingabe!$H$63=Eingabe!$C$170,T16,IF(Eingabe!$H$63=Eingabe!$C$172,T16,\"Zuordnung!\"))))","v":0.26213703107199998},{"$f":"Eingabe!H$104*(1+(Eingabe!H$105/100))^B15","v":0.23612624895999998},{"$f":"Eingabe!H$103*(1+(Eingabe!H$105/100))^B15","v":0.32282885599999994},0,{"$f":"IF(Eingabe!$H$65=\"Volleinspeisung\",Berechnungen!R16,(R16*Eingabe!$H$74+Berechnungen!Q16*Eingabe!$H$73)/100)","v":9.6848656799999974E-2},{"$f":"(P16*Eingabe!$H$74+Berechnungen!Q16*Eingabe!$H$73)/100","v":0.26213703107199998},null,{"$f":"IF(Eingabe!$H$112*Eingabe!$H$73/100>25000,IF((Eingabe!$H$112*Eingabe!$H$73/100-25000)*0.015<=50,0,(Eingabe!$H$112*Eingabe!$H$73/100-25000)*0.015),0)","v":0},26.213703107199997,{"$f":"P16*Eingabe!$H$74/100","v":0.16528837427199999},{"$f":"Q16*Eingabe!$H$73/100","v":9.6848656799999974E-2},null,{"$f":"F16/(1+(Eingabe!H$106/100))^B16","v":82.530929856397194},16543.286682026122,16561.64051456,49294.084119448882,0.33597622940773209,0.3356038960362589,0,0,5,{"$f":"AF16*(1+(Eingabe!H$106/100))^AI16","v":0.36154070884113626}]
[null,6,0.25689429045055989,{"$f":"Eingabe!$H$112*1/(1+(Eingabe!H$98/100))^B16","v":9712.1595651066455},2494.9983402206899,{"$f":"(Eingabe!H$89*(Eingabe!H$97/100))*((1+(Eingabe!H$102/100))^B16)+IF(Eingabe!G96=\"viermal\",Eingabe!H96,0)","v":92.465620582400021},{"$f":"IF(AND(Eingabe!$J$88<=Berechnungen!B17,(Eingabe!$J$88+Eingabe!$J$89)>B17),(Eingabe!$H$92*(1-Eingabe!$H$87))/Eingabe!$J$89,0)","v":0},{"$f":"((Eingabe!$H$92*(1-Eingabe!$H$87))-SUM($G$11:G16))*Eingabe!$I$87","v":0},0,2402.53271963829,{"$f":"J17/(1+(Eingabe!H$106/100))^B17","v":2197.217541013928},-1458.8424499735347,7,7,{"$f":"IF(Eingabe!$H$63=Eingabe!$C$169,IF(R17<>0,IF(Eingabe!$H$65=Eingabe!$C$200,S17,R17),P17),IF(Eingabe!$H$63=Eingabe!$C$171,T17,IF(Eingabe!$H$63=Eingabe!$C$170,T17,IF(Eingabe!$H$63=Eingabe!$C$172,T17,\"Zuordnung!\"))))","v":0.25689429045055989},{"$f":"Eingabe!H$104*(1+(Eingabe!H$105/100))^B16","v":0.23140372398079995},{"$f":"Eingabe!H$103*(1+(Eingabe!H$105/100))^B16","v":0.31637227887999991},0,{"$f":"IF(Eingabe!$H$65=\"Volleinspeisung\",Berechnungen!R17,(R17*Eingabe!$H$74+Berechnungen!Q17*Eingabe!$H$73)/100)","v":9.4911683663999963E-2},{"$f":"(P17*Eingabe!$H$74+Berechnungen!Q17*Eingabe!$H$73)/100","v":0.25689429045055989},null,{"$f":"IF(Eingabe!$H$112*Eingabe!$H$73/100>25000,IF((Eingabe!$H$112*Eingabe!$H$73/100-25000)*0.015<=50,0,(Eingabe!$H$112*Eingabe!$H$73/100-25000)*0.015),0)","v":0},25.689429045055988,{"$f":"P17*Eingabe!$H$74/100","v":0.16198260678655996},{"$f":"Q17*Eingabe!$H$73/100","v":9.4911683663999963E-2},null,{"$f":"F17/(1+(Eingabe!H$106/100))^B17","v":84.563711379953801},16627.850393406075,16654.1061351424,59006.243684555528,0.28224311691783721,0.28179815143457942,0,0,6,{"$f":"AF17*(1+(Eingabe!H$106/100))^AI17","v":0.3081302904776288}]
[null,7,0.25175640464154875,{"$f":"Eingabe!$H$112*1/(1+(Eingabe!H$98/100))^B17","v":9663.8403632901955},2432.9337048918178,{"$f":"(Eingabe!H$89*(Eingabe!H$97/100))*((1+(Eingabe!H$102/100))^B17)+IF(Eingabe!G96=\"dreimal\",Eingabe!H96,0)","v":96.164245405696022},{"$f":"IF(AND(Eingabe!$J$88<=Berechnungen!B18,(Eingabe!$J$88+Eingabe!$J$89)>B18),(Eingabe!$H$92*(1-Eingabe!$H$87))/Eingabe!$J$89,0)","v":0},{"$f":"((Eingabe!$H$92*(1-Eingabe!$H$87))-SUM($G$11:G17))*Eingabe!$I$87","v":0},0,2336.7694594861218,{"$f":"J18/(1+(Eingabe!H$106/100))^B18","v":2105.4918865884147},646.64943661487996,0,8,{"$f":"IF(Eingabe!$H$63=Eingabe!$C$169,IF(R18<>0,IF(Eingabe!$H$65=Eingabe!$C$200,S18,R18),P18),IF(Eingabe!$H$63=Eingabe!$C$171,T18,IF(Eingabe!$H$63=Eingabe!$C$170,T18,IF(Eingabe!$H$63=Eingabe!$C$172,T18,\"Zuordnung!\"))))","v":0.25175640464154875},{"$f":"Eingabe!H$104*(1+(Eingabe!H$105/100))^B17","v":0.22677564950118395},{"$f":"Eingabe!H$103*(1+(Eingabe!H$105/100))^B17","v":0.3100448333023999},0,{"$f":"IF(Eingabe!$H$65=\"Volleinspeisung\",Berechnungen!R18,(R18*Eingabe!$H$74+Berechnungen!Q18*Eingabe!$H$73)/100)","v":9.3013449990719976E-2},{"$f":"(P18*Eingabe!$H$74+Berechnungen!Q18*Eingabe!$H$73)/100","v":0.25175640464154875},null,{"$f":"IF(Eingabe!$H$112*Eingabe!$H$73/100>25000,IF((Eingabe!$H$112*Eingabe!$H$73/100-25000)*0.015<=50,0,(Eingabe!$H$112*Eingabe!$H$73/100-25000)*0.015),0)","v":0},25.175640464154874,{"$f":"P18*Eingabe!$H$74/100","v":0.15874295465082877},{"$f":"Q18*Eingabe!$H$73/100","v":9.3013449990719976E-2},null,{"$f":"F18/(1+(Eingabe!H$106/100))^B18","v":86.64656141394282},16714.496954820017,16750.270380548096,68670.084047845725,0.24392383689056479,0.24340289059751594,0.24340289059751594,0,7,{"$f":"AF18*(1+(Eingabe!H$106/100))^AI18","v":0.27013945991524135}]
[null,8,0.24672127654871776,{"$f":"Eingabe!$H$112*1/(1+(Eingabe!H$98/100))^B18","v":9615.761555512634},2372.4129659641608,{"$f":"(Eingabe!H$89*(Eingabe!H$97/100))*((1+(Eingabe!H$102/100))^B18)","v":100.01081522192386},{"$f":"IF(AND(Eingabe!$J$88<=Berechnungen!B19,(Eingabe!$J$88+Eingabe!$J$89)>B19),(Eingabe!$H$92*(1-Eingabe!$H$87))/Eingabe!$J$89,0)","v":0},{"$f":"((Eingabe!$H$92*(1-Eingabe!$H$87))-SUM($G$11:G18))*Eingabe!$I$87","v":0},0,2272.4021507422367,{"$f":"J19/(1+(Eingabe!H$106/100))^B19","v":2017.2366669631717},2663.8861035780519,0,9,{"$f":"IF(Eingabe!$H$63=Eingabe!$C$169,IF(R19<>0,IF(Eingabe!$H$65=Eingabe!$C$200,S19,R19),P19),IF(Eingabe!$H$63=Eingabe!$C$171,T19,IF(Eingabe!$H$63=Eingabe!$C$170,T19,IF(Eingabe!$H$63=Eingabe!$C$172,T19,\"Zuordnung!\"))))","v":0.24672127654871776},{"$f":"Eingabe!H$104*(1+(Eingabe!H$105/100))^B18","v":0.22224013651116029},{"$f":"Eingabe!H$103*(1+(Eingabe!H$105/100))^B18","v":0.3038439366363519},0,{"$f":"IF(Eingabe!$H$65=\"Volleinspeisung\",Berechnungen!R19,(R19*Eingabe!$H$74+Berechnungen!Q19*Eingabe!$H$73)/100)","v":9.1153180990905566E-2},{"$f":"(P19*Eingabe!$H$74+Berechnungen!Q19*Eingabe!$H$73)/100","v":0.24672127654871776},null,{"$f":"IF(Eingabe!$H$112*Eingabe!$H$73/100>25000,IF((Eingabe!$H$112*Eingabe!$H$73/100-25000)*0.015<=50,0,(Eingabe!$H$112*Eingabe!$H$73/100-25000)*0.015),0)","v":0},24.672127654871776,{"$f":"P19*Eingabe!$H$74/100","v":0.1555680955578122},{"$f":"Q19*Eingabe!$H$73/100","v":9.1153180990905566E-2},null,{"$f":"F19/(1+(Eingabe!H$106/100))^B19","v":88.780713172906928},16803.277667992923,16850.281195770021,78285.845603358364,0.21524045714653642,0.21464004812732179,0.21464004812732179,0,8,{"$f":"AF19*(1+(Eingabe!H$106/100))^AI19","v":0.24179042300188763}]
[null,9,0.24178685101774341,{"$f":"Eingabe!$H$112*1/(1+(Eingabe!H$98/100))^B19","v":9567.9219457837153},2313.3977180546049,{"$f":"(Eingabe!H$89*(Eingabe!H$97/100))*((1+(Eingabe!H$102/100))^B19)","v":104.01124783080083},{"$f":"IF(AND(Eingabe!$J$88<=Berechnungen!B20,(Eingabe!$J$88+Eingabe!$J$89)>B20),(Eingabe!$H$92*(1-Eingabe!$H$87))/Eingabe!$J$89,0)","v":0},{"$f":"((Eingabe!$H$92*(1-Eingabe!$H$87))-SUM($G$11:G19))*Eingabe!$I$87","v":0},0,2209.3864702238038,{"$f":"J20/(1+(Eingabe!H$106/100))^B20","v":1932.3122624562266},4596.1983660342785,0,10,{"$f":"IF(Eingabe!$H$63=Eingabe!$C$169,IF(R20<>0,IF(Eingabe!$H$65=Eingabe!$C$200,S20,R20),P20),IF(Eingabe!$H$63=Eingabe!$C$171,T20,IF(Eingabe!$H$63=Eingabe!$C$170,T20,IF(Eingabe!$H$63=Eingabe!$C$172,T20,\"Zuordnung!\"))))","v":0.24178685101774341},{"$f":"Eingabe!H$104*(1+(Eingabe!H$105/100))^B19","v":0.21779533378093707},{"$f":"Eingabe!H$103*(1+(Eingabe!H$105/100))^B19","v":0.29776705790362484},0,{"$f":"IF(Eingabe!$H$65=\"Volleinspeisung\",Berechnungen!R20,(R20*Eingabe!$H$74+Berechnungen!Q20*Eingabe!$H$73)/100)","v":8.9330117371087467E-2},{"$f":"(P20*Eingabe!$H$74+Berechnungen!Q20*Eingabe!$H$73)/100","v":0.24178685101774341},null,{"$f":"IF(Eingabe!$H$112*Eingabe!$H$73/100>25000,IF((Eingabe!$H$112*Eingabe!$H$73/100-25000)*0.015<=50,0,(Eingabe!$H$112*Eingabe!$H$73/100-25000)*0.015),0)","v":0},24.178685101774342,{"$f":"P20*Eingabe!$H$74/100","v":0.15245673364665596},{"$f":"Q20*Eingabe!$H$73/100","v":8.9330117371087467E-2},null,{"$f":"F20/(1+(Eingabe!H$106/100))^B20","v":90.967430246131258},16894.245098239055,16954.292443600822,87853.767549142081,0.19298310040166725,0.19229960842361202,0.19229960842361202,0,9,{"$f":"AF20*(1+(Eingabe!H$106/100))^AI20","v":0.21987344454379479}]
[null,10,0.23695111399738852,{"$f":"Eingabe!$H$112*1/(1+(Eingabe!H$98/100))^B20","v":9520.3203440633988},2255.8505111378236,{"$f":"(Eingabe!H$89*(Eingabe!H$97/100))*((1+(Eingabe!H$102/100))^B20)+IF(Eingabe!G96=\"zweimal\",Eingabe!H96,0)","v":108.17169774403287},{"$f":"IF(AND(Eingabe!$J$88<=Berechnungen!B21,(Eingabe!$J$88+Eingabe!$J$89)>B21),(Eingabe!$H$92*(1-Eingabe!$H$87))/Eingabe!$J$89,0)","v":0},{"$f":"((Eingabe!$H$92*(1-Eingabe!$H$87))-SUM($G$11:G20))*Eingabe!$I$87","v":0},0,2147.6788133937907,{"$f":"J21/(1+(Eingabe!H$106/100))^B21","v":1850.5844577654141},6446.7828237996928,0,11,{"$f":"IF(Eingabe!$H$63=Eingabe!$C$169,IF(R21<>0,IF(Eingabe!$H$65=Eingabe!$C$200,S21,R21),P21),IF(Eingabe!$H$63=Eingabe!$C$171,T21,IF(Eingabe!$H$63=Eingabe!$C$170,T21,IF(Eingabe!$H$63=Eingabe!$C$172,T21,\"Zuordnung!\"))))","v":0.23695111399738852},{"$f":"Eingabe!H$104*(1+(Eingabe!H$105/100))^B20","v":0.21343942710531832},{"$f":"Eingabe!H$103*(1+(Eingabe!H$105/100))^B20","v":0.29181171674555234},0,{"$f":"IF(Eingabe!$H$65=\"Volleinspeisung\",Berechnungen!R21,(R21*Eingabe!$H$74+Berechnungen!Q21*Eingabe!$H$73)/100)","v":8.7543515023665697E-2},{"$f":"(P21*Eingabe!$H$74+Berechnungen!Q21*Eingabe!$H$73)/100","v":0.23695111399738852},null,{"$f":"IF(Eingabe!$H$112*Eingabe!$H$73/100>25000,IF((Eingabe!$H$112*Eingabe!$H$73/100-25000)*0.015<=50,0,(Eingabe!$H$112*Eingabe!$H$73/100-25000)*0.015),0)","v":0},23.695111399738852,{"$f":"P21*Eingabe!$H$74/100","v":0.14940759897372283},{"$f":"Q21*Eingabe!$H$73/100","v":8.7543515023665697E-2},null,{"$f":"F21/(1+(Eingabe!H$106/100))^B21","v":93.208007345789682},16987.453105584846,17062.464141344855,97374.087893205477,0.17522592006261484,0.17445558128581135,0.17445558128581135,0,10,{"$f":"AF21*(1+(Eingabe!H$106/100))^AI21","v":0.20246282423567735}]
[null,11,0.23221209171744076,{"$f":"Eingabe!$H$112*1/(1+(Eingabe!H$98/100))^B21","v":9472.95556623224},2199.7348267811617,{"$f":"(Eingabe!H$89*(Eingabe!H$97/100))*((1+(Eingabe!H$102/100))^B21)","v":112.49856565379419},{"$f":"IF(AND(Eingabe!$J$88<=Berechnungen!B22,(Eingabe!$J$88+Eingabe!$J$89)>B22),(Eingabe!$H$92*(1-Eingabe!$H$87))/Eingabe!$J$89,0)","v":0},{"$f":"((Eingabe!$H$92*(1-Eingabe!$H$87))-SUM($G$11:G21))*Eingabe!$I$87","v":0},0,2087.2362611273675,{"$f":"J22/(1+(Eingabe!H$106/100))^B22","v":1771.9242276608688},8218.7070514605621,0,12,{"$f":"IF(Eingabe!$H$63=Eingabe!$C$169,IF(R22<>0,IF(Eingabe!$H$65=Eingabe!$C$200,S22,R22),P22),IF(Eingabe!$H$63=Eingabe!$C$171,T22,IF(Eingabe!$H$63=Eingabe!$C$170,T22,IF(Eingabe!$H$63=Eingabe!$C$172,T22,\"Zuordnung!\"))))","v":0.23221209171744076},{"$f":"Eingabe!H$104*(1+(Eingabe!H$105/100))^B21","v":0.20917063856321194},{"$f":"Eingabe!H$103*(1+(Eingabe!H$105/100))^B21","v":0.2859754824106413},0,{"$f":"IF(Eingabe!$H$65=\"Volleinspeisung\",Berechnungen!R22,(R22*Eingabe!$H$74+Berechnungen!Q22*Eingabe!$H$73)/100)","v":8.5792644723192382E-2},{"$f":"(P22*Eingabe!$H$74+Berechnungen!Q22*Eingabe!$H$73)/100","v":0.23221209171744076},null,{"$f":"IF(Eingabe!$H$112*Eingabe!$H$73/100>25000,IF((Eingabe!$H$112*Eingabe!$H$73/100-25000)*0.015<=50,0,(Eingabe!$H$112*Eingabe!$H$73/100-25000)*0.015),0)","v":0},23.221209171744075,{"$f":"P22*Eingabe!$H$74/100","v":0.14641944699424836},{"$f":"Q22*Eingabe!$H$73/100","v":8.5792644723192382E-2},null,{"$f":"F22/(1+(Eingabe!H$106/100))^B22","v":95.503771073518507},17082.956876658365,17174.962706998649,106847.04345943771,0.16074345298584486,0.15988235447191909,0.15988235447191909,0,11,{"$f":"AF22*(1+(Eingabe!H$106/100))^AI22","v":0.18833324955929126}]
[null,12,0.22756784988309192,{"$f":"Eingabe!$H$112*1/(1+(Eingabe!H$98/100))^B22","v":9425.8264340619298},2145.015054970685,{"$f":"(Eingabe!H$89*(Eingabe!H$97/100))*((1+(Eingabe!H$102/100))^B22)+IF(Eingabe!G96=\"viermal\",Eingabe!H96,0)","v":116.99850827994595},{"$f":"IF(AND(Eingabe!$J$88<=Berechnungen!B23,(Eingabe!$J$88+Eingabe!$J$89)>B23),(Eingabe!$H$92*(1-Eingabe!$H$87))/Eingabe!$J$89,0)","v":0},{"$f":"((Eingabe!$H$92*(1-Eingabe!$H$87))-SUM($G$11:G22))*Eingabe!$I$87","v":0},{"$f":"G23+H23","v":0},2028.016546690739,{"$f":"J23/(1+(Eingabe!H$106/100))^B23","v":1696.2075310478724},9914.9145825084343,0,13,{"$f":"IF(Eingabe!$H$63=Eingabe!$C$169,IF(R23<>0,IF(Eingabe!$H$65=Eingabe!$C$200,S23,R23),P23),IF(Eingabe!$H$63=Eingabe!$C$171,T23,IF(Eingabe!$H$63=Eingabe!$C$170,T23,IF(Eingabe!$H$63=Eingabe!$C$172,T23,\"Zuordnung!\"))))","v":0.22756784988309192},{"$f":"Eingabe!H$104*(1+(Eingabe!H$105/100))^B22","v":0.2049872257919477},{"$f":"Eingabe!H$103*(1+(Eingabe!H$105/100))^B22","v":0.28025597276242847},0,{"$f":"IF(Eingabe!$H$65=\"Volleinspeisung\",Berechnungen!R23,(R23*Eingabe!$H$74+Berechnungen!Q23*Eingabe!$H$73)/100)","v":8.4076791828728542E-2},{"$f":"(P23*Eingabe!$H$74+Berechnungen!Q23*Eingabe!$H$73)/100","v":0.22756784988309192},null,{"$f":"IF(Eingabe!$H$112*Eingabe!$H$73/100>25000,IF((Eingabe!$H$112*Eingabe!$H$73/100-25000)*0.015<=50,0,(Eingabe!$H$112*Eingabe!$H$73/100-25000)*0.015),0)","v":0},22.756784988309192,{"$f":"P23*Eingabe!$H$74/100","v":0.14349105805436341},{"$f":"Q23*Eingabe!$H$73/100","v":8.4076791828728542E-2},null,{"$f":"F23/(1+(Eingabe!H$106/100))^B23","v":97.856080705871207},17180.812957364236,17291.961215278596,116272.86989349965,0.14871879597637178,0.14776286998937099,0.14776286998937099,0,12,{"$f":"AF23*(1+(Eingabe!H$106/100))^AI23","v":0.17666797242660001}]
[null,13,0.22301649288543007,{"$f":"Eingabe!$H$112*1/(1+(Eingabe!H$98/100))^B23","v":9378.9317751860035},2091.6564715137033,{"$f":"(Eingabe!H$89*(Eingabe!H$97/100))*((1+(Eingabe!H$102/100))^B23)+IF(Eingabe!G96=\"einmal\",Eingabe!H96,0)","v":2621.6784486111437},{"$f":"IF(AND(Eingabe!$J$88<=Berechnungen!B24,(Eingabe!$J$88+Eingabe!$J$89)>B24),(Eingabe!$H$92*(1-Eingabe!$H$87))/Eingabe!$J$89,0)","v":0},{"$f":"((Eingabe!$H$92*(1-Eingabe!$H$87))-SUM($G$11:G23))*Eingabe!$I$87","v":0},0,-530.02197709744041,{"$f":"J24/(1+(Eingabe!H$106/100))^B24","v":-436.75242854426517},9478.1621539641692,0,14,{"$f":"IF(Eingabe!$H$63=Eingabe!$C$169,IF(R24<>0,IF(Eingabe!$H$65=Eingabe!$C$200,S24,R24),P24),IF(Eingabe!$H$63=Eingabe!$C$171,T24,IF(Eingabe!$H$63=Eingabe!$C$170,T24,IF(Eingabe!$H$63=Eingabe!$C$172,T24,\"Zuordnung!\"))))","v":0.22301649288543007},{"$f":"Eingabe!H$104*(1+(Eingabe!H$105/100))^B23","v":0.20088748127610873},{"$f":"Eingabe!H$103*(1+(Eingabe!H$105/100))^B23","v":0.27465085330717987},0,{"$f":"IF(Eingabe!$H$65=\"Volleinspeisung\",Berechnungen!R24,(R24*Eingabe!$H$74+Berechnungen!Q24*Eingabe!$H$73)/100)","v":8.2395255992153957E-2},{"$f":"(P24*Eingabe!$H$74+Berechnungen!Q24*Eingabe!$H$73)/100","v":0.22301649288543007},null,{"$f":"IF(Eingabe!$H$112*Eingabe!$H$73/100>25000,IF((Eingabe!$H$112*Eingabe!$H$73/100-25000)*0.015<=50,0,(Eingabe!$H$112*Eingabe!$H$73/100-25000)*0.015),0)","v":0},22.301649288543008,{"$f":"P24*Eingabe!$H$74/100","v":0.1406212368932761},{"$f":"Q24*Eingabe!$H$73/100","v":8.2395255992153957E-2},null,{"$f":"F24/(1+(Eingabe!H$106/100))^B24","v":2160.3338706133964},19341.146827977631,19913.639663889739,125651.80166868566,0.15848272288524232,0.15392653802908215,0.15392653802908215,0,13,{"$f":"AF24*(1+(Eingabe!H$106/100))^AI24","v":0.18679792642680138}]
[null,14,0.21855616302772149,{"$f":"Eingabe!$H$112*1/(1+(Eingabe!H$98/100))^B24","v":9332.2704230706513},2039.6252160034126,{"$f":"(Eingabe!H$89*(Eingabe!H$97/100))*((1+(Eingabe!H$102/100))^B24)+IF(Eingabe!G96=\"dreimal\",Eingabe!H96,0)","v":126.54558655558957},{"$f":"IF(AND(Eingabe!$J$88<=Berechnungen!B25,(Eingabe!$J$88+Eingabe!$J$89)>B25),(Eingabe!$H$92*(1-Eingabe!$H$87))/Eingabe!$J$89,0)","v":0},{"$f":"((Eingabe!$H$92*(1-Eingabe!$H$87))-SUM($G$11:G24))*Eingabe!$I$87","v":0},0,1913.079629447823,{"$f":"J25/(1+(Eingabe!H$106/100))^B25","v":1553.1323149355392},11031.294468899709,0,15,{"$f":"IF(Eingabe!$H$63=Eingabe!$C$169,IF(R25<>0,IF(Eingabe!$H$65=Eingabe!$C$200,S25,R25),P25),IF(Eingabe!$H$63=Eingabe!$C$171,T25,IF(Eingabe!$H$63=Eingabe!$C$170,T25,IF(Eingabe!$H$63=Eingabe!$C$172,T25,\"Zuordnung!\"))))","v":0.21855616302772149},{"$f":"Eingabe!H$104*(1+(Eingabe!H$105/100))^B24","v":0.19686973165058655},{"$f":"Eingabe!H$103*(1+(Eingabe!H$105/100))^B24","v":0.26915783624103629},{"$f":"IF(Eingabe!$H$67=\"Überschusseinspeisung\",S25,P25)","v":0.21855616302772149},{"$f":"IF(Eingabe!$H$67=\"Überschusseinspeisung\",T25,P25)","v":0.21855616302772149},{"$f":"(P25*Eingabe!$H$74+Berechnungen!Q25*Eingabe!$H$73)/100","v":0.21855616302772149},null,{"$f":"IF(Eingabe!$H$112*Eingabe!$H$73/100>25000,IF((Eingabe!$H$112*Eingabe!$H$73/100-25000)*0.015<=50,0,(Eingabe!$H$112*Eingabe!$H$73/100-25000)*0.015),0)","v":0},21.855616302772148,{"$f":"P25*Eingabe!$H$74/100","v":0.13780881215541058},{"$f":"Q25*Eingabe!$H$73/100","v":8.0747350872310886E-2},null,{"$f":"F25/(1+(Eingabe!H$106/100))^B25","v":102.73594301387594},19443.882770991506,20040.185250445327,134984.0720917563,0.14846333304290066,0.14404575643394726,0.14404575643394726,0,14,{"$f":"AF25*(1+(Eingabe!H$106/100))^AI25","v":0.17742918596966056}]
[null,15,0.21418503976716705,{"$f":"Eingabe!$H$112*1/(1+(Eingabe!H$98/100))^B25","v":9285.8412169857238},1988.888270331686,{"$f":"(Eingabe!H$89*(Eingabe!H$97/100))*((1+(Eingabe!H$102/100))^B25)","v":131.60741001781315},{"$f":"IF(AND(Eingabe!$J$88<=Berechnungen!B26,(Eingabe!$J$88+Eingabe!$J$89)>B26),(Eingabe!$H$92*(1-Eingabe!$H$87))/Eingabe!$J$89,0)","v":0},{"$f":"((Eingabe!$H$92*(1-Eingabe!$H$87))-SUM($G$11:G25))*Eingabe!$I$87","v":0},0,1857.2808603138728,{"$f":"J26/(1+(Eingabe!H$106/100))^B26","v":1485.5488911622419},12516.84336006195,0,16,{"$f":"IF(Eingabe!$H$63=Eingabe!$C$169,IF(R26<>0,IF(Eingabe!$H$65=Eingabe!$C$200,S26,R26),P26),IF(Eingabe!$H$63=Eingabe!$C$171,T26,IF(Eingabe!$H$63=Eingabe!$C$170,T26,IF(Eingabe!$H$63=Eingabe!$C$172,T26,\"Zuordnung!\"))))","v":0.21418503976716705},{"$f":"Eingabe!H$104*(1+(Eingabe!H$105/100))^B25","v":0.19293233701757481},{"$f":"Eingabe!H$103*(1+(Eingabe!H$105/100))^B25","v":0.26377467951621553},{"$f":"IF(Eingabe!$H$67=\"Überschusseinspeisung\",S26,P26)","v":0.21418503976716705},{"$f":"IF(Eingabe!$H$67=\"Überschusseinspeisung\",T26,P26)","v":0.21418503976716705},{"$f":"(P26*Eingabe!$H$74+Berechnungen!Q26*Eingabe!$H$73)/100","v":0.21418503976716705},null,{"$f":"IF(Eingabe!$H$112*Eingabe!$H$73/100>25000,IF((Eingabe!$H$112*Eingabe!$H$73/100-25000)*0.015<=50,0,(Eingabe!$H$112*Eingabe!$H$73/100-25000)*0.015),0)","v":0},21.418503976716703,{"$f":"P26*Eingabe!$H$74/100","v":0.13505263591230238},{"$f":"Q26*Eingabe!$H$73/100","v":7.9132403854864655E-2},null,{"$f":"F26/(1+(Eingabe!H$106/100))^B26","v":105.26638496003054},19549.149155951538,20171.792660463139,144269.91330874202,0.13981981549607567,0.13550399184142964,0.13550399184142964,0,15,{"$f":"AF26*(1+(Eingabe!H$106/100))^AI26","v":0.16941143575982706}]
[null,16,0.20990133897182367,{"$f":"Eingabe!$H$112*1/(1+(Eingabe!H$98/100))^B26","v":9239.6430019758482},1939.413437736371,{"$f":"(Eingabe!H$89*(Eingabe!H$97/100))*((1+(Eingabe!H$102/100))^B26)","v":136.87170641852566},{"$f":"IF(AND(Eingabe!$J$88<=Berechnungen!B27,(Eingabe!$J$88+Eingabe!$J$89)>B27),(Eingabe!$H$92*(1-Eingabe!$H$87))/Eingabe!$J$89,0)","v":0},{"$f":"((Eingabe!$H$92*(1-Eingabe!$H$87))-SUM($G$11:G26))*Eingabe!$I$87","v":0},0,1802.5417313178452,{"$f":"J27/(1+(Eingabe!H$106/100))^B27","v":1420.4588339480956},13937.302194010046,0,17,{"$f":"IF(Eingabe!$H$63=Eingabe!$C$169,IF(R27<>0,IF(Eingabe!$H$65=Eingabe!$C$200,S27,R27),P27),IF(Eingabe!$H$63=Eingabe!$C$171,T27,IF(Eingabe!$H$63=Eingabe!$C$170,T27,IF(Eingabe!$H$63=Eingabe!$C$172,T27,\"Zuordnung!\"))))","v":0.20990133897182367},{"$f":"Eingabe!H$104*(1+(Eingabe!H$105/100))^B26","v":0.18907369027722332},{"$f":"Eingabe!H$103*(1+(Eingabe!H$105/100))^B26","v":0.25849918592589122},{"$f":"IF(Eingabe!$H$67=\"Überschusseinspeisung\",S27,P27)","v":0.20990133897182367},{"$f":"IF(Eingabe!$H$67=\"Überschusseinspeisung\",T27,P27)","v":0.20990133897182367},{"$f":"(P27*Eingabe!$H$74+Berechnungen!Q27*Eingabe!$H$73)/100","v":0.20990133897182367},null,{"$f":"IF(Eingabe!$H$112*Eingabe!$H$73/100>25000,IF((Eingabe!$H$112*Eingabe!$H$73/100-25000)*0.015<=50,0,(Eingabe!$H$112*Eingabe!$H$73/100-25000)*0.015),0)","v":0},20.990133897182368,{"$f":"P27*Eingabe!$H$74/100","v":0.13235158319405632},{"$f":"Q27*Eingabe!$H$73/100","v":7.7549755777767362E-2},null,{"$f":"F27/(1+(Eingabe!H$106/100))^B27","v":107.85915306249434},19657.008309014032,20308.664366881665,153509.55631071786,0.13229576617220498,0.12805071411467303,0.12805071411467303,0,16,{"$f":"AF27*(1+(Eingabe!H$106/100))^AI27","v":0.16249450557831749}]
[null,17,0.20570331219238724,{"$f":"Eingabe!$H$112*1/(1+(Eingabe!H$98/100))^B27","v":9193.6746288316899},1891.1693223697951,{"$f":"(Eingabe!H$89*(Eingabe!H$97/100))*((1+(Eingabe!H$102/100))^B27)","v":142.34657467526671},{"$f":"IF(AND(Eingabe!$J$88<=Berechnungen!B28,(Eingabe!$J$88+Eingabe!$J$89)>B28),(Eingabe!$H$92*(1-Eingabe!$H$87))/Eingabe!$J$89,0)","v":0},{"$f":"((Eingabe!$H$92*(1-Eingabe!$H$87))-SUM($G$11:G27))*Eingabe!$I$87","v":0},0,1748.8227476945283,{"$f":"J28/(1+(Eingabe!H$106/100))^B28","v":1357.7602043864026},15295.062398396449,0,18,{"$f":"IF(Eingabe!$H$63=Eingabe!$C$169,IF(R28<>0,IF(Eingabe!$H$65=Eingabe!$C$200,S28,R28),P28),IF(Eingabe!$H$63=Eingabe!$C$171,T28,IF(Eingabe!$H$63=Eingabe!$C$170,T28,IF(Eingabe!$H$63=Eingabe!$C$172,T28,\"Zuordnung!\"))))","v":0.20570331219238724},{"$f":"Eingabe!H$104*(1+(Eingabe!H$105/100))^B27","v":0.18529221647167884},{"$f":"Eingabe!H$103*(1+(Eingabe!H$105/100))^B27","v":0.25332920220737343},{"$f":"IF(Eingabe!$H$67=\"Überschusseinspeisung\",S28,P28)","v":0.20570331219238724},{"$f":"IF(Eingabe!$H$67=\"Überschusseinspeisung\",T28,P28)","v":0.20570331219238724},{"$f":"(P28*Eingabe!$H$74+Berechnungen!Q28*Eingabe!$H$73)/100","v":0.20570331219238724},null,{"$f":"IF(Eingabe!$H$112*Eingabe!$H$73/100>25000,IF((Eingabe!$H$112*Eingabe!$H$73/100-25000)*0.015<=50,0,(Eingabe!$H$112*Eingabe!$H$73/100-25000)*0.015),0)","v":0},20.570331219238724,{"$f":"P28*Eingabe!$H$74/100","v":0.12970455153017521},{"$f":"Q28*Eingabe!$H$73/100","v":7.5998760662212034E-2},null,{"$f":"F28/(1+(Eingabe!H$106/100))^B28","v":110.5157824482701},19767.524091462303,20451.010941556931,162703.23093954954,0.12569517411215553,0.12149435495111152,0.12149435495111152,0,17,{"$f":"AF28*(1+(Eingabe!H$106/100))^AI28","v":0.15648719926284577}]
[null,18,0.20158924594853947,{"$f":"Eingabe!$H$112*1/(1+(Eingabe!H$98/100))^B28","v":9147.9349540613839},1844.1253093755215,{"$f":"(Eingabe!H$89*(Eingabe!H$97/100))*((1+(Eingabe!H$102/100))^B28)+IF(Eingabe!G96=\"viermal\",Eingabe!H96,0)","v":148.04043766227738},{"$f":"IF(AND(Eingabe!$J$88<=Berechnungen!B29,(Eingabe!$J$88+Eingabe!$J$89)>B29),(Eingabe!$H$92*(1-Eingabe!$H$87))/Eingabe!$J$89,0)","v":0},{"$f":"((Eingabe!$H$92*(1-Eingabe!$H$87))-SUM($G$11:G28))*Eingabe!$I$87","v":0},0,1696.0848717132442,{"$f":"J29/(1+(Eingabe!H$106/100))^B29","v":1297.3549702551747},16592.417368651622,0,19,{"$f":"IF(Eingabe!$H$63=Eingabe!$C$169,IF(R29<>0,IF(Eingabe!$H$65=Eingabe!$C$200,S29,R29),P29),IF(Eingabe!$H$63=Eingabe!$C$171,T29,IF(Eingabe!$H$63=Eingabe!$C$170,T29,IF(Eingabe!$H$63=Eingabe!$C$172,T29,\"Zuordnung!\"))))","v":0.20158924594853947},{"$f":"Eingabe!H$104*(1+(Eingabe!H$105/100))^B28","v":0.18158637214224527},{"$f":"Eingabe!H$103*(1+(Eingabe!H$105/100))^B28","v":0.24826261816322592},{"$f":"IF(Eingabe!$H$67=\"Überschusseinspeisung\",S29,P29)","v":0.20158924594853947},{"$f":"IF(Eingabe!$H$67=\"Überschusseinspeisung\",T29,P29)","v":0.20158924594853947},{"$f":"(P29*Eingabe!$H$74+Berechnungen!Q29*Eingabe!$H$73)/100","v":0.20158924594853947},null,{"$f":"IF(Eingabe!$H$112*Eingabe!$H$73/100>25000,IF((Eingabe!$H$112*Eingabe!$H$73/100-25000)*0.015<=50,0,(Eingabe!$H$112*Eingabe!$H$73/100-25000)*0.015),0)","v":0},20.158924594853946,{"$f":"P29*Eingabe!$H$74/100","v":0.1271104604995717},{"$f":"Q29*Eingabe!$H$73/100","v":7.4478785448967771E-2},null,{"$f":"F29/(1+(Eingabe!H$106/100))^B29","v":113.23784605537037},19880.761937517673,20599.051379219211,171851.16589361092,0.1198656481153675,0.11568592993908108,0.11568592993908108,0,18,{"$f":"AF29*(1+(Eingabe!H$106/100))^AI29","v":0.1512409172033779}]
[null,19,0.19755746102956862,{"$f":"Eingabe!$H$112*1/(1+(Eingabe!H$98/100))^B29","v":9102.4228398620762},1798.2515454607073,{"$f":"(Eingabe!H$89*(Eingabe!H$97/100))*((1+(Eingabe!H$102/100))^B29)","v":153.9620551687685},{"$f":"IF(AND(Eingabe!$J$88<=Berechnungen!B30,(Eingabe!$J$88+Eingabe!$J$89)>B30),(Eingabe!$H$92*(1-Eingabe!$H$87))/Eingabe!$J$89,0)","v":0},{"$f":"((Eingabe!$H$92*(1-Eingabe!$H$87))-SUM($G$11:G29))*Eingabe!$I$87","v":0},0,1644.2894902919388,{"$f":"J30/(1+(Eingabe!H$106/100))^B30","v":1239.1488501210804},17831.566218772703,0,20,{"$f":"IF(Eingabe!$H$63=Eingabe!$C$169,IF(R30<>0,IF(Eingabe!$H$65=Eingabe!$C$200,S30,R30),P30),IF(Eingabe!$H$63=Eingabe!$C$171,T30,IF(Eingabe!$H$63=Eingabe!$C$170,T30,IF(Eingabe!$H$63=Eingabe!$C$172,T30,\"Zuordnung!\"))))","v":0.19755746102956862},{"$f":"Eingabe!H$104*(1+(Eingabe!H$105/100))^B29","v":0.17795464469940034},{"$f":"Eingabe!H$103*(1+(Eingabe!H$105/100))^B29","v":0.24329736579996139},{"$f":"IF(Eingabe!$H$67=\"Überschusseinspeisung\",S30,P30)","v":0.19755746102956862},{"$f":"IF(Eingabe!$H$67=\"Überschusseinspeisung\",T30,P30)","v":0.19755746102956862},{"$f":"(P30*Eingabe!$H$74+Berechnungen!Q30*Eingabe!$H$73)/100","v":0.19755746102956862},null,{"$f":"IF(Eingabe!$H$112*Eingabe!$H$73/100>25000,IF((Eingabe!$H$112*Eingabe!$H$73/100-25000)*0.015<=50,0,(Eingabe!$H$112*Eingabe!$H$73/100-25000)*0.015),0)","v":0},19.755746102956863,{"$f":"P30*Eingabe!$H$74/100","v":0.12456825128958023},{"$f":"Q30*Eingabe!$H$73/100","v":7.2989209739988417E-2},null,{"$f":"F30/(1+(Eingabe!H$106/100))^B30","v":116.02695556412336},19996.788893081797,20753.01343438798,180953.58873347298,0.11468694033449178,0.11050783260527162,0.11050783260527162,0,19,{"$f":"AF30*(1+(Eingabe!H$106/100))^AI30","v":0.14663845084473423}]
[null,20,0.19360631180897728,{"$f":"Eingabe!$H$112*1/(1+(Eingabe!H$98/100))^B30","v":9057.1371540916189},1753.5189199517351,{"$f":"(Eingabe!H$89*(Eingabe!H$97/100))*((1+(Eingabe!H$102/100))^B30)+IF(Eingabe!G96=\"zweimal\",Eingabe!H96,0)","v":160.12053737551923},{"$f":"IF(AND(Eingabe!$J$88<=Berechnungen!B31,(Eingabe!$J$88+Eingabe!$J$89)>B31),(Eingabe!$H$92*(1-Eingabe!$H$87))/Eingabe!$J$89,0)","v":0},{"$f":"((Eingabe!$H$92*(1-Eingabe!$H$87))-SUM($G$11:G30))*Eingabe!$I$87","v":0},0,1593.3983825762159,{"$f":"J31/(1+(Eingabe!H$106/100))^B31","v":1183.0511635084467},19014.617382281151,0,21,{"$f":"IF(Eingabe!$H$63=Eingabe!$C$169,IF(R31<>0,IF(Eingabe!$H$65=Eingabe!$C$200,S31,R31),P31),IF(Eingabe!$H$63=Eingabe!$C$171,T31,IF(Eingabe!$H$63=Eingabe!$C$170,T31,IF(Eingabe!$H$63=Eingabe!$C$172,T31,\"Zuordnung!\"))))","v":0.19360631180897728},{"$f":"Eingabe!H$104*(1+(Eingabe!H$105/100))^B30","v":0.17439555180541233},{"$f":"Eingabe!H$103*(1+(Eingabe!H$105/100))^B30","v":0.23843141848396215},{"$f":"IF(Eingabe!$H$67=\"Überschusseinspeisung\",S31,P31)","v":0.19360631180897728},{"$f":"IF(Eingabe!$H$67=\"Überschusseinspeisung\",T31,P31)","v":0.19360631180897728},{"$f":"(P31*Eingabe!$H$74+Berechnungen!Q31*Eingabe!$H$73)/100","v":0.19360631180897728},null,{"$f":"IF(Eingabe!$H$112*Eingabe!$H$73/100>25000,IF((Eingabe!$H$112*Eingabe!$H$73/100-25000)*0.015<=50,0,(Eingabe!$H$112*Eingabe!$H$73/100-25000)*0.015),0)","v":0},19.360631180897727,{"$f":"P31*Eingabe!$H$74/100","v":0.12207688626378863},{"$f":"Q31*Eingabe!$H$73/100","v":7.1529425545188652E-2},null,{"$f":"F31/(1+(Eingabe!H$106/100))^B31","v":118.88476235141707},20115.673655433213,20913.133971763498,190010.72588756459,0.11006291289123576,0.10586599025644636,0.10586599025644636,0,20,{"$f":"AF31*(1+(Eingabe!H$106/100))^AI31","v":0.14258613900027381}]
[null,21,0.18973418557279773,{"$f":"Eingabe!$H$112*1/(1+(Eingabe!H$98/100))^B31","v":9012.0767702404173},1709.8990463210948,{"$f":"(Eingabe!H$89*(Eingabe!H$97/100))*((1+(Eingabe!H$102/100))^B31)+IF(Eingabe!G96=\"dreimal\",Eingabe!H96,0)","v":166.52535887054},{"$f":"IF(AND(Eingabe!$J$88<=Berechnungen!B32,(Eingabe!$J$88+Eingabe!$J$89)>B32),(Eingabe!$H$92*(1-Eingabe!$H$87))/Eingabe!$J$89,0)","v":0},{"$f":"((Eingabe!$H$92*(1-Eingabe!$H$87))-SUM($G$11:G31))*Eingabe!$I$87","v":0},0,1543.3736874505548,{"$f":"J32/(1+(Eingabe!H$106/100))^B32","v":1128.974686893577},20143.592069174727,0,22,{"$f":"IF(Eingabe!$H$63=Eingabe!$C$169,IF(R32<>0,IF(Eingabe!$H$65=Eingabe!$C$200,S32,R32),P32),IF(Eingabe!$H$63=Eingabe!$C$171,T32,IF(Eingabe!$H$63=Eingabe!$C$170,T32,IF(Eingabe!$H$63=Eingabe!$C$172,T32,\"Zuordnung!\"))))","v":0.18973418557279773},{"$f":"Eingabe!H$104*(1+(Eingabe!H$105/100))^B31","v":0.17090764076930409},{"$f":"Eingabe!H$103*(1+(Eingabe!H$105/100))^B31","v":0.23366279011428293},{"$f":"IF(Eingabe!$H$67=\"Überschusseinspeisung\",S32,P32)","v":0.18973418557279773},{"$f":"IF(Eingabe!$H$67=\"Überschusseinspeisung\",T32,P32)","v":0.18973418557279773},{"$f":"(P32*Eingabe!$H$74+Berechnungen!Q32*Eingabe!$H$73)/100","v":0.18973418557279773},null,{"$f":"IF(Eingabe!$H$112*Eingabe!$H$73/100>25000,IF((Eingabe!$H$112*Eingabe!$H$73/100-25000)*0.015<=50,0,(Eingabe!$H$112*Eingabe!$H$73/100-25000)*0.015),0)","v":0},18.973418557279771,{"$f":"P32*Eingabe!$H$74/100","v":0.11963534853851286},{"$f":"Q32*Eingabe!$H$73/100","v":7.0098837034284878E-2},null,{"$f":"F32/(1+(Eingabe!H$106/100))^B32","v":121.81295846844705},20237.486613901659,21079.659330634036,199022.802657805,0.10591579984368873,0.10168426101755539,0.10168426101755539,0,21,{"$f":"AF32*(1+(Eingabe!H$106/100))^AI32","v":0.13900826537941932}]
[null,22,0.18593950186134175,{"$f":"Eingabe!$H$112*1/(1+(Eingabe!H$98/100))^B32","v":8967.2405674034035},1667.3642441738045,{"$f":"(Eingabe!H$89*(Eingabe!H$97/100))*((1+(Eingabe!H$102/100))^B32)","v":173.18637322536165},{"$f":"IF(AND(Eingabe!$J$88<=Berechnungen!B33,(Eingabe!$J$88+Eingabe!$J$89)>B33),(Eingabe!$H$92*(1-Eingabe!$H$87))/Eingabe!$J$89,0)","v":0},{"$f":"((Eingabe!$H$92*(1-Eingabe!$H$87))-SUM($G$11:G32))*Eingabe!$I$87","v":0},0,1494.1778709484429,{"$f":"J33/(1+(Eingabe!H$106/100))^B33","v":1076.8355152940355},21220.427584468762,0,23,{"$f":"IF(Eingabe!$H$63=Eingabe!$C$169,IF(R33<>0,IF(Eingabe!$H$65=Eingabe!$C$200,S33,R33),P33),IF(Eingabe!$H$63=Eingabe!$C$171,T33,IF(Eingabe!$H$63=Eingabe!$C$170,T33,IF(Eingabe!$H$63=Eingabe!$C$172,T33,\"Zuordnung!\"))))","v":0.18593950186134175},{"$f":"Eingabe!H$104*(1+(Eingabe!H$105/100))^B32","v":0.16748948795391799},{"$f":"Eingabe!H$103*(1+(Eingabe!H$105/100))^B32","v":0.22898953431199726},{"$f":"IF(Eingabe!$H$67=\"Überschusseinspeisung\",S33,P33)","v":0.18593950186134175},{"$f":"IF(Eingabe!$H$67=\"Überschusseinspeisung\",T33,P33)","v":0.18593950186134175},{"$f":"(P33*Eingabe!$H$74+Berechnungen!Q33*Eingabe!$H$73)/100","v":0.18593950186134175},null,{"$f":"IF(Eingabe!$H$112*Eingabe!$H$73/100>25000,IF((Eingabe!$H$112*Eingabe!$H$73/100-25000)*0.015<=50,0,(Eingabe!$H$112*Eingabe!$H$73/100-25000)*0.015),0)","v":0},18.593950186134176,{"$f":"P33*Eingabe!$H$74/100","v":0.1172426415677426},{"$f":"Q33*Eingabe!$H$73/100","v":6.8696860293599171E-2},null,{"$f":"F33/(1+(Eingabe!H$106/100))^B33","v":124.81327764254679},20362.299891544208,21252.845703859399,207990.04322520841,0.10218203417000661,9.7900358958511402E-2,9.7900358958511402E-2,0,22,{"$f":"AF33*(1+(Eingabe!H$106/100))^AI33","v":0.13584298422194427}]
[null,23,0.18222071182411492,{"$f":"Eingabe!$H$112*1/(1+(Eingabe!H$98/100))^B33","v":8922.6274302521433},1625.8875216819188,{"$f":"(Eingabe!H$89*(Eingabe!H$97/100))*((1+(Eingabe!H$102/100))^B33)","v":180.11382815437611},{"$f":"IF(AND(Eingabe!$J$88<=Berechnungen!B34,(Eingabe!$J$88+Eingabe!$J$89)>B34),(Eingabe!$H$92*(1-Eingabe!$H$87))/Eingabe!$J$89,0)","v":0},{"$f":"((Eingabe!$H$92*(1-Eingabe!$H$87))-SUM($G$11:G33))*Eingabe!$I$87","v":0},0,1445.7736935275427,{"$f":"J34/(1+(Eingabe!H$106/100))^B34","v":1026.5529292315375},22246.980513700299,0,24,{"$f":"IF(Eingabe!$H$63=Eingabe!$C$169,IF(R34<>0,IF(Eingabe!$H$65=Eingabe!$C$200,S34,R34),P34),IF(Eingabe!$H$63=Eingabe!$C$171,T34,IF(Eingabe!$H$63=Eingabe!$C$170,T34,IF(Eingabe!$H$63=Eingabe!$C$172,T34,\"Zuordnung!\"))))","v":0.18222071182411492},{"$f":"Eingabe!H$104*(1+(Eingabe!H$105/100))^B33","v":0.16413969819483964},{"$f":"Eingabe!H$103*(1+(Eingabe!H$105/100))^B33","v":0.2244097436257573},{"$f":"IF(Eingabe!$H$67=\"Überschusseinspeisung\",S34,P34)","v":0.18222071182411492},{"$f":"IF(Eingabe!$H$67=\"Überschusseinspeisung\",T34,P34)","v":0.18222071182411492},{"$f":"(P34*Eingabe!$H$74+Berechnungen!Q34*Eingabe!$H$73)/100","v":0.18222071182411492},null,{"$f":"IF(Eingabe!$H$112*Eingabe!$H$73/100>25000,IF((Eingabe!$H$112*Eingabe!$H$73/100-25000)*0.015<=50,0,(Eingabe!$H$112*Eingabe!$H$73/100-25000)*0.015),0)","v":0},18.222071182411494,{"$f":"P34*Eingabe!$H$74/100","v":0.11489778873638774},{"$f":"Q34*Eingabe!$H$73/100","v":6.7322923087727193E-2},null,{"$f":"F34/(1+(Eingabe!H$106/100))^B34","v":127.88749630369327},20490.187387847902,21432.959532013774,216912.67065546056,9.8809163463103672E-2,9.4462842239373263E-2,9.4462842239373263E-2,0,23,{"$f":"AF34*(1+(Eingabe!H$106/100))^AI34","v":0.13303930896944979}]
[null,24,0.17857629758763263,{"$f":"Eingabe!$H$112*1/(1+(Eingabe!H$98/100))^B34","v":8878.23624900711},1585.4425584560011,{"$f":"(Eingabe!H$89*(Eingabe!H$97/100))*((1+(Eingabe!H$102/100))^B34)+IF(Eingabe!G96=\"viermal\",Eingabe!H96,0)","v":187.31838128055114},{"$f":"IF(AND(Eingabe!$J$88<=Berechnungen!B35,(Eingabe!$J$88+Eingabe!$J$89)>B35),(Eingabe!$H$92*(1-Eingabe!$H$87))/Eingabe!$J$89,0)","v":0},{"$f":"((Eingabe!$H$92*(1-Eingabe!$H$87))-SUM($G$11:G34))*Eingabe!$I$87","v":0},0,1398.1241771754499,{"$f":"J35/(1+(Eingabe!H$106/100))^B35","v":978.04926685577698},23225.029780556077,0,25,{"$f":"IF(Eingabe!$H$63=Eingabe!$C$169,IF(R35<>0,IF(Eingabe!$H$65=Eingabe!$C$200,S35,R35),P35),IF(Eingabe!$H$63=Eingabe!$C$171,T35,IF(Eingabe!$H$63=Eingabe!$C$170,T35,IF(Eingabe!$H$63=Eingabe!$C$172,T35,\"Zuordnung!\"))))","v":0.17857629758763263},{"$f":"Eingabe!H$104*(1+(Eingabe!H$105/100))^B34","v":0.16085690423094284},{"$f":"Eingabe!H$103*(1+(Eingabe!H$105/100))^B34","v":0.21992154875324213},{"$f":"IF(Eingabe!$H$67=\"Überschusseinspeisung\",S35,P35)","v":0.17857629758763263},{"$f":"IF(Eingabe!$H$67=\"Überschusseinspeisung\",T35,P35)","v":0.17857629758763263},{"$f":"(P35*Eingabe!$H$74+Berechnungen!Q35*Eingabe!$H$73)/100","v":0.17857629758763263},null,{"$f":"IF(Eingabe!$H$112*Eingabe!$H$73/100>25000,IF((Eingabe!$H$112*Eingabe!$H$73/100-25000)*0.015<=50,0,(Eingabe!$H$112*Eingabe!$H$73/100-25000)*0.015),0)","v":0},17.857629758763263,{"$f":"P35*Eingabe!$H$74/100","v":0.11259983296165998},{"$f":"Q35*Eingabe!$H$73/100","v":6.5976464625972633E-2},null,{"$f":"F35/(1+(Eingabe!H$106/100))^B35","v":131.03743463629655},20621.224822484197,21620.277913294325,225790.90690446767,9.5753536799610281E-2,9.1328854227106029E-2,9.1328854227106029E-2,0,24,{"$f":"AF35*(1+(Eingabe!H$106/100))^AI35","v":0.13055485392790367}]
[null,25,0.17500477163588002,{"$f":"Eingabe!$H$112*1/(1+(Eingabe!H$98/100))^B35","v":8834.065919410059},1546.0036888426678,{"$f":"(Eingabe!H$89*(Eingabe!H$97/100))*((1+(Eingabe!H$102/100))^B35)","v":194.81111653177319},{"$f":"IF(AND(Eingabe!$J$88<=Berechnungen!B36,(Eingabe!$J$88+Eingabe!$J$89)>B36),(Eingabe!$H$92*(1-Eingabe!$H$87))/Eingabe!$J$89,0)","v":0},{"$f":"((Eingabe!$H$92*(1-Eingabe!$H$87))-SUM($G$11:G35))*Eingabe!$I$87","v":0},0,1351.1925723108945,{"$f":"J36/(1+(Eingabe!H$106/100))^B36","v":931.24980102480208},24156.279581580879,0,26,{"$f":"IF(Eingabe!$H$63=Eingabe!$C$169,IF(R36<>0,IF(Eingabe!$H$65=Eingabe!$C$200,S36,R36),P36),IF(Eingabe!$H$63=Eingabe!$C$171,T36,IF(Eingabe!$H$63=Eingabe!$C$170,T36,IF(Eingabe!$H$63=Eingabe!$C$172,T36,\"Zuordnung!\"))))","v":0.17500477163588002},{"$f":"Eingabe!H$104*(1+(Eingabe!H$105/100))^B35","v":0.157639766146324},{"$f":"Eingabe!H$103*(1+(Eingabe!H$105/100))^B35","v":0.21552311777817731},{"$f":"IF(Eingabe!$H$67=\"Überschusseinspeisung\",S36,P36)","v":0.17500477163588002},{"$f":"IF(Eingabe!$H$67=\"Überschusseinspeisung\",T36,P36)","v":0.17500477163588002},{"$f":"(P36*Eingabe!$H$74+Berechnungen!Q36*Eingabe!$H$73)/100","v":0.17500477163588002},null,{"$f":"IF(Eingabe!$H$112*Eingabe!$H$73/100>25000,IF((Eingabe!$H$112*Eingabe!$H$73/100-25000)*0.015<=50,0,(Eingabe!$H$112*Eingabe!$H$73/100-25000)*0.015),0)","v":0},17.500477163588002,{"$f":"P36*Eingabe!$H$74/100","v":0.1103478363024268},{"$f":"Q36*Eingabe!$H$73/100","v":6.4656935333453194E-2},null,{"$f":"F36/(1+(Eingabe!H$106/100))^B36","v":134.26495765689501},20755.489780141092,21815.089029826097,234624.97282387773,9.2978546858273642E-2,8.846240675207788E-2,8.846240675207788E-2,0,25,{"$f":"AF36*(1+(Eingabe!H$106/100))^AI36","v":0.12835411809013564}]
[null,"Summen",null,{"$f":"SUM(D12:D36)","v":234624.97282387773},{"$f":"SUM(E12:E36)","v":53158.400224530058},{"$f":"SUM(F11:F36)","v":21815.089029826097},{"$f":"SUM(G12:G36)","v":0},{"$f":"SUM(H12:H36)","v":0},{"$f":"SUM(I11:I36)","v":0},{"$f":"SUM(J11:J36)","v":31343.311194703954},{"$f":"SUM(K11:K36)","v":24156.279581580879},null,{"$f":"IF(MAX(M11:M36)>25,\">25\",MAX(M11:M36))","v":7}]
[null,null,null,null,null,null,null,null,{"$f":"F37+I37","v":21815.089029826097}]
[null,null,null,null,null,null,null,null,null,null,"Stromgestehungskosten:",{"$f":"I38/D37*100","v":9.2978546858273639},"cent/kWh"]
[null,null,null,null,null,null,null,null,null,null,"Mehreinnahmen nach 25 Jahren:",{"$f":"NPV(Eingabe!H$106/100,Berechnungen!J12:J36)+J11","v":24156.279581580864},"€"]
[null,null,null,null,null,null,null,null,null,null,"Interner Zinsfuß:",{"$f":"IRR(K11:K36)","v":0.11779184962925093}]
[null,"Legende:"]
[null,null,null,"Tarif aus der Förderung"]
[null,null,null,"Errechneter Tarif"]
[null,null,null,"Verlinkungen"]
[null,null,null,"Überschusseinspeisung nach Förderung"]
[]
[null,null,"Sondertarif ","gilt für Überschußeinspeiser"]
[null,null,"Fördertarif","gilt für alle Bundesländer in welchen es eine Tarifförderung gibt"]
[null,null,"Einspeisetarif","ist ein errechnter (prognostizierter) Tarif"]
[]
[null,"Tarifförderung:"]
[null,null,null,"<=5","5 bis 20","größer 20",null,"Anlagengröße"]
[null,null,null,5,20,"> 20",null,{"$f":"Eingabe!H37","v":10}]
[null,null,"B",null,{"$f":"Förderungen!H11","v":"-"},{"$f":"E55","v":"-"},null,{"$f":"IF(Eingabe!$H$37<$D$54,D55,IF(Eingabe!$H$37<=$E$54,E55,IF(Eingabe!$H$37>$E$54,F55,\"\")))","v":"-"},{"$f":"IF(C55=$F$6,H55,0)","v":0}]
[null,null,"K",null,{"$f":"Förderungen!H23","v":"-"},{"$f":"E56","v":"-"},null,{"$f":"IF(Eingabe!$H$37<$D$54,D56,IF(Eingabe!$H$37<=$E$54,E56,IF(Eingabe!$H$37>$E$54,F56,\"\")))","v":"-"},{"$f":"IF(C56=$F$6,H56,0)","v":0}]
[null,null,"N",null,{"$f":"Förderungen!H35","v":"-"},"-",null,{"$f":"IF(Eingabe!$H$37<$D$54,D57,IF(Eingabe!$H$37<=$E$54,E57,IF(Eingabe!$H$37>$E$54,F57,\"\")))","v":"-"},0]
[null,null,"O",null,{"$f":"Förderungen!H47","v":"-"},"-",null,{"$f":"IF(Eingabe!$H$37<$D$54,D58,IF(Eingabe!$H$37<=$E$54,E58,IF(Eingabe!$H$37>$E$54,F58,\"\")))","v":"-"},"-"]
[null,null,"Sa",null,{"$f":"Förderungen!H47","v":"-"},"-",null,{"$f":"IF(Eingabe!$H$37<$D$54,D59,IF(Eingabe!$H$37<=$E$54,E59,IF(Eingabe!$H$37>$E$54,F59,\"\")))","v":"-"},0]
[null,null,"St",null,{"$f":"Förderungen!H73","v":"-"},"-",null,{"$f":"IF(Eingabe!$H$37<$D$54,D60,IF(Eingabe!$H$37<=$E$54,E60,IF(Eingabe!$H$37>$E$54,F60,\"\")))","v":"-"},0]
[null,null,"T",null,{"$f":"Förderungen!H85","v":"-"},"-",null,{"$f":"IF(Eingabe!$H$37<$D$54,D61,IF(Eingabe!$H$37<=$E$54,E61,IF(Eingabe!$H$37>$E$54,F61,\"\")))","v":"-"},0]
[null,null,"V",null,{"$f":"Förderungen!H97","v":"-"},"-",null,{"$f":"IF(Eingabe!$H$37<$D$54,D62,IF(Eingabe!$H$37<=$E$54,E62,IF(Eingabe!$H$37>$E$54,F62,\"\")))","v":"-"},0]
[null,null,"W",null,{"$f":"Förderungen!H109","v":"-"},"-",null,{"$f":"IF(Eingabe!$H$37<$D$54,D63,IF(Eingabe!$H$37<=$E$54,E63,IF(Eingabe!$H$37>$E$54,F63,\"\")))","v":"-"},0]
[null,null,null,null,null,null,null,{"$f":"SUM(I55:I63)","v":0}]
[]
[]
[]
[]
[]
[null,"Tarifzuweisung:",null,null,null,null,null,null,null,null,"W"]
[null,null,null,null,null,null,null,null,null,null,{"$f":"IF($C$6=B73,$D$63,\"\")","v":""}]
[null,"kWp","B","K","N","O","Sa","St","T","V",{"$f":"IF($C$6=B74,$D$63,\"\")","v":""}]
[null,1,{"$f":"IF($C$6=B73,$D$55,\"\")","v":""},{"$f":"IF($C$6=B73,$D$56,\"\")","v":""},{"$f":"IF($C$6=B73,$D$57,\"\")","v":""},{"$f":"IF($C$6=B73,$D$58,\"\")","v":""},{"$f":"IF($C$6=B73,$D$59,\"\")","v":""},{"$f":"IF($C$6=B73,$D$60,\"\")","v":""},{"$f":"IF($C$6=B73,$D$61,\"\")","v":""},{"$f":"IF($C$6=B73,$D$62,\"\")","v":""},{"$f":"IF($C$6=B75,$D$63,\"\")","v":""}]
[null,2,{"$f":"IF($C$6=B74,$D$55,\"\")","v":""},{"$f":"IF($C$6=B74,$D$56,\"\")","v":""},{"$f":"IF($C$6=B74,$D$57,\"\")","v":""},{"$f":"IF($C$6=B74,$D$58,\"\")","v":""},{"$f":"IF($C$6=B74,$D$59,\"\")","v":""},{"$f":"IF($C$6=B74,$D$60,\"\")","v":""},{"$f":"IF($C$6=B74,$D$61,\"\")","v":""},{"$f":"IF($C$6=B74,$D$62,\"\")","v":""},{"$f":"IF($C$6=B76,$D$63,\"\")","v":""}]
[null,3,{"$f":"IF($C$6=B75,$D$55,\"\")","v":""},{"$f":"IF($C$6=B75,$D$56,\"\")","v":""},{"$f":"IF($C$6=B75,$D$57,\"\")","v":""},{"$f":"IF($C$6=B75,$D$58,\"\")","v":""},{"$f":"IF($C$6=B75,$D$59,\"\")","v":""},{"$f":"IF($C$6=B75,$D$60,\"\")","v":""},{"$f":"IF($C$6=B75,$D$61,\"\")","v":""},{"$f":"IF($C$6=B75,$D$62,\"\")","v":""},{"$f":"IF($C$6=B77,$E$63,\"\")","v":""}]
[null,4,{"$f":"IF($C$6=B76,$D$55,\"\")","v":""},{"$f":"IF($C$6=B76,$D$56,\"\")","v":""},{"$f":"IF($C$6=B76,$D$57,\"\")","v":""},{"$f":"IF($C$6=B76,$D$58,\"\")","v":""},{"$f":"IF($C$6=B76,$D$59,\"\")","v":""},{"$f":"IF($C$6=B76,$D$60,\"\")","v":""},{"$f":"IF($C$6=B76,$D$61,\"\")","v":""},{"$f":"IF($C$6=B76,$D$62,\"\")","v":""},{"$f":"IF($C$6=B78,$E$63,\"\")","v":""}]
[null,5.01,{"$f":"IF($C$6<$B$77,$E$55,\"\")","v":""},{"$f":"IF($C$6=B77,$E$56,\"\")","v":""},{"$f":"IF($C$6=B77,$E$57,\"\")","v":""},{"$f":"IF($C$6=B77,$E$58,\"\")","v":""},{"$f":"IF($C$6=B77,$E$59,\"\")","v":""},{"$f":"IF($C$6=B77,$E$60,\"\")","v":""},{"$f":"IF($C$6=B77,$E$61,\"\")","v":""},{"$f":"IF($C$6=B77,$E$62,\"\")","v":""},{"$f":"IF($C$6=B79,$E$63,\"\")","v":""}]
[null,6,{"$f":"IF($C$6=B78,$E$55,\"\")","v":""},{"$f":"IF($C$6=B78,$E$56,\"\")","v":""},{"$f":"IF($C$6=B78,$E$57,\"\")","v":""},{"$f":"IF($C$6=B78,$E$58,\"\")","v":""},{"$f":"IF($C$6=B78,$E$59,\"\")","v":""},{"$f":"IF($C$6=B78,$E$60,\"\")","v":""},{"$f":"IF($C$6=B78,$E$61,\"\")","v":""},{"$f":"IF($C$6=B78,$E$62,\"\")","v":""},{"$f":"IF($C$6=B80,$E$63,\"\")","v":""}]
[null,7,{"$f":"IF($C$6=B79,$E$55,\"\")","v":""},{"$f":"IF($C$6=B79,$E$56,\"\")","v":""},{"$f":"IF($C$6=B79,$E$57,\"\")","v":""},{"$f":"IF($C$6=B79,$E$58,\"\")","v":""},{"$f":"IF($C$6=B79,$E$59,\"\")","v":""},{"$f":"IF($C$6=B79,$E$60,\"\")","v":""},{"$f":"IF($C$6=B79,$E$61,\"\")","v":""},{"$f":"IF($C$6=B79,$E$62,\"\")","v":""},{"$f":"IF($C$6=B81,$E$63,\"\")","v":""}]
[null,8,{"$f":"IF($C$6=B80,$E$55,\"\")","v":""},{"$f":"IF($C$6=B80,$E$56,\"\")","v":""},{"$f":"IF($C$6=B80,$E$57,\"\")","v":""},{"$f":"IF($C$6=B80,$E$58,\"\")","v":""},{"$f":"IF($C$6=B80,$E$59,\"\")","v":""},{"$f":"IF($C$6=B80,$E$60,\"\")","v":""},{"$f":"IF($C$6=B80,$E$61,\"\")","v":""},{"$f":"IF($C$6=B80,$E$62,\"\")","v":""},{"$f":"IF($C$6=B82,$F$63,\"\")","v":""}]
[null,9,{"$f":"IF($C$6=B81,$E$55,\"\")","v":""},{"$f":"IF($C$6=B81,$E$56,\"\")","v":""},{"$f":"IF($C$6=B81,$E$57,\"\")","v":""},{"$f":"IF($C$6=B81,$E$58,\"\")","v":""},{"$f":"IF($C$6=B81,$E$59,\"\")","v":""},{"$f":"IF($C$6=B81,$E$60,\"\")","v":""},{"$f":"IF($C$6=B81,$E$61,\"\")","v":""},{"$f":"IF($C$6=B81,$E$62,\"\")","v":""},""]
[null,10.01,{"$f":"IF($C$6=B82,$F$55,\"\")","v":""},{"$f":"IF($C$6=B82,$F$56,\"\")","v":""},{"$f":"IF($C$6=B82,$F$57,\"\")","v":""},{"$f":"IF($C$6=B82,$F$58,\"\")","v":""},{"$f":"IF($C$6=B82,$F$59,\"\")","v":""},{"$f":"IF($C$6=B82,$F$60,\"\")","v":""},{"$f":"IF($C$6=B82,$F$61,\"\")","v":""},{"$f":"IF($C$6=B82,$F$62,\"\")","v":""},""]
[null,11,"","","","","","","","",""]
[null,12,"","","","","","","","",""]
[null,13,"","","","","","","","",""]
[null,14,"","","","","","","","",{"$f":"SUM(K71:K85)","v":0}]
[null,15,"","","","","","","","",{"$f":"IF($F$6=K70,K86,\"\")","v":""},{"$f":"H64","v":0}]
[null,"Summe",{"$f":"SUM(C73:C87)","v":0},{"$f":"SUM(D73:D87)","v":0},0,0,0,0,0,{"$f":"SUM(J73:J87)","v":0}]
[null,"Bundesland",{"$f":"IF($F$6=C72,C88,\"\")","v":""},{"$f":"IF($F$6=D72,D88,\"\")","v":""},"",0,"","","",{"$f":"IF($F$6=J72,J88,\"\")","v":""}]

{"sheet":"Förderungen","index":5,"n_rows":112,"n_cols":42,"rows_kept":112,"cut":false,"hidden":false,"merged":[[4,18,4,27],[5,6,5,7],[5,2,5,3],[5,4,5,5],[35,19,35,21],[32,19,32,21],[29,4,29,5],[6,18,30,27],[18,10,18,15],[22,10,22,15],[41,4,41,5],[41,2,41,3],[17,2,17,3],[17,4,17,5],[17,6,17,7],[29,6,29,7],[29,2,29,3],[41,6,41,7],[58,10,58,15],[67,6,67,7],[54,10,54,15],[38,19,38,22],[104,10,104,15],[108,10,108,15],[103,2,103,3],[103,4,103,5],[103,6,103,7],[79,6,79,7],[53,2,53,3],[53,4,53,5],[53,6,53,7],[91,2,91,3],[91,4,91,5],[91,6,91,7],[79,2,79,3],[79,4,79,5],[67,2,67,3],[67,4,67,5]]}
[]
[]
[null,"Gesamte Förderung:",null,null,null,null,null,null,null,"Landesförderungen:",null,null,null,null,null,null,null,null,"Bundesförderungen:",null,null,null,null,null,null,null,null,null,null,null,null,"Weitere Informationen zu Förderungen für Photovoltaik und Speicher erhalten Sie unter:"]
[]
[null,"Förderung für Burgenland",null,null,null,null,null,null,null,"Förderungen aktualisiert am 22.04.2022",null,null,null,null,null,null,null,null,"Klima- und Energiefonds Förderaktion Photovoltaik-Anlagen 2017",null,null,null,null,null,null,null,null,null,null,null,null,"https://www.pvaustria.at/forderungen/"]
[null,null,"Anlagengröße",null,"Landesförderung",null,"Bundesförderung",null,null,null,null,null,null,null,null,null,null,null,null,null,null,null,null,null,null,null,null,null,null,null,null,"https://www.oem-ag.at/de/foerderung/"]
[null,null,"","","Investition",null,"Investition",null,null,null,null,null,null,null,null,null,null,null,"Eine mögliche Förderung wird hier nach Bekanntgabe veröffentlicht."]
[null,null,{"$f":"AN9","v":"0,01-10"},"kWp","-","-",{"$f":"IF(Eingabe!$H$63=Eingabe!$C$170,AP9,0)","v":285},"-"]
[null,null,{"$f":"AN10","v":">10-20"},"kWp","-","-",{"$f":"IF(Eingabe!$H$63=Eingabe!$C$170,AP10,0)","v":250},"-",null,null,null,null,null,null,null,null,null,null,null,null,null,null,null,null,null,null,null,null,null,null,null,null,null,null,null,null,null,null,"A","0,01-10",null,285]
[null,null,">20-100","kWp","-","-",{"$f":"IF(Eingabe!$H$63=Eingabe!$C$170,AP11,0)","v":180},"-",null,null,null,null,null,null,null,null,null,null,null,null,null,null,null,null,null,null,null,null,null,null,null,null,null,null,null,null,null,null,"B",">10-20",null,250]
[null,null,{"$f":"AN12","v":">100-1000"},"kWp","-","-",{"$f":"IF(Eingabe!$H$63=Eingabe!$C$170,AP12,0)","v":170},"-",null,null,null,null,null,null,null,null,null,null,null,null,null,null,null,null,null,null,null,null,null,null,null,null,null,null,null,null,null,null,"C",">20-100",null,180]
[null,null,null,null,null,null,null,null,null,null,null,null,null,null,null,null,null,null,null,null,null,null,null,null,null,null,null,null,null,null,null,null,null,null,null,null,null,null,"D",">100-1000",null,170]
[null,"Information:"]
[null,{"$f":"Eingabe!I209","v":"keine Landesförderung"}]
[]
[]
[null,"Förderung für Kärnten",null,null,null,null,null,null,null,"Förderungen aktualisiert am 22.04.2022"]
[null,null,"Anlagengröße",null,"Landesförderung",null,"Bundesförderung",null,null,null,"Nähere Informationen zur PV-Förderung (Private):"]
[null,null,"","","Investition",null,"Investition",null,null,null,"https://www.ktn.gv.at/Service/Formulare-und-Leistungen#search=photovoltaik"]
[null,null,{"$f":"C8","v":"0,01-10"},"kWp","*","*",{"$f":"$G$8","v":285},"-"]
[null,null,">10-20","kWp","*","*",{"$f":"$G$9","v":250},"-"]
[null,null,">20-100","kWp","*","*",{"$f":"$G$10","v":180},"-",null,null,"Nähere Informationen zur Speicher-Förderung (Private):"]
[null,null,{"$f":"C11","v":">100-1000"},"kWp","*","*",{"$f":"$G$11","v":170},{"$f":"$H$11","v":"-"},null,null,"https://www.ktn.gv.at/Service/Formulare-und-Leistungen#search=photovoltaik"]
[]
[null,"Information:"]
[null,{"$f":"Eingabe!I210","v":"Förderprogramm im Zuge der Wohnbauförderung (Link im Register \"Förderungen\")"}]
[]
[]
[null,"Förderung für Niederösterreich",null,null,null,null,null,null,null,"Förderungen aktualisiert am 22.04.2022"]
[null,null,"Anlagengröße",null,"Landesförderung",null,"Bundesförderung"]
[null,null,"","","Investition",null,"Investition"]
[null,null,{"$f":"C8","v":"0,01-10"},"kWp","-","-",{"$f":"$G$8","v":285},"-",null,null,null,null,null,null,null,null,null,null,null,"Zur Homepage:"]
[null,null,">10-20","kWp","-","-",{"$f":"$G$9","v":250},"-"]
[null,null,">20-100","kWp","-","-",{"$f":"$G$10","v":180},"-"]
[null,null,{"$f":"C11","v":">100-1000"},"kWp","-","-",{"$f":"$G$11","v":170},{"$f":"$H$11","v":"-"},null,null,null,null,null,null,null,null,null,null,null,"Zur Registrierung:"]
[]
[null,"Information:"]
[null,{"$f":"Eingabe!I211","v":"keine Landesförderung"},null,null,null,null,null,null,null,null,null,null,null,null,null,null,null,null,null,"Zum Leitfaden:"]
[]
[]
[null,"Förderung für Oberösterreich",null,null,null,null,null,null,null,"Förderungen aktualisiert am 22.04.2022"]
[null,null,"Anlagengröße",null,"Landesförderung",null,"Bundesförderung"]
[null,null,"","","Investition",null,"Investition"]
[null,null,{"$f":"C20","v":"0,01-10"},"kWp","-","-",{"$f":"$G$8","v":285},"-"]
[null,null,">10-20","kWp","-","-",{"$f":"$G$9","v":250},"-"]
[null,null,">20-100","kWp","-","-",{"$f":"$G$10","v":180},"-"]
[null,null,{"$f":"C23","v":">100-1000"},"kWp","-","-",{"$f":"$G$11","v":170},{"$f":"$H$11","v":"-"}]
[]
[null,"Information:"]
[null,{"$f":"Eingabe!I212","v":"keine Landesförderung"}]
[]
[]
[null,"Förderung für Salzburg",null,null,null,null,null,null,null,"Förderungen aktualisiert am 22.04.2021"]
[null,null,"Anlagengröße",null,"Landesförderung",null,"Bundesförderung",null,null,null,"Nähere Informationen zur PV-Förderung (Private):"]
[null,null,"","","Investition",null,"Investition",null,null,null,"https://www.salzburg.gv.at/energie_/Seiten/photovoltaik-privat.aspx"]
[null,null,{"$f":"C32","v":"0,01-10"},"kWp",150,"€/kWp",{"$f":"$G$8","v":285},"-"]
[null,null,">10-20","kWp",150,"€/kWp",{"$f":"$G$9","v":250},"-"]
[null,null,">20-100","kWp",null,"€/kWp",{"$f":"$G$10","v":180},"-",null,null,"Nähere Informationen zur Speicher-Förderung (Private):"]
[null,null,{"$f":"C35","v":">100-1000"},"kWp",null,"€/kWp",{"$f":"$G$11","v":170},{"$f":"$H$11","v":"-"},null,null,"https://www.salzburg.gv.at/wirtschaft_/Seiten/betriebliche-photovoltaik.aspx"]
[]
[null,"Information:"]
[null,{"$f":"Eingabe!I213","v":"Förderspanne 1-15 kWp; Förderprogramm Photovoltaik (private) und Speicher (Link im Register \"Förderungen\")"}]
[]
[]
[null,"Gesamte Förderung:",null,null,null,null,null,null,null,"Landesförderungen:"]
[]
[null,"Förderung für Steiermark",null,null,null,null,null,null,null,"Förderungen aktualisiert am 22.04.2022"]
[null,null,"Anlagengröße",null,"Landesförderung",null,"Bundesförderung"]
[null,null,"","","Investition",null,"Investition"]
[null,null,{"$f":"C56","v":"0,01-10"},"kWp","-","-",{"$f":"$G$8","v":285},"-"]
[null,null,">10-20","kWp","-","-",{"$f":"$G$9","v":250},"-"]
[null,null,">20-100","kWp","-","-",{"$f":"$G$10","v":180},"-"]
[null,null,{"$f":"C59","v":">100-1000"},"kWp","-","-",{"$f":"$G$11","v":170},{"$f":"$H$11","v":"-"}]
[]
[null,"Information:"]
[null,{"$f":"Eingabe!I214","v":"keine Landesförderung"}]
[]
[]
[null,"Förderung für Tirol",null,null,null,null,null,null,null,"Förderungen aktualisiert am 22.04.2022"]
[null,null,"Anlagengröße",null,"Landesförderung",null,"Bundesförderung"]
[null,null,"","","Investition",null,"Investition"]
[null,null,{"$f":"C70","v":"0,01-10"},"kWp","-","-",{"$f":"$G$8","v":285},"-"]
[null,null,">10-20","kWp","-","-",{"$f":"$G$9","v":250},"-"]
[null,null,">20-100","kWp","-","-",{"$f":"$G$10","v":180},"-"]
[null,null,{"$f":"C73","v":">100-1000"},"kWp","-","-",{"$f":"$G$11","v":170},{"$f":"$H$11","v":"-"}]
[]
[null,"Information:"]
[null,{"$f":"Eingabe!I215","v":"keine Landesförderung"}]
[]
[]
[null,"Förderung für Vorarlberg",null,null,null,null,null,null,null,"Förderungen aktualisiert am 22.04.2022"]
[null,null,"Anlagengröße",null,"Landesförderung",null,"Bundesförderung"]
[null,null,"","","Investition",null,"Investition"]
[null,null,{"$f":"C82","v":"0,01-10"},"kWp","-","-",{"$f":"$G$8","v":285},"-"]
[null,null,">10-20","kWp","-","-",{"$f":"$G$9","v":250},"-"]
[null,null,">20-100","kWp",{"$f":"E94","v":"-"},"-",{"$f":"$G$10","v":180},"-"]
[null,null,{"$f":"C85","v":">100-1000"},"kWp","-","-",{"$f":"$G$11","v":170},{"$f":"$H$11","v":"-"}]
[]
[null,"Information:"]
[null,{"$f":"Eingabe!I216","v":"keine Landesförderung"}]
[]
[]
[null,"Förderung für Wien",null,null,null,null,null,null,null,"Förderungen aktualisiert am 22.04.2022"]
[null,null,"Anlagengröße",null,"Landesförderung",null,"Bundesförderung",null,null,null,"Nähere Informationen zur PV-Förderung (Private):"]
[null,null,"","","Investition",null,"Investition",null,null,null,"https://www.wien.gv.at/amtshelfer/bauen-wohnen/energie/alternativenergie/oekostromanlagen.html"]
[null,null,{"$f":"C94","v":"0,01-10"},"kWp",250,"€/kWp",{"$f":"$G$8","v":285},"-"]
[null,null,">10-20","kWp",250,"€/kWp",{"$f":"$G$9","v":250},"-"]
[null,null,">20-100","kWp",250,"€/kWp",{"$f":"$G$10","v":180},"-",null,null,"Nähere Informationen zur Speicher-Förderung (Private):"]
[null,null,{"$f":"C97","v":">100-1000"},"kWp",200,"€/kWp",{"$f":"$G$11","v":170},{"$f":"$H$11","v":"-"},null,null,"https://www.wien.gv.at/amtshelfer/bauen-wohnen/energie/alternativenergie/speicheranlagen.html"]
[]
[null,"Information:"]
[null,{"$f":"Eingabe!I217","v":"Landesförderung max. 30% der Investkosten 250€/kWp bis 100kWp, 200€/kWp von 100 bis 500kWp"}]

{"sheet":"Wetterdaten","index":6,"n_rows":54,"n_cols":13,"rows_kept":54,"cut":false,"hidden":true,"merged":[]}
["Ort","PLZ","Land","PLZ-Differenz","Jährliche Einstrahlung","mittlere Aussentemperatur","Längengrad","Breitengrad","Ermittlung der Einstrahlung"]
[null,null,null,null,"[kWh/m²a]","[°C]","[°]","[°]"]
["Admont",8911,"AUT",{"$f":"IF(B3>$L$3,B3-$L$3,$L$3-B3)","v":4511},1028.32,"    5.86","-14.45"," 47.57",{"$f":"IF($L$4=D3,E3,0)","v":0},{"$f":"IF(I3=0,0,1)","v":0},"PLZ:",{"$f":"Eingabe!H12","v":4400}]
["Amstetten",3300,"AUT",1100,1069.0999999999999,"    8.79","-14.83"," 48.08",0,{"$f":"IF(I4=0,0,1)","v":0},"Diff:",{"$f":"MIN(D3:D53)","v":62}]
["Arriach",9543,"AUT",5143,1144.54,"    6.46","-13.85"," 46.72",0,0,"Einstrahlung",{"$f":"ROUNDDOWN(K54,-0.5)","v":1068},"kWh/m²a"]
["Bad Gleichenberg",8344,"AUT",3944,1153.19,"    9.14","-15.88"," 46.87",0,0]
["Bad Ischl",4820,"AUT",420,1093.31,"    7.90","-13.60"," 47.72",0,0]
["Bludenz",6700,"AUT",2300,1079.79,"    7.97"," -9.82"," 48.50",0,0]
["Bruck an der Mur",8600,"AUT",4200,1070.77,"    8.07","-15.25"," 47.42",0,0]
["Eisenerz",8790,"AUT",4390,1071.43,"    7.11","-14.88"," 47.53",0,0]
["Eisenstadt",7000,"AUT",2600,1132.17,"   10.01","-16.68"," 47.90",0,0]
["Feldkirch",6800,"AUT",2400,1100.3800000000001,"    8.30"," -9.58"," 47.23",0,0]
["Ferlach",9170,"AUT",4770,1156.25,"    7.82","-14.28"," 46.52",0,0]
["Fresach ",9712,"AUT",5312,1207.3599999999999,"    7.07","-13.68"," 46.70",0,0]
["Gargellen",6787,"AUT",2387,1174.51,"    4.42"," -9.92"," 46.97",0,0]
["Gmunden",4810,"AUT",410,1088.42,"    8.57","-13.80"," 47.92",0,0]
["Graz",8010,"AUT",3610,1126.02,"    9.17","-15.42"," 47.67",0,0]
["Gumpoldskirchen",2352,"AUT",2048,1125.22,"    9.11","-16.27"," 48.33",0,0]
["Hallstadt",4830,"AUT",430,1054.8,"    8.00","-13.63"," 47.55",0,0]
["Imst",6460,"AUT",2060,1069.1099999999999,"    7.31","-10.72"," 47.23",0,0]
["Innsbruck",6020,"AUT",1620,1089.72,"    8.61","-11.40"," 47.27",0,0]
["Kitzbuehl",6370,"AUT",1970,1069.8800000000001,"    6.19","-12.38"," 47.45",0,0]
["Klagenfurt",9010,"AUT",4610,1131,"    8.14","-14.30"," 46.62",0,0]
["Krems a. d. Donau",3500,"AUT",900,1071.4000000000001,"    9.62","-15.58"," 48.50",0,0]
["Kremsmünster",4550,"AUT",150,1046.5,"    7.69","-14.12"," 48.05",0,0]
["Leoben",8700,"AUT",4300,1068.49,"    8.30","-15.83"," 47.37",0,0]
["Lienz",9900,"AUT",5500,1147.74,"    7.41","-12.80"," 46.83",0,0]
["Lilienfeld",3180,"AUT",1220,1075.26,"    8.36","-15.62"," 48.17",0,0]
["Millstatt",9872,"AUT",5472,1189.53,"    8.67","-13.57"," 46.80",0,0]
["Mondsee",5310,"AUT",910,1046.56,"    7.84","-13.33"," 47.85",0,0]
["Mönichkirchen",2872,"AUT",1528,1083.3,"    6.25","-16.17"," 47.50",0,0]
["Nauders",6543,"AUT",2143,1201.4100000000001,"    4.71","-10.50"," 46.88",0,0]
["Neumarkt in der Steiermark",8820,"AUT",4420,1161.95,"    6.39","-14.42"," 47.67",0,0]
["Obervellach",9821,"AUT",5421,1226.7,"    8.44","-13.20"," 46.93",0,0]
["Oberwölz Stadt",8832,"AUT",{"$f":"IF(B35>$L$3,B35-$L$3,$L$3-B35)","v":4432},1107.8499999999999,"    6.20","-14.27"," 47.20",{"$f":"IF($L$4=D35,E35,0)","v":0},0]
["Radentheim",9545,"AUT",5145,1133.1199999999999,"    7.53","-13.70"," 46.80",0,0]
["Ramsau Dachstein",8972,"AUT",4572,1129.03,"    5.16","-12.88"," 47.60",0,0]
["Rauris",5661,"AUT",1261,1124.1500000000001,"    5.82","-12.98"," 47.23",0,0]
["Reichersberg",4981,"AUT",581,1037.3699999999999,"    8.48","-13.37"," 48.33",0,0]
["Reichraming",4462,"AUT",62,1068.82,"    8.13","-14.45"," 47.88",1068.82,1]
["Salzburg",5020,"AUT",620,1113.6099999999999,"    8.39","-13.33"," 47.82",0,0]
["St. Lorenzen im Lesachtal",9654,"AUT",5254,1217.1300000000001,"    5.73"," 12.77"," 46.70",0,0]
["St. Michael i. Lundgau",5582,"AUT",1182,1194.76,"    6.55","-13.48"," 47.83",0,0]
["St. Pölten",3100,"AUT",1300,1031.18,"    8.59","-15.60"," 48.20",0,0]
["Velden am Wörtersee",9220,"AUT",4820,1189.4000000000001,"    8.04","-14.33"," 46.62",0,0]
["Villach",9500,"AUT",5100,1188.95,"    8.04","-13.83"," 46.62",0,0]
["Wels",4600,"AUT",200,1036.5,"    8.67","-14.17"," 48.17",0,0]
["Weyer Mark",3335,"AUT",1065,1106.53,"    7.58","-14.65"," 47.85",0,0]
["Wien",1190,"AUT",3210,1084.48,"    9.77","-16.33"," 48.20",0,0]
["Wiener Neustadt",2700,"AUT",1700,1080.56,"    9.44","-16.23"," 47.82",0,0]
["Wolfsberg",9400,"AUT",5000,1066.68,"    7.86","-14.83"," 46.85",0,0]
["Zell am See",5700,"AUT",1300,1080.32,"    6.55","-12.77"," 47.32",0,0]
["Zwettl",3910,"AUT",490,1051.52,"    5.71","-15.15"," 48.58",0,0]
[null,null,null,null,null,null,null,"Einstrahlungswert:",{"$f":"SUM(I3:I53)","v":1068.82},{"$f":"SUM(J3:J53)","v":1},{"$f":"I54/J54","v":1068.82}]

{"sheet":"PLZ-Zuordnung","index":7,"n_rows":2460,"n_cols":10,"rows_kept":2460,"cut":false,"hidden":true,"merged":[]}
["PLZ","Ort","Bundesland","NamePLZTyp","intern_extern","adressierbar","Postfach"]
[null,null,null,null,null,null,null,null,"Zuordnung der PLZ und des Ortes (Bundesland):"]
[1004,"Wien","W","InteressentenPLZ","extern","Nein","Ja",null,{"$f":"Eingabe!H12","v":4400},{"$f":"VLOOKUP(I3,A3:C2460,3,TRUE)","v":"O"}]
[1010,"Wien","W","PLZ-Adressierung","extern","Ja","Ja",null,null,{"$f":"VLOOKUP(J3,I7:J15,2,TRUE)","v":"Oberösterreich"}]
[1011,"Wien Postfach","W","PLZ-Postfach","extern","Nein","Ja",null,null,{"$f":"VLOOKUP(I3,A3:C2460,2,FALSE)","v":"Steyr"}]
[1012,"Wien","W","PLZ-Postfach","extern","Nein","Ja"]
[1013,"Wien","W","PLZ-Postfach","extern","Nein","Ja",null,"B","Burgenland"]
[1014,"Wien","W","PLZ-Postfach","extern","Nein","Ja",null,"K","Kärnten"]
[1015,"Wien","W","PLZ-Postfach","extern","Nein","Ja",null,"N","Niederösterreich"]
[1016,"Wien","W","PLZ-Postfach","extern","Nein","Ja",null,"O","Oberösterreich"]
[1017,"Wien-Parlament","W","PLZ-Postfach","extern","Nein","Ja",null,"Sa","Salzburg"]
[1018,"Wien","W","PLZ-Postfach","extern","Nein","Ja",null,"St","Steiermark"]
[1020,"Wien","W","PLZ-Adressierung","extern","Ja","Ja",null,"T","Tirol"]
[1021,"Wien Postfach","W","PLZ-Postfach","extern","Nein","Ja",null,"V","Vorarlberg"]
[1022,"Wien","W","PLZ-Postfach","extern","Nein","Ja",null,"W","Wien"]
[1023,"Wien","W","PLZ-Postfach","extern","Nein","Ja"]
[1024,"Wien","W","PLZ-Postfach","extern","Nein","Ja"]
[1025,"Wien","W","PLZ-Postfach","extern","Nein","Ja"]
[1029,"Wien","W","InteressentenPLZ","extern","Nein","Ja"]
[1030,"Wien","W","PLZ-Adressierung","extern","Ja","Ja"]
[1031,"Wien Postfach","W","PLZ-Postfach","extern","Nein","Ja"]
[1033,"Wien","W","PLZ-Postfach","extern","Nein","Ja"]
[1034,"Wien","W","PLZ-Postfach","extern","Nein","Ja"]
[1035,"Wien","W","PLZ-Postfach","extern","Nein","Ja"]
[1036,"Wien","W","PLZ-Postfach","extern","Nein","Ja"]
[1037,"Wien","W","PLZ-Postfach","extern","Nein","Ja"]
[1038,"Wien","W","InteressentenPLZ","extern","Nein","Ja"]
[1039,"Wien","W","InteressentenPLZ","extern","Nein","Ja"]
[1040,"Wien","W","PLZ-Adressierung","extern","Ja","Ja"]
[1041,"Wien Postfach","W","PLZ-Postfach","extern","Nein","Ja"]
[1042,"Wien","W","PLZ-Postfach","extern","Nein","Ja"]
[1043,"Wien","W","PLZ-Postfach","extern","Nein","Ja"]
[1045,"Wien","W","InteressentenPLZ","extern","Nein","Ja"]
[1050,"Wien","W","PLZ-Adressierung","extern","Ja","Ja"]
[1051,"Wien Postfach","W","PLZ-Postfach","extern","Nein","Ja"]
[1052,"Wien","W","PLZ-Postfach","extern","Nein","Ja"]
[1053,"Wien","W","PLZ-Postfach","extern","Nein","Ja"]
[1060,"Wien","W","PLZ-Adressierung","extern","Ja","Ja"]
[1061,"Wien Postfach","W","PLZ-Postfach","extern","Nein","Ja"]
[1062,"Wien","W","PLZ-Postfach","extern","Nein","Ja"]
[1063,"Wien-VÖPh","W","InteressentenPLZ","extern","Nein","Ja"]
[1070,"Wien","W","PLZ-Adressierung","extern","Ja","Ja"]
[1071,"Wien Postfach","W","PLZ-Postfach","extern","Nein","Ja"]
[1072,"Wien","W","PLZ-Postfach","extern","Nein","Ja"]
[1080,"Wien","W","PLZ-Adressierung","extern","Ja","Ja"]
[1081,"Wien Postfach","W","PLZ-Postfach","extern","Nein","Ja"]
[1082,"Wien","W","PLZ-Postfach","extern","Nein","Ja"]
[1090,"Wien","W","PLZ-Adressierung","extern","Ja","Ja"]
[1091,"Wien Postfach","W","PLZ-Postfach","extern","Nein","Ja"]
[1092,"Wien","W","PLZ-Postfach","extern","Nein","Ja"]
[1093,"Wien","W","PLZ-Postfach","extern","Nein","Ja"]
[1094,"Wien","W","PLZ-Postfach","extern","Nein","Ja"]
[1095,"Wien","W","PLZ-Postfach","extern","Nein","Ja"]
[1096,"Wien","W","PLZ-Postfach","extern","Nein","Ja"]
[1097,"Wien","W","PLZ-Postfach","extern","Nein","Ja"]
[1100,"Wien","W","PLZ-Adressierung","extern","Ja","Ja"]
[1101,"Wien Postfach","W","PLZ-Postfach","extern","Nein","Ja"]
[1102,"Wien","W","PLZ-Postfach","extern","Nein","Ja"]
[1103,"Wien","W","PLZ-Postfach","extern","Nein","Ja"]
[1104,"Wien","W","PLZ-Postfach","extern","Nein","Ja"]
[1105,"Wien","W","PLZ-Postfach","extern","Nein","Ja"]
[1106,"Wien","W","PLZ-Postfach","extern","Nein","Ja"]
[1107,"Wien","W","PLZ-Postfach","extern","Nein","Ja"]
[1108,"Wien","W","PLZ-Postfach","extern","Nein","Ja"]
[1109,"Wien","W","PLZ-Postfach","extern","Nein","Ja"]
[1110,"Wien","W","PLZ-Adressierung","extern","Ja","Ja"]
[1111,"Wien Postfach","W","PLZ-Postfach","extern","Nein","Ja"]
[1112,"Wien","W","PLZ-Postfach","extern","Nein","Ja"]
[1113,"Wien","W","PLZ-Postfach","extern","Nein","Ja"]
[1120,"Wien","W","PLZ-Adressierung","extern","Ja","Ja"]
[1121,"Wien Postfach","W","PLZ-Postfach","extern","Nein","Ja"]
[1122,"Wien","W","PLZ-Postfach","extern","Nein","Ja"]
[1125,"Wien","W","PLZ-Postfach","extern","Nein","Ja"]
[1126,"Wien","W","PLZ-Postfach","extern","Nein","Ja"]
[1127,"Wien","W","PLZ-Postfach","extern","Nein","Ja"]
[1130,"Wien","W","PLZ-Adressierung","extern","Ja","Ja"]
[1131,"Wien Postfach","W","PLZ-Postfach","extern","Nein","Ja"]
[1132,"Wien","W","PLZ-Postfach","extern","Nein","Ja"]
[1133,"Wien","W","PLZ-Postfach","extern","Nein","Ja"]
[1134,"Wien","W","PLZ-Postfach","extern","Nein","Ja"]
[1136,"Wien","W","InteressentenPLZ","extern","Nein","Ja"]
[1140,"Wien","W","PLZ-Adressierung","extern","Ja","Ja"]
[1141,"Wien Postfach","W","PLZ-Postfach","extern","Nein","Ja"]
[1142,"Wien","W","PLZ-Postfach","extern","Nein","Ja"]
[1143,"Wien","W","PLZ-Postfach","extern","Nein","Ja"]
[1144,"Wien","W","PLZ-Postfach","extern","Nein","Ja"]
[1145,"Wien","W","PLZ-Postfach","extern","Nein","Ja"]
[1147,"Wien","W","PLZ-Postfach","extern","Nein","Ja"]
[1148,"Wien","W","InteressentenPLZ","extern","Nein","Ja"]
[1150,"Wien","W","PLZ-Adressierung","extern","Ja","Ja"]
[1151,"Wien Postfach","W","PLZ-Postfach","extern","Nein","Ja"]
[1152,"Wien","W","PLZ-Postfach","extern","Nein","Ja"]
[1153,"Wien","W","PLZ-Postfach","extern","Nein","Ja"]
[1160,"Wien","W","PLZ-Adressierung","extern","Ja","Ja"]
[1161,"Wien Postfach","W","PLZ-Postfach","extern","Nein","Ja"]
[1163,"Wien","W","PLZ-Postfach","extern","Nein","Ja"]
[1165,"Wien","W","PLZ-Postfach","extern","Nein","Ja"]
[1166,"Wien","W","PLZ-Postfach","extern","Nein","Ja"]
[1170,"Wien","W","PLZ-Adressierung","extern","Ja","Ja"]
[1171,"Wien Postfach","W","PLZ-Postfach","extern","Nein","Ja"]
[1172,"Wien","W","PLZ-Postfach","extern","Nein","Ja"]
[1173,"Wien","W","PLZ-Postfach","extern","Nein","Ja"]
[1180,"Wien","W","PLZ-Adressierung","extern","Ja","Ja"]
[1181,"Wien Postfach","W","PLZ-Postfach","extern","Nein","Ja"]
[1182,"Wien","W","PLZ-Postfach","extern","Nein","Ja"]
[1183,"Wien","W","PLZ-Postfach","extern","Nein","Ja"]
[1190,"Wien","W","PLZ-Adressierung","extern","Ja","Ja"]
[1191,"Wien Postfach","W","PLZ-Postfach","extern","Nein","Ja"]
[1192,"Wien","W","PLZ-Postfach","extern","Nein","Ja"]
[1193,"Wien","W","PLZ-Postfach","extern","Nein","Ja"]
[1194,"Wien","W","PLZ-Postfach","extern","Nein","Ja"]
[1195,"Wien","W","PLZ-Postfach","extern","Nein","Ja"]
[1196,"Wien","W","PLZ-Postfach","extern","Nein","Ja"]
[1200,"Wien","W","PLZ-Adressierung","extern","Ja","Ja"]
[1201,"Wien Postfach","W","PLZ-Postfach","extern","Nein","Ja"]
[1202,"Wien","W","PLZ-Postfach","extern","Nein","Ja"]
[1203,"Wien","W","PLZ-Postfach","extern","Nein","Ja"]
[1204,"Wien","W","PLZ-Postfach","extern","Nein","Ja"]
[1205,"Wien","W","PLZ-Postfach","extern","Nein","Ja"]
[1206,"Wien","W","PLZ-Postfach","extern","Nein","Ja"]
[1210,"Wien","W","PLZ-Adressierung","extern","Ja","Ja"]
[1211,"Wien Postfach","W","PLZ-Postfach","extern","Nein","Ja"]
[1212,"Wien","W","PLZ-Postfach","extern","Nein","Ja"]
[1213,"Wien","W","PLZ-Postfach","extern","Nein","Ja"]
[1214,"Wien","W","PLZ-Postfach","extern","Nein","Ja"]
[1215,"Wien","W","PLZ-Postfach","extern","Nein","Ja"]
[1216,"Wien","W","PLZ-Postfach","extern","Nein","Ja"]
[1217,"Wien","W","PLZ-Postfach","extern","Nein","Ja"]
[1218,"Wien","W","PLZ-Postfach","extern","Nein","Ja"]
[1220,"Wien","W","PLZ-Adressierung","extern","Ja","Ja"]
[1221,"Wien Postfach","W","PLZ-Postfach","extern","Nein","Ja"]
[1222,"Wien","W","PLZ-Postfach","extern","Nein","Ja"]
[1223,"Wien","W","PLZ-Postfach","extern","Nein","Ja"]
[1224,"Wien","W","PLZ-Postfach","extern","Nein","Ja"]
[1225,"Wien","W","PLZ-Postfach","extern","Nein","Ja"]
[1226,"Wien","W","PLZ-Postfach","extern","Nein","Ja"]
[1228,"Wien","W","PLZ-Postfach","extern","Nein","Ja"]
[1229,"Wien","W","PLZ-Postfach","extern","Nein","Ja"]
[1230,"Wien","W","PLZ-Adressierung","extern","Ja","Ja"]
[1231,"Wien Postfach","W","PLZ-Postfach","extern","Nein","Ja"]
[1232,"Wien","W","PLZ-Postfach","extern","Nein","Ja"]
[1233,"Wien","W","PLZ-Postfach","extern","Nein","Ja"]
[1234,"Wien","W","PLZ-Postfach","extern","Nein","Ja"]
[1235,"Wien","W","PLZ-Postfach","extern","Nein","Ja"]
[1236,"Wien","W","PLZ-Postfach","extern","Nein","Ja"]
[1238,"Wien","W","PLZ-Postfach","extern","Nein","Ja"]
[1239,"Wien","W","PLZ-Postfach","extern","Nein","Ja"]
[1300,"Wien-Flughafen","W","PLZ-Adressierung","extern","Ja","Ja"]
[1400,"Wien-Vereinte Nationen","W","PLZ-Postfach","extern","Nein","Ja"]
[1402,"Wien","W","PLZ-Postfach","extern","Nein","Ja"]
[1423,"Wien","W","PLZ-Postfach","extern","Nein","Ja"]
[1500,"UNDOF AUSBATT","W","FeldPLZ","extern","Nein","Ja"]
[1502,"AUCON EUFOR","W","FeldPLZ","extern","Nein","Ja"]
[1503,"AUCON KFOR","W","FeldPLZ","extern","Nein","Ja"]
[1600,"Wien","W","InteressentenPLZ","extern","Nein","Ja"]
[2000,"Stockerau","N","PLZ-Adressierung","extern","Ja","Ja"]
[2002,"Großmugl","N","PLZ-Adressierung","extern","Ja","Nein"]
[2003,"Leitzersdorf","N","PLZ-Adressierung","extern","Ja","Nein"]
[2004,"Niederhollabrunn","N","PLZ-Adressierung","extern","Ja","Nein"]
[2011,"Sierndorf","N","PLZ-Adressierung","extern","Ja","Nein"]
[2013,"Göllersdorf","N","PLZ-Adressierung","extern","Ja","Nein"]
[2014,"Breitenwaida","N","PLZ-Adressierung","extern","Ja","Nein"]
[2020,"Hollabrunn","N","PLZ-Adressierung","extern","Ja","Ja"]
[2022,"Immendorf","N","PLZ-Adressierung","extern","Ja","Nein"]
[2023,"Nappersdorf","N","PLZ-Adressierung","extern","Ja","Ja"]
[2024,"Mailberg","N","PLZ-Adressierung","extern","Ja","Nein"]
[2031,"Eggendorf im Thale","N","PLZ-Adressierung","extern","Ja","Nein"]
[2032,"Enzersdorf im Thale","N","PLZ-Adressierung","extern","Ja","Nein"]
[2033,"Kammersdorf","N","PLZ-Adressierung","extern","Ja","Nein"]
[2034,"Großharras","N","PLZ-Adressierung","extern","Ja","Ja"]
[2041,"Wullersdorf","N","PLZ-Adressierung","extern","Ja","Ja"]
[2042,"Guntersdorf","N","PLZ-Adressierung","extern","Ja","Nein"]
[2051,"Zellerndorf","N","PLZ-Adressierung","extern","Ja","Ja"]
[2052,"Pernersdorf-Pfaffendorf","N","PLZ-Adressierung","extern","Ja","Nein"]
[2053,"Jetzelsdorf","N","PLZ-Adressierung","extern","Ja","Nein"]
[2054,"Haugsdorf","N","PLZ-Adressierung","extern","Ja","Ja"]
[2061,"Hadres","N","PLZ-Adressierung","extern","Ja","Ja"]
[2062,"Seefeld-Großkadolz","N","PLZ-Adressierung","extern","Ja","Nein"]
[2063,"Zwingendorf","N","PLZ-Adressierung","extern","Ja","Nein"]
[2064,"Wulzeshofen","N","PLZ-Adressierung","extern","Ja","Nein"]
[2070,"Retz","N","PLZ-Adressierung","extern","Ja","Ja"]
[2073,"Schrattenthal","N","PLZ-Adressierung","extern","Ja","Nein"]
[2074,"Unterretzbach","N","PLZ-Adressierung","extern","Ja","Nein"]
[2081,"Niederfladnitz","N","PLZ-Adressierung","extern","Ja","Nein"]
[2082,"Hardegg","N","PLZ-Adressierung","extern","Ja","Nein"]
[2083,"Pleißing","N","PLZ-Adressierung","extern","Ja","Nein"]
[2084,"Weitersfeld","N","PLZ-Adressierung","extern","Ja","Ja"]
[2091,"Langau","N","PLZ-Adressierung","extern","Ja","Nein"]
[2092,"Riegersburg","N","PLZ-Adressierung","extern","Ja","Nein"]
[2093,"Geras","N","PLZ-Adressierung","extern","Ja","Ja"]
[2094,"Zissersdorf","N","PLZ-Adressierung","extern","Ja","Nein"]
[2095,"Drosendorf","N","PLZ-Adressierung","extern","Ja","Nein"]
[2100,"Korneuburg","N","PLZ-Adressierung","extern","Ja","Ja"]
[2102,"Bisamberg","N","PLZ-Adressierung","extern","Ja","Ja"]
[2103,"Langenzersdorf","N","PLZ-Adressierung","extern","Ja","Ja"]
[2104,"Spillern","N","PLZ-Adressierung","extern","Ja","Ja"]
[2105,"Oberrohrbach","N","PLZ-Adressierung","extern","Ja","Nein"]
[2111,"Rückersdorf-Harmannsdorf","N","PLZ-Adressierung","extern","Ja","Nein"]
[2112,"Würnitz","N","PLZ-Adressierung","extern","Ja","Nein"]
[2113,"Karnabrunn","N","PLZ-Adressierung","extern","Ja","Nein"]
[2114,"Großrußbach","N","PLZ-Adressierung","extern","Ja","Nein"]
[2115,"Ernstbrunn","N","PLZ-Adressierung","extern","Ja","Ja"]
[2116,"Niederleis","N","PLZ-Adressierung","extern","Ja","Nein"]
[2120,"Wolkersdorf im Weinviertel","N","PLZ-Adressierung","extern","Ja","Ja"]
[2122,"Ulrichskirchen","N","PLZ-Adressierung","extern","Ja","Ja"]
[2123,"Schleinbach","N","PLZ-Adressierung","extern","Ja","Nein"]
[2124,"Niederkreuzstetten","N","PLZ-Adressierung","extern","Ja","Ja"]
[2125,"Neubau","N","PLZ-Adressierung","extern","Ja","Nein"]
[2126,"Ladendorf","N","PLZ-Adressierung","extern","Ja","Nein"]
[2130,"Mistelbach","N","PLZ-Adressierung","extern","Ja","Ja"]
[2132,"Frättingsdorf","N","PLZ-Adressierung","extern","Ja","Nein"]
[2133,"Loosdorf","N","PLZ-Adressierung","extern","Ja","Nein"]
[2134,"Staatz-Kautendorf","N","PLZ-Adressierung","extern","Ja","Nein"]
[2135,"Neudorf bei Staatz","N","PLZ-Adressierung","extern","Ja","Nein"]
[2136,"Laa an der Thaya","N","PLZ-Adressierung","extern","Ja","Ja"]
[2141,"Ameis","N","PLZ-Adressierung","extern","Ja","Ja"]
[2143,"Großkrut","N","PLZ-Adressierung","extern","Ja","Nein"]
[2144,"Altlichtenwarth","N","PLZ-Adressierung","extern","Ja","Nein"]
[2145,"Hausbrunn","N","PLZ-Adressierung","extern","Ja","Ja"]
[2151,"Asparn an der Zaya","N","PLZ-Adressierung","extern","Ja","Nein"]
[2152,"Gnadendorf","N","PLZ-Adressierung","extern","Ja","Ja"]
[2153,"Stronsdorf","N","PLZ-Adressierung","extern","Ja","Nein"]
[2154,"Unterstinkenbrunn","N","PLZ-Adressierung","extern","Ja","Nein"]
[2161,"Poysbrunn","N","PLZ-Adressierung","extern","Ja","Ja"]
[2162,"Falkenstein","N","PLZ-Adressierung","extern","Ja","Nein"]
[2163,"Ottenthal","N","PLZ-Adressierung","extern","Ja","Ja"]
[2164,"Wildendürnbach","N","PLZ-Adressierung","extern","Ja","Nein"]
[2165,"Drasenhofen","N","PLZ-Adressierung","extern","Ja","Nein"]
[2170,"Poysdorf","N","PLZ-Adressierung","extern","Ja","Ja"]
[2171,"Herrnbaumgarten","N","PLZ-Adressierung","extern","Ja","Nein"]
[2172,"Schrattenberg","N","PLZ-Adressierung","extern","Ja","Ja"]
[2181,"Dobermannsdorf","N","PLZ-Adressierung","extern","Ja","Nein"]
[2182,"Palterndorf","N","PLZ-Adressierung","extern","Ja","Nein"]
[2183,"Neusiedl an der Zaya","N","PLZ-Adressierung","extern","Ja","Nein"]
[2184,"Hauskirchen","N","PLZ-Adressierung","extern","Ja","Nein"]
[2185,"Prinzendorf an der Zaya","N","PLZ-Adressierung","extern","Ja","Nein"]
[2191,"Gaweinstal","N","PLZ-Adressierung","extern","Ja","Ja"]
[2192,"Kettlasbrunn","N","PLZ-Adressierung","extern","Ja","Nein"]
[2193,"Wilfersdorf","N","PLZ-Adressierung","extern","Ja","Nein"]
[2201,"Gerasdorf","N","PLZ-Adressierung","extern","Ja","Ja"]
[2202,"Enzersfeld","N","PLZ-Adressierung","extern","Ja","Ja"]
[2203,"Großebersdorf","N","PLZ-Adressierung","extern","Ja","Ja"]
[2211,"Pillichsdorf","N","PLZ-Adressierung","extern","Ja","Nein"]
[2212,"Großengersdorf","N","PLZ-Adressierung","extern","Ja","Nein"]
[2213,"Bockfließ","N","PLZ-Adressierung","extern","Ja","Ja"]
[2214,"Auersthal","N","PLZ-Adressierung","extern","Ja","Ja"]
[2215,"Raggendorf","N","PLZ-Adressierung","extern","Ja","Nein"]
[2221,"Groß Schweinbarth","N","PLZ-Adressierung","extern","Ja","Nein"]
[2222,"Bad Pirawarth","N","PLZ-Adressierung","extern","Ja","Nein"]
[2223,"Hohenruppersdorf","N","PLZ-Adressierung","extern","Ja","Nein"]
[2224,"Obersulz","N","PLZ-Adressierung","extern","Ja","Nein"]
[2225,"Zistersdorf","N","PLZ-Adressierung","extern","Ja","Ja"]
[2230,"Gänserndorf","N","PLZ-Adressierung","extern","Ja","Ja"]
[2231,"Strasshof an der Nordbahn","N","PLZ-Adressierung","extern","Ja","Ja"]
[2232,"Deutsch Wagram","N","PLZ-Adressierung","extern","Ja","Ja"]
[2241,"Schönkirchen","N","PLZ-Adressierung","extern","Ja","Nein"]
[2242,"Prottes","N","PLZ-Adressierung","extern","Ja","Ja"]
[2243,"Matzen","N","PLZ-Adressierung","extern","Ja","Nein"]
[2244,"Spannberg","N","PLZ-Adressierung","extern","Ja","Nein"]
[2245,"Velm-Götzendorf","N","PLZ-Adressierung","extern","Ja","Nein"]
[2251,"Ebenthal","N","PLZ-Adressierung","extern","Ja","Nein"]
[2252,"Ollersdorf","N","PLZ-Adressierung","extern","Ja","Nein"]
[2253,"Weikendorf","N","PLZ-Adressierung","extern","Ja","Nein"]
[2261,"Angern an der March","N","PLZ-Adressierung","extern","Ja","Ja"]
[2262,"Stillfried","N","PLZ-Adressierung","extern","Ja","Nein"]
[2263,"Dürnkrut","N","PLZ-Adressierung","extern","Ja","Ja"]
[2264,"Jedenspeigen","N","PLZ-Adressierung","extern","Ja","Nein"]
[2265,"Drösing","N","PLZ-Adressierung","extern","Ja","Nein"]
[2272,"Niederabsdorf","N","PLZ-Adressierung","extern","Ja","Nein"]
[2273,"Hohenau an der March","N","PLZ-Adressierung","extern","Ja","Ja"]
[2274,"Rabensburg","N","PLZ-Adressierung","extern","Ja","Ja"]
[2275,"Bernhardsthal","N","PLZ-Adressierung","extern","Ja","Nein"]
[2276,"Reintal","N","PLZ-Adressierung","extern","Ja","Nein"]
[2281,"Raasdorf","N","PLZ-Adressierung","extern","Ja","Nein"]
[2282,"Markgrafneusiedl","N","PLZ-Adressierung","extern","Ja","Nein"]
[2283,"Obersiebenbrunn","N","PLZ-Adressierung","extern","Ja","Ja"]
[2284,"Untersiebenbrunn","N","PLZ-Adressierung","extern","Ja","Nein"]
[2285,"Leopoldsdorf im Marchfelde","N","PLZ-Adressierung","extern","Ja","Nein"]
[2286,"Haringsee","N","PLZ-Adressierung","extern","Ja","Nein"]
[2291,"Lassee","N","PLZ-Adressierung","extern","Ja","Ja"]
[2292,"Engelhartstetten","N","PLZ-Adressierung","extern","Ja","Nein"]
[2293,"Marchegg Stadt","N","PLZ-Adressierung","extern","Ja","Nein"]
[2294,"Marchegg Bahnhof","N","PLZ-Adressierung","extern","Ja","Ja"]
[2295,"Oberweiden","N","PLZ-Adressierung","extern","Ja","Nein"]
[2301,"Groß-Enzersdorf","N","PLZ-Adressierung","extern","Ja","Ja"]
[2304,"Orth an der Donau","N","PLZ-Adressierung","extern","Ja","Ja"]
[2305,"Eckartsau","N","PLZ-Adressierung","extern","Ja","Nein"]
[2320,"Schwechat","N","PLZ-Adressierung","extern","Ja","Ja"]
[2322,"Zwölfaxing","N","PLZ-Adressierung","extern","Ja","Nein"]
[2323,"Schwechat-Mannswörth","N","PLZ-Postfach","extern","Nein","Ja"]
[2324,"Schwechat-Rannersdorf","N","PLZ-Postfach","extern","Nein","Ja"]
[2325,"Himberg","N","PLZ-Adressierung","extern","Ja","Ja"]
[2326,"Maria Lanzendorf","N","PLZ-Adressierung","extern","Ja","Ja"]
[2331,"Vösendorf","N","PLZ-Adressierung","extern","Ja","Ja"]
[2332,"Hennersdorf","N","PLZ-Adressierung","extern","Ja","Ja"]
[2333,"Leopoldsdorf","N","PLZ-Adressierung","extern","Ja","Ja"]
[2334,"Vösendorf","N","PLZ-Adressierung","extern","Ja","Ja"]
[2340,"Mödling","N","PLZ-Adressierung","extern","Ja","Ja"]
[2342,"Mödling","N","PLZ-Postfach","extern","Nein","Ja"]
[2344,"Maria Enzersdorf","N","PLZ-Adressierung","extern","Ja","Ja"]
[2345,"Brunn am Gebirge","N","PLZ-Adressierung","extern","Ja","Ja"]
[2346,"Maria Enzersdorf-Südstadt","N","PLZ-Postfach","extern","Nein","Ja"]
[2351,"Wiener Neudorf","N","PLZ-Adressierung","extern","Ja","Ja"]
[2352,"Gumpoldskirchen","N","PLZ-Adressierung","extern","Ja","Ja"]
[2353,"Guntramsdorf","N","PLZ-Adressierung","extern","Ja","Ja"]
[2355,"Wiener Neudorf","N","PLZ-Postfach","extern","Nein","Ja"]
[2361,"Laxenburg","N","PLZ-Adressierung","extern","Ja","Ja"]
[2362,"Biedermannsdorf","N","PLZ-Adressierung","extern","Ja","Ja"]
[2371,"Hinterbrühl","N","PLZ-Adressierung","extern","Ja","Ja"]
[2372,"Gießhübl","N","PLZ-Adressierung","extern","Ja","Nein"]
[2380,"Perchtoldsdorf","N","PLZ-Adressierung","extern","Ja","Ja"]
[2381,"Laab im Walde","N","PLZ-Adressierung","extern","Ja","Nein"]
[2384,"Breitenfurt bei Wien","N","PLZ-Adressierung","extern","Ja","Ja"]
[2391,"Kaltenleutgeben","N","PLZ-Adressierung","extern","Ja","Ja"]
[2392,"Sulz im Wienerwald","N","PLZ-Adressierung","extern","Ja","Ja"]
[2393,"Sittendorf","N","PLZ-Adressierung","extern","Ja","Nein"]
[2401,"Fischamend","N","PLZ-Adressierung","extern","Ja","Ja"]
[2402,"Maria Ellend","N","PLZ-Adressierung","extern","Ja","Ja"]
[2403,"Regelsbrunn","N","PLZ-Adressierung","extern","Ja","Nein"]
[2404,"Petronell","N","PLZ-Adressierung","extern","Ja","Nein"]
[2405,"Bad Deutsch Altenburg","N","PLZ-Adressierung","extern","Ja","Ja"]
[2410,"Hainburg an der Donau","N","PLZ-Adressierung","extern","Ja","Ja"]
[2412,"Wolfsthal","N","PLZ-Adressierung","extern","Ja","Nein"]
[2413,"Berg","N","PLZ-Adressierung","extern","Ja","Nein"]
[2421,"Kittsee","B","PLZ-Adressierung","extern","Ja","Ja"]
[2422,"Pama","B","PLZ-Adressierung","extern","Ja","Nein"]
[2423,"Deutsch Jahrndorf","B","PLZ-Adressierung","extern","Ja","Nein"]
[2424,"Zurndorf","B","PLZ-Adressierung","extern","Ja","Ja"]
[2425,"Nickelsdorf","B","PLZ-Adressierung","extern","Ja","Ja"]
[2431,"Kleinneusiedl","N","PLZ-Adressierung","extern","Ja","Nein"]
[2432,"Schwadorf","N","PLZ-Adressierung","extern","Ja","Ja"]
[2433,"Margarethen am Moos","N","PLZ-Adressierung","extern","Ja","Nein"]
[2434,"Götzendorf an der Leitha","N","PLZ-Adressierung","extern","Ja","Nein"]
[2435,"Ebergassing","N","PLZ-Adressierung","extern","Ja","Ja"]
[2440,"Gramatneusiedl","N","PLZ-Adressierung","extern","Ja","Ja"]
[2441,"Mitterndorf an der Fischa","N","PLZ-Adressierung","extern","Ja","Nein"]
[2442,"Unterwaltersdorf","N","PLZ-Adressierung","extern","Ja","Ja"]
[2443,"Deutsch Brodersdorf","N","PLZ-Adressierung","extern","Ja","Ja"]
[2444,"Seibersdorf","N","PLZ-Adressierung","extern","Ja","Nein"]
[2451,"Hof am Leithaberge","N","PLZ-Adressierung","extern","Ja","Ja"]
[2452,"Mannersdorf am Leithagebirge","N","PLZ-Adressierung","extern","Ja","Ja"]
[2453,"Sommerein","N","PLZ-Adressierung","extern","Ja","Nein"]
[2454,"Trautmannsdorf an der Leitha","N","PLZ-Adressierung","extern","Ja","Nein"]
[2460,"Bruck an der Leitha","N","PLZ-Adressierung","extern","Ja","Ja"]
[2462,"Wilfleinsdorf","N","PLZ-Adressierung","extern","Ja","Nein"]
[2463,"Stixneusiedl","N","PLZ-Adressierung","extern","Ja","Nein"]
[2464,"Göttlesbrunn","N","PLZ-Adressierung","extern","Ja","Nein"]
[2465,"Höflein","N","PLZ-Adressierung","extern","Ja","Nein"]
[2471,"Rohrau","N","PLZ-Adressierung","extern","Ja","Nein"]
[2472,"Prellenkirchen","N","PLZ-Adressierung","extern","Ja","Nein"]
[2473,"Potzneusiedl","B","PLZ-Adressierung","extern","Ja","Nein"]
[2474,"Gattendorf","B","PLZ-Adressierung","extern","Ja","Ja"]
[2475,"Neudorf","B","PLZ-Adressierung","extern","Ja","Nein"]
[2481,"Achau","N","PLZ-Adressierung","extern","Ja","Ja"]
[2482,"Münchendorf","N","PLZ-Adressierung","extern","Ja","Ja"]
[2483,"Ebreichsdorf","N","PLZ-Adressierung","extern","Ja","Ja"]
[2485,"Wampersdorf","N","PLZ-Adressierung","extern","Ja","Ja"]
[2486,"Pottendorf","N","PLZ-Adressierung","extern","Ja","Ja"]
[2490,"Ebenfurth","N","PLZ-Adressierung","extern","Ja","Ja"]
[2491,"Neufeld an der Leitha","B","PLZ-Adressierung","extern","Ja","Ja"]
[2492,"Eggendorf","N","PLZ-Adressierung","extern","Ja","Nein"]
[2493,"Lichtenwörth-Nadelburg","N","PLZ-Adressierung","extern","Ja","Ja"]
[2500,"Baden","N","PLZ-Adressierung","extern","Ja","Ja"]
[2502,"Baden-Leesdorf","N","PLZ-Postfach","extern","Nein","Ja"]
[2511,"Pfaffstätten","N","PLZ-Adressierung","extern","Ja","Ja"]
[2512,"Tribuswinkel","N","PLZ-Adressierung","extern","Ja","Ja"]
[2513,"Möllersdorf","N","PLZ-Postfach","extern","Nein","Ja"]
[2514,"Traiskirchen","N","PLZ-Adressierung","extern","Ja","Ja"]
[2521,"Trumau","N","PLZ-Adressierung","extern","Ja","Ja"]
[2522,"Oberwaltersdorf","N","PLZ-Adressierung","extern","Ja","Ja"]
[2523,"Tattendorf","N","PLZ-Adressierung","extern","Ja","Ja"]
[2524,"Teesdorf","N","PLZ-Adressierung","extern","Ja","Nein"]
[2525,"Günselsdorf","N","PLZ-Adressierung","extern","Ja","Ja"]
[2531,"Gaaden","N","PLZ-Adressierung","extern","Ja","Nein"]
[2532,"Heiligenkreuz","N","PLZ-Adressierung","extern","Ja","Ja"]
[2533,"Klausen-Leopoldsdorf","N","PLZ-Adressierung","extern","Ja","Nein"]
[2534,"Alland","N","PLZ-Adressierung","extern","Ja","Ja"]
[2540,"Bad Vöslau","N","PLZ-Adressierung","extern","Ja","Ja"]
[2542,"Kottingbrunn","N","PLZ-Adressierung","extern","Ja","Ja"]
[2544,"Leobersdorf","N","PLZ-Adressierung","extern","Ja","Ja"]
[2551,"Enzesfeld-Lindabrunn","N","PLZ-Adressierung","extern","Ja","Ja"]
[2552,"Hirtenberg","N","PLZ-Adressierung","extern","Ja","Ja"]
[2560,"Berndorf","N","PLZ-Adressierung","extern","Ja","Ja"]
[2562,"Berndorf, Niederösterreich","N","PLZ-Postfach","extern","Nein","Ja"]
[2563,"Pottenstein","N","PLZ-Adressierung","extern","Ja","Ja"]
[2564,"Weissenbach an der Triesting","N","PLZ-Adressierung","extern","Ja","Ja"]
[2565,"Neuhaus","N","PLZ-Adressierung","extern","Ja","Nein"]
[2571,"Altenmarkt-Thenneberg","N","PLZ-Adressierung","extern","Ja","Ja"]
[2572,"Kaumberg","N","PLZ-Adressierung","extern","Ja","Nein"]
[2601,"Sollenau","N","PLZ-Adressierung","extern","Ja","Ja"]
[2602,"Blumau-Neurißhof","N","PLZ-Adressierung","extern","Ja","Nein"]
[2603,"Felixdorf","N","PLZ-Adressierung","extern","Ja","Ja"]
[2604,"Theresienfeld","N","PLZ-Adressierung","extern","Ja","Ja"]
[2620,"Neunkirchen","N","PLZ-Adressierung","extern","Ja","Ja"]
[2622,"Neunkirchen, Niederösterreich","N","PLZ-Postfach","extern","Nein","Ja"]
[2624,"Breitenau","N","PLZ-Adressierung","extern","Ja","Nein"]
[2625,"Schwarzau am Steinfelde","N","PLZ-Adressierung","extern","Ja","Nein"]
[2630,"Ternitz","N","PLZ-Adressierung","extern","Ja","Ja"]
[2631,"Sieding-Stixenstein","N","PLZ-Adressierung","extern","Ja","Nein"]
[2632,"Wimpassing im Schwarzatale","N","PLZ-Adressierung","extern","Ja","Ja"]
[2640,"Gloggnitz","N","PLZ-Adressierung","extern","Ja","Ja"]
[2641,"Schottwien","N","PLZ-Adressierung","extern","Ja","Nein"]
[2642,"Maria Schutz","N","PLZ-Adressierung","extern","Ja","Nein"]
[2650,"Payerbach","N","PLZ-Adressierung","extern","Ja","Ja"]
[2651,"Reichenau an der Rax","N","PLZ-Adressierung","extern","Ja","Ja"]
[2654,"Prein an der Rax","N","PLZ-Adressierung","extern","Ja","Nein"]
[2661,"Naßwald","N","PLZ-Adressierung","extern","Ja","Nein"]
[2662,"Schwarzau im Gebirge","N","PLZ-Adressierung","extern","Ja","Nein"]
[2663,"Rohr im Gebirge","N","PLZ-Adressierung","extern","Ja","Nein"]
[2671,"Küb","N","PLZ-Adressierung","extern","Ja","Nein"]
[2673,"Breitenstein","N","PLZ-Adressierung","extern","Ja","Nein"]
[2680,"Semmering","N","PLZ-Adressierung","extern","Ja","Nein"]
[2700,"Wiener Neustadt","N","PLZ-Adressierung","extern","Ja","Ja"]
[2702,"Wiener Neustadt","N","PLZ-Postfach","extern","Nein","Ja"]
[2704,"Wiener Neustadt","N","PLZ-Postfach","extern","Nein","Ja"]
[2705,"Wiener Neustadt","N","PLZ-Postfach","extern","Nein","Ja"]
[2706,"Wiener Neustadt","N","InteressentenPLZ","extern","Nein","Ja"]
[2721,"Bad Fischau","N","PLZ-Adressierung","extern","Ja","Ja"]
[2722,"Winzendorf","N","PLZ-Adressierung","extern","Ja","Ja"]
[2723,"Muthmannsdorf","N","PLZ-Adressierung","extern","Ja","Nein"]
[2724,"Hohe Wand-Stollhof","N","PLZ-Adressierung","extern","Ja","Nein"]
[2731,"St. Egyden am Steinfeld","N","PLZ-Adressierung","extern","Ja","Nein"]
[2732,"Willendorf","N","PLZ-Adressierung","extern","Ja","Ja"]
[2733,"Grünbach am Schneeberg","N","PLZ-Adressierung","extern","Ja","Ja"]
[2734,"Puchberg am Schneeberg","N","PLZ-Adressierung","extern","Ja","Ja"]
[2751,"Steinabrückl","N","PLZ-Adressierung","extern","Ja","Ja"]
[2752,"Wöllersdorf","N","PLZ-Adressierung","extern","Ja","Ja"]
[2753,"Markt Piesting","N","PLZ-Adressierung","extern","Ja","Ja"]
[2754,"Waldegg","N","PLZ-Adressierung","extern","Ja","Ja"]
[2755,"Oed","N","PLZ-Adressierung","extern","Ja","Nein"]
[2761,"Miesenbach","N","PLZ-Adressierung","extern","Ja","Nein"]
[2763,"Pernitz","N","PLZ-Adressierung","extern","Ja","Ja"]
[2770,"Gutenstein","N","PLZ-Adressierung","extern","Ja","Nein"]
[2801,"Katzelsdorf","N","PLZ-Adressierung","extern","Ja","Nein"]
[2802,"Hochwolkersdorf","N","PLZ-Adressierung","extern","Ja","Nein"]
[2803,"Schwarzenbach","N","PLZ-Adressierung","extern","Ja","Nein"]
[2811,"Wiesmath","N","PLZ-Adressierung","extern","Ja","Ja"]
[2812,"Hollenthon","N","PLZ-Adressierung","extern","Ja","Nein"]
[2813,"Lichtenegg","N","PLZ-Adressierung","extern","Ja","Nein"]
[2821,"Lanzenkirchen","N","PLZ-Adressierung","extern","Ja","Ja"]
[2822,"Bad Erlach","N","PLZ-Adressierung","extern","Ja","Ja"]
[2823,"Pitten","N","PLZ-Adressierung","extern","Ja","Ja"]
[2824,"Seebenstein","N","PLZ-Adressierung","extern","Ja","Nein"]
[2831,"Warth","N","PLZ-Adressierung","extern","Ja","Ja"]
[2832,"Thernberg","N","PLZ-Adressierung","extern","Ja","Nein"]
[2833,"Bromberg","N","PLZ-Adressierung","extern","Ja","Nein"]
[2840,"Grimmenstein","N","PLZ-Adressierung","extern","Ja","Ja"]
[2842,"Edlitz","N","PLZ-Adressierung","extern","Ja","Nein"]
[2851,"Krumbach","N","PLZ-Adressierung","extern","Ja","Ja"]
[2852,"Hochneukirchen","N","PLZ-Adressierung","extern","Ja","Nein"]
[2853,"Bad Schönau","N","PLZ-Adressierung","extern","Ja","Nein"]
[2860,"Kirchschlag in der Buckligen Welt","N","PLZ-Adressierung","extern","Ja","Ja"]
[2870,"Aspang","N","PLZ-Adressierung","extern","Ja","Ja"]
[2871,"Zöbern","N","PLZ-Adressierung","extern","Ja","Nein"]
[2872,"Mönichkirchen","N","PLZ-Adressierung","extern","Ja","Nein"]
[2873,"Feistritz am Wechsel","N","PLZ-Adressierung","extern","Ja","Nein"]
[2880,"Kirchberg am Wechsel","N","PLZ-Adressierung","extern","Ja","Ja"]
[2881,"Trattenbach","N","PLZ-Adressierung","extern","Ja","Nein"]
[3001,"Mauerbach","N","PLZ-Adressierung","extern","Ja","Ja"]
[3002,"Purkersdorf","N","PLZ-Adressierung","extern","Ja","Ja"]
[3003,"Gablitz","N","PLZ-Adressierung","extern","Ja","Ja"]
[3004,"Ried am Riederberg","N","PLZ-Adressierung","extern","Ja","Nein"]
[3011,"Untertullnerbach","N","PLZ-Adressierung","extern","Ja","Ja"]
[3012,"Wolfsgraben","N","PLZ-Adressierung","extern","Ja","Ja"]
[3013,"Tullnerbach-Lawies","N","PLZ-Adressierung","extern","Ja","Ja"]
[3021,"Pressbaum","N","PLZ-Adressierung","extern","Ja","Ja"]
[3031,"Rekawinkel","N","PLZ-Adressierung","extern","Ja","Nein"]
[3032,"Eichgraben","N","PLZ-Adressierung","extern","Ja","Ja"]
[3033,"Altlengbach","N","PLZ-Adressierung","extern","Ja","Ja"]
[3034,"Maria Anzbach","N","PLZ-Adressierung","extern","Ja","Ja"]
[3040,"Neulengbach","N","PLZ-Adressierung","extern","Ja","Ja"]
[3041,"Asperhofen","N","PLZ-Adressierung","extern","Ja","Nein"]
[3042,"Würmla","N","PLZ-Adressierung","extern","Ja","Nein"]
[3051,"St. Christophen","N","PLZ-Adressierung","extern","Ja","Nein"]
[3052,"Innermanzing","N","PLZ-Adressierung","extern","Ja","Nein"]
[3053,"Laaben","N","PLZ-Adressierung","extern","Ja","Nein"]
[3061,"Ollersbach","N","PLZ-Adressierung","extern","Ja","Nein"]
[3062,"Kirchstetten","N","PLZ-Adressierung","extern","Ja","Ja"]
[3071,"Böheimkirchen","N","PLZ-Adressierung","extern","Ja","Ja"]
[3072,"Kasten bei Böheimkirchen","N","PLZ-Adressierung","extern","Ja","Nein"]
[3073,"Stössing","N","PLZ-Adressierung","extern","Ja","Ja"]
[3074,"Michelbach","N","PLZ-Adressierung","extern","Ja","Nein"]
[3100,"St. Pölten","N","PLZ-Adressierung","extern","Ja","Ja"]
[3101,"St. Pölten Postfach","N","PLZ-Postfach","extern","Nein","Ja"]
[3102,"St. Pölten","N","PLZ-Postfach","extern","Nein","Ja"]
[3103,"St. Pölten","N","PLZ-Postfach","extern","Nein","Ja"]
[3104,"St. Pölten-Harland","N","PLZ-Adressierung","extern","Ja","Nein"]
[3105,"St. Pölten-Radlberg","N","PLZ-Adressierung","extern","Ja","Nein"]
[3106,"St. Pölten-Spratzern","N","PLZ-Postfach","extern","Nein","Ja"]
[3107,"St. Pölten-Traisenpark","N","PLZ-Adressierung","extern","Ja","Ja"]
[3108,"St. Pölten-Wagram","N","PLZ-Postfach","extern","Nein","Ja"]
[3109,"St. Pölten","N","PLZ-Postfach","extern","Nein","Ja"]
[3110,"Neidling","N","PLZ-Adressierung","extern","Ja","Nein"]
[3111,"St. Pölten","N","PLZ-Postfach","extern","Nein","Ja"]
[3121,"Karlstetten","N","PLZ-Adressierung","extern","Ja","Ja"]
[3122,"Gansbach","N","PLZ-Adressierung","extern","Ja","Nein"]
[3123,"Obritzberg","N","PLZ-Adressierung","extern","Ja","Nein"]
[3124,"Oberwölbling","N","PLZ-Adressierung","extern","Ja","Nein"]
[3125,"Statzendorf","N","PLZ-Adressierung","extern","Ja","Nein"]
[3130,"Herzogenburg","N","PLZ-Adressierung","extern","Ja","Ja"]
[3131,"Getzersdorf","N","PLZ-Adressierung","extern","Ja","Nein"]
[3133,"Traismauer","N","PLZ-Adressierung","extern","Ja","Ja"]
[3134,"Nußdorf","N","PLZ-Adressierung","extern","Ja","Nein"]
[3140,"Pottenbrunn","N","PLZ-Adressierung","extern","Ja","Nein"]
[3141,"Kapelln","N","PLZ-Adressierung","extern","Ja","Nein"]
[3142,"Perschling","N","PLZ-Adressierung","extern","Ja","Nein"]
[3143,"Pyhra","N","PLZ-Adressierung","extern","Ja","Ja"]
[3144,"Wald","N","PLZ-Adressierung","extern","Ja","Nein"]
[3150,"Wilhelmsburg","N","PLZ-Adressierung","extern","Ja","Ja"]
[3151,"St. Georgen am Steinfelde","N","PLZ-Adressierung","extern","Ja","Nein"]
[3153,"Eschenau","N","PLZ-Adressierung","extern","Ja","Nein"]
[3160,"Traisen","N","PLZ-Adressierung","extern","Ja","Ja"]
[3161,"St. Veit an der Gölsen","N","PLZ-Adressierung","extern","Ja","Ja"]
[3162,"Rainfeld","N","PLZ-Adressierung","extern","Ja","Nein"]
[3163,"Rohrbach","N","PLZ-Adressierung","extern","Ja","Nein"]
[3170,"Hainfeld","N","PLZ-Adressierung","extern","Ja","Ja"]
[3171,"Kleinzell-Salzerbad","N","PLZ-Adressierung","extern","Ja","Nein"]
[3172,"Ramsau","N","PLZ-Adressierung","extern","Ja","Nein"]
[3180,"Lilienfeld","N","PLZ-Adressierung","extern","Ja","Ja"]
[3182,"Marktl, Traisental","N","InteressentenPLZ","extern","Nein","Ja"]
[3183,"Freiland","N","PLZ-Adressierung","extern","Ja","Nein"]
[3184,"Türnitz","N","PLZ-Adressierung","extern","Ja","Ja"]
[3192,"Hohenberg","N","PLZ-Adressierung","extern","Ja","Nein"]
[3193,"St. Aegyd am Neuwalde","N","PLZ-Adressierung","extern","Ja","Ja"]
[3195,"Kernhof","N","PLZ-Adressierung","extern","Ja","Nein"]
[3200,"Ober-Grafendorf","N","PLZ-Adressierung","extern","Ja","Ja"]
[3202,"Hofstetten","N","PLZ-Adressierung","extern","Ja","Nein"]
[3203,"Rabenstein an der Pielach","N","PLZ-Adressierung","extern","Ja","Ja"]
[3204,"Kirchberg an der Pielach","N","PLZ-Adressierung","extern","Ja","Ja"]
[3211,"Loich","N","PLZ-Adressierung","extern","Ja","Nein"]
[3212,"Schwarzenbach an der Pielach","N","PLZ-Adressierung","extern","Ja","Nein"]
[3213,"Frankenfels","N","PLZ-Adressierung","extern","Ja","Ja"]
[3214,"Puchenstuben","N","PLZ-Adressierung","extern","Ja","Ja"]
[3221,"Gösing an der Mariazellerbahn","N","PLZ-Adressierung","extern","Ja","Nein"]
[3222,"Annaberg","N","PLZ-Adressierung","extern","Ja","Nein"]
[3223,"Wienerbruck","N","PLZ-Adressierung","extern","Ja","Nein"]
[3224,"Mitterbach","N","PLZ-Adressierung","extern","Ja","Nein"]
[3231,"St. Margarethen an der Sierning","N","PLZ-Adressierung","extern","Ja","Nein"]
[3232,"Bischofstetten","N","PLZ-Adressierung","extern","Ja","Nein"]
[3233,"Kilb","N","PLZ-Adressierung","extern","Ja","Nein"]
[3240,"Mank","N","PLZ-Adressierung","extern","Ja","Ja"]
[3241,"Kirnberg an der Mank","N","PLZ-Adressierung","extern","Ja","Nein"]
[3242,"Texing","N","PLZ-Adressierung","extern","Ja","Nein"]
[3243,"St. Leonhard am Forst","N","PLZ-Adressierung","extern","Ja","Ja"]
[3244,"Ruprechtshofen","N","PLZ-Adressierung","extern","Ja","Nein"]
[3250,"Wieselburg","N","PLZ-Adressierung","extern","Ja","Ja"]
[3251,"Purgstall","N","PLZ-Adressierung","extern","Ja","Ja"]
[3252,"Petzenkirchen","N","PLZ-Adressierung","extern","Ja","Nein"]
[3253,"Erlauf","N","PLZ-Adressierung","extern","Ja","Nein"]
[3261,"Steinakirchen am Forst","N","PLZ-Adressierung","extern","Ja","Ja"]
[3262,"Wang","N","PLZ-Adressierung","extern","Ja","Nein"]
[3263,"Randegg","N","PLZ-Adressierung","extern","Ja","Nein"]
[3264,"Gresten","N","PLZ-Adressierung","extern","Ja","Ja"]
[3270,"Scheibbs","N","PLZ-Adressierung","extern","Ja","Ja"]
[3281,"Oberndorf an der Melk","N","PLZ-Adressierung","extern","Ja","Ja"]
[3282,"St. Georgen an der Leys","N","PLZ-Adressierung","extern","Ja","Nein"]
[3283,"St. Anton an der Jeßnitz","N","PLZ-Adressierung","extern","Ja","Nein"]
[3291,"Kienberg","N","PLZ-Adressierung","extern","Ja","Nein"]
[3292,"Gaming","N","PLZ-Adressierung","extern","Ja","Ja"]
[3293,"Lunz am See","N","PLZ-Adressierung","extern","Ja","Ja"]
[3294,"Langau","N","PLZ-Adressierung","extern","Ja","Nein"]
[3295,"Lackenhof","N","PLZ-Adressierung","extern","Ja","Nein"]
[3300,"Amstetten","N","PLZ-Adressierung","extern","Ja","Ja"]
[3302,"Amstetten, Niederösterreich","N","PLZ-Postfach","extern","Nein","Ja"]
[3304,"St. Georgen am Ybbsfelde","N","PLZ-Adressierung","extern","Ja","Nein"]
[3311,"Zeillern","N","PLZ-Adressierung","extern","Ja","Nein"]
[3312,"Oed","N","PLZ-Adressierung","extern","Ja","Nein"]
[3313,"Wallsee","N","PLZ-Adressierung","extern","Ja","Nein"]
[3314,"Strengberg","N","PLZ-Adressierung","extern","Ja","Ja"]
[3321,"Ardagger","N","PLZ-Adressierung","extern","Ja","Ja"]
[3322,"Viehdorf","N","PLZ-Adressierung","extern","Ja","Nein"]
[3323,"Neustadtl an der Donau","N","PLZ-Adressierung","extern","Ja","Nein"]
[3324,"Euratsfeld","N","PLZ-Adressierung","extern","Ja","Ja"]
[3325,"Ferschnitz","N","PLZ-Adressierung","extern","Ja","Nein"]
[3331,"Kematen","N","PLZ-Adressierung","extern","Ja","Ja"]
[3332,"Rosenau am Sonntagberg","N","PLZ-Adressierung","extern","Ja","Nein"]
[3333,"Böhlerwerk","N","PLZ-Adressierung","extern","Ja","Nein"]
[3334,"Gaflenz","O","PLZ-Adressierung","extern","Ja","Ja"]
[3335,"Weyer","O","PLZ-Adressierung","extern","Ja","Ja"]
[3340,"Waidhofen an der Ybbs","N","PLZ-Adressierung","extern","Ja","Ja"]
[3341,"Ybbsitz","N","PLZ-Adressierung","extern","Ja","Ja"]
[3342,"Opponitz","N","PLZ-Adressierung","extern","Ja","Nein"]
[3343,"Hollenstein an der Ybbs","N","PLZ-Adressierung","extern","Ja","Ja"]
[3344,"St. Georgen am Reith","N","PLZ-Adressierung","extern","Ja","Nein"]
[3345,"Göstling an der Ybbs","N","PLZ-Adressierung","extern","Ja","Ja"]
[3350,"Haag","N","PLZ-Adressierung","extern","Ja","Ja"]
[3351,"Weistrach","N","PLZ-Adressierung","extern","Ja","Nein"]
[3352,"St. Peter in der Au","N","PLZ-Adressierung","extern","Ja","Ja"]
[3353,"Seitenstetten","N","PLZ-Adressierung","extern","Ja","Ja"]
[3354,"Wolfsbach","N","PLZ-Adressierung","extern","Ja","Nein"]
[3355,"Ertl","N","PLZ-Adressierung","extern","Ja","Nein"]
[3361,"Aschbach Markt","N","PLZ-Adressierung","extern","Ja","Ja"]
[3362,"Mauer-Öhling","N","PLZ-Adressierung","extern","Ja","Nein"]
[3363,"Ulmerfeld-Hausmening","N","PLZ-Adressierung","extern","Ja","Ja"]
[3364,"Neuhofen an der Ybbs","N","PLZ-Adressierung","extern","Ja","Nein"]
[3365,"Allhartsberg","N","PLZ-Adressierung","extern","Ja","Nein"]
[3370,"Ybbs an der Donau","N","PLZ-Adressierung","extern","Ja","Ja"]
[3371,"Neumarkt an der Ybbs","N","PLZ-Adressierung","extern","Ja","Nein"]
[3372,"Blindenmarkt","N","PLZ-Adressierung","extern","Ja","Ja"]
[3373,"Kemmelbach","N","PLZ-Adressierung","extern","Ja","Ja"]
[3374,"Säusenstein","N","PLZ-Adressierung","extern","Ja","Nein"]
[3375,"Krummnußbaum","N","PLZ-Adressierung","extern","Ja","Nein"]
[3380,"Pöchlarn","N","PLZ-Adressierung","extern","Ja","Ja"]
[3381,"Golling","N","PLZ-Adressierung","extern","Ja","Nein"]
[3382,"Loosdorf","N","PLZ-Adressierung","extern","Ja","Ja"]
[3383,"Hürm","N","PLZ-Adressierung","extern","Ja","Ja"]
[3384,"Groß Sierning","N","PLZ-Adressierung","extern","Ja","Nein"]
[3385,"Prinzersdorf","N","PLZ-Adressierung","extern","Ja","Ja"]
[3386,"Hafnerbach","N","PLZ-Adressierung","extern","Ja","Nein"]
[3390,"Melk","N","PLZ-Adressierung","extern","Ja","Ja"]
[3392,"Schönbühel an der Donau","N","PLZ-Adressierung","extern","Ja","Nein"]
[3393,"Matzleinsdorf","N","PLZ-Adressierung","extern","Ja","Nein"]
[3400,"Klosterneuburg","N","PLZ-Adressierung","extern","Ja","Ja"]
[3403,"Klosterneuburg","N","PLZ-Postfach","extern","Nein","Ja"]
[3411,"Weidling","N","PLZ-Postfach","extern","Nein","Ja"]
[3412,"Kierling","N","PLZ-Postfach","extern","Nein","Ja"]
[3413,"Hintersdorf","N","PLZ-Adressierung","extern","Ja","Nein"]
[3420,"Kritzendorf","N","PLZ-Adressierung","extern","Ja","Ja"]
[3421,"Höflein an der Donau","N","PLZ-Adressierung","extern","Ja","Nein"]
[3422,"Greifenstein","N","PLZ-Adressierung","extern","Ja","Nein"]
[3423,"St. Andrä-Wördern","N","PLZ-Adressierung","extern","Ja","Ja"]
[3424,"Zeiselmauer","N","PLZ-Adressierung","extern","Ja","Ja"]
[3425,"Langenlebarn","N","PLZ-Adressierung","extern","Ja","Ja"]
[3430,"Tulln an der Donau","N","PLZ-Adressierung","extern","Ja","Ja"]
[3433,"Königstetten","N","PLZ-Adressierung","extern","Ja","Nein"]
[3434,"Tulbing","N","PLZ-Adressierung","extern","Ja","Ja"]
[3435,"Zwentendorf an der Donau","N","PLZ-Adressierung","extern","Ja","Ja"]
[3441,"Judenau","N","PLZ-Adressierung","extern","Ja","Nein"]
[3442,"Langenrohr","N","PLZ-Adressierung","extern","Ja","Nein"]
[3443,"Sieghartskirchen","N","PLZ-Adressierung","extern","Ja","Ja"]
[3451,"Michelhausen","N","PLZ-Adressierung","extern","Ja","Ja"]
[3452,"Atzenbrugg","N","PLZ-Adressierung","extern","Ja","Ja"]
[3454,"Sitzenberg-Reidling","N","PLZ-Adressierung","extern","Ja","Ja"]
[3462,"Absdorf","N","PLZ-Adressierung","extern","Ja","Ja"]
[3463,"Stetteldorf am Wagram","N","PLZ-Adressierung","extern","Ja","Nein"]
[3464,"Hausleiten","N","PLZ-Adressierung","extern","Ja","Ja"]
[3465,"Königsbrunn am Wagram","N","PLZ-Adressierung","extern","Ja","Ja"]
[3470,"Kirchberg am Wagram","N","PLZ-Adressierung","extern","Ja","Ja"]
[3471,"Großriedenthal","N","PLZ-Adressierung","extern","Ja","Ja"]
[3472,"Hohenwarth","N","PLZ-Adressierung","extern","Ja","Nein"]
[3473,"Mühlbach am Manhartsberg","N","PLZ-Adressierung","extern","Ja","Nein"]
[3474,"Altenwörth","N","PLZ-Adressierung","extern","Ja","Nein"]
[3481,"Fels am Wagram","N","PLZ-Adressierung","extern","Ja","Ja"]
[3482,"Gösing am Wagram","N","PLZ-Adressierung","extern","Ja","Nein"]
[3483,"Feuersbrunn","N","PLZ-Adressierung","extern","Ja","Nein"]
[3484,"Grafenwörth","N","PLZ-Adressierung","extern","Ja","Ja"]
[3485,"Haitzendorf","N","PLZ-Adressierung","extern","Ja","Nein"]
[3491,"Straß im Straßertale","N","PLZ-Adressierung","extern","Ja","Ja"]
[3492,"Etsdorf am Kamp","N","PLZ-Adressierung","extern","Ja","Ja"]
[3493,"Hadersdorf am Kamp","N","PLZ-Adressierung","extern","Ja","Ja"]
[3494,"Gedersdorf","N","PLZ-Adressierung","extern","Ja","Ja"]
[3495,"Rohrendorf bei Krems","N","PLZ-Adressierung","extern","Ja","Nein"]
[3500,"Krems an der Donau","N","PLZ-Adressierung","extern","Ja","Ja"]
[3502,"Krems-Lerchenfeld","N","PLZ-Postfach","extern","Nein","Ja"]
[3504,"Krems-Stein","N","PLZ-Postfach","extern","Nein","Ja"]
[3506,"Krems-Hollenburg","N","PLZ-Adressierung","extern","Ja","Nein"]
[3507,"Krems-Mitterau","N","PLZ-Postfach","extern","Nein","Ja"]
[3508,"Paudorf","N","PLZ-Adressierung","extern","Ja","Nein"]
[3511,"Furth bei Göttweig","N","PLZ-Adressierung","extern","Ja","Ja"]
[3512,"Mautern","N","PLZ-Adressierung","extern","Ja","Ja"]
[3521,"Obermeisling","N","PLZ-Adressierung","extern","Ja","Nein"]
[3522,"Lichtenau","N","PLZ-Adressierung","extern","Ja","Nein"]
[3524,"Grainbrunn","N","PLZ-Adressierung","extern","Ja","Ja"]
[3525,"Sallingberg","N","PLZ-Adressierung","extern","Ja","Nein"]
[3531,"Niedernondorf","N","PLZ-Adressierung","extern","Ja","Nein"]
[3532,"Rastenfeld","N","PLZ-Adressierung","extern","Ja","Ja"]
[3533,"Friedersbach","N","PLZ-Adressierung","extern","Ja","Nein"]
[3541,"Senftenberg","N","PLZ-Adressierung","extern","Ja","Ja"]
[3542,"Gföhl","N","PLZ-Adressierung","extern","Ja","Ja"]
[3543,"Krumau am Kamp","N","PLZ-Adressierung","extern","Ja","Nein"]
[3544,"Idolsberg","N","PLZ-Adressierung","extern","Ja","Nein"]
[3550,"Langenlois","N","PLZ-Adressierung","extern","Ja","Ja"]
[3552,"Lengenfeld","N","PLZ-Adressierung","extern","Ja","Ja"]
[3553,"Schiltern","N","PLZ-Adressierung","extern","Ja","Ja"]
[3561,"Zöbing","N","PLZ-Adressierung","extern","Ja","Nein"]
[3562,"Schönberg","N","PLZ-Adressierung","extern","Ja","Nein"]
[3564,"Plank am Kamp","N","PLZ-Adressierung","extern","Ja","Nein"]
[3571,"Gars am Kamp","N","PLZ-Adressierung","extern","Ja","Ja"]
[3572,"St. Leonhard am Hornerwald","N","PLZ-Adressierung","extern","Ja","Nein"]
[3573,"Rosenburg","N","PLZ-Adressierung","extern","Ja","Nein"]
[3580,"Horn","N","PLZ-Adressierung","extern","Ja","Ja"]
[3591,"Altenburg","N","PLZ-Adressierung","extern","Ja","Nein"]
[3592,"Röhrenbach","N","PLZ-Adressierung","extern","Ja","Nein"]
[3593,"Neupölla","N","PLZ-Adressierung","extern","Ja","Ja"]
[3594,"Franzen","N","PLZ-Adressierung","extern","Ja","Nein"]
[3595,"Brunn an der Wild","N","PLZ-Adressierung","extern","Ja","Nein"]
[3601,"Dürnstein","N","PLZ-Adressierung","extern","Ja","Nein"]
[3602,"Rossatz","N","PLZ-Adressierung","extern","Ja","Nein"]
[3610,"Weißenkirchen in der Wachau","N","PLZ-Adressierung","extern","Ja","Ja"]
[3611,"Großheinrichschlag","N","PLZ-Adressierung","extern","Ja","Ja"]
[3613,"Albrechtsberg an der Großen Krems","N","PLZ-Adressierung","extern","Ja","Nein"]
[3620,"Spitz","N","PLZ-Adressierung","extern","Ja","Ja"]
[3621,"Mitterarnsdorf","N","PLZ-Adressierung","extern","Ja","Nein"]
[3622,"Mühldorf","N","PLZ-Adressierung","extern","Ja","Ja"]
[3623,"Kottes","N","PLZ-Adressierung","extern","Ja","Nein"]
[3631,"Ottenschlag","N","PLZ-Adressierung","extern","Ja","Ja"]
[3632,"Traunstein","N","PLZ-Adressierung","extern","Ja","Ja"]
[3633,"Schönbach","N","PLZ-Adressierung","extern","Ja","Nein"]
[3641,"Aggsbach Markt","N","PLZ-Adressierung","extern","Ja","Nein"]
[3642,"Aggsbach Dorf","N","PLZ-Adressierung","extern","Ja","Nein"]
[3643,"Maria Laach am Jauerling","N","PLZ-Adressierung","extern","Ja","Ja"]
[3644,"Emmersdorf an der Donau","N","PLZ-Adressierung","extern","Ja","Nein"]
[3650,"Pöggstall","N","PLZ-Adressierung","extern","Ja","Ja"]
[3652,"Leiben","N","PLZ-Adressierung","extern","Ja","Nein"]
[3653,"Weiten","N","PLZ-Adressierung","extern","Ja","Ja"]
[3654,"Raxendorf","N","PLZ-Adressierung","extern","Ja","Ja"]
[3660,"Klein-Pöchlarn","N","PLZ-Adressierung","extern","Ja","Nein"]
[3661,"Artstetten","N","PLZ-Adressierung","extern","Ja","Ja"]
[3662,"Münichreith","N","PLZ-Adressierung","extern","Ja","Nein"]
[3663,"Laimbach am Ostrong","N","PLZ-Adressierung","extern","Ja","Nein"]
[3664,"Martinsberg","N","PLZ-Adressierung","extern","Ja","Ja"]
[3665,"Gutenbrunn","N","PLZ-Adressierung","extern","Ja","Nein"]
[3671,"Marbach an der Donau","N","PLZ-Adressierung","extern","Ja","Ja"]
[3672,"Maria Taferl","N","PLZ-Adressierung","extern","Ja","Ja"]
[3680,"Persenbeug","N","PLZ-Adressierung","extern","Ja","Ja"]
[3683,"Yspertal","N","PLZ-Adressierung","extern","Ja","Ja"]
[3684,"St. Oswald","N","PLZ-Adressierung","extern","Ja","Nein"]
[3691,"Nöchling","N","PLZ-Adressierung","extern","Ja","Nein"]
[3701,"Großweikersdorf","N","PLZ-Adressierung","extern","Ja","Ja"]
[3702,"Niederrußbach","N","PLZ-Adressierung","extern","Ja","Nein"]
[3704,"Glaubendorf","N","PLZ-Adressierung","extern","Ja","Nein"]
[3710,"Ziersdorf","N","PLZ-Adressierung","extern","Ja","Ja"]
[3711,"Großmeiseldorf","N","PLZ-Adressierung","extern","Ja","Nein"]
[3712,"Maissau","N","PLZ-Adressierung","extern","Ja","Ja"]
[3713,"Harmannsdorf","N","PLZ-Adressierung","extern","Ja","Nein"]
[3714,"Sitzendorf an der Schmida","N","PLZ-Adressierung","extern","Ja","Nein"]
[3720,"Ravelsbach","N","PLZ-Adressierung","extern","Ja","Nein"]
[3721,"Limberg","N","PLZ-Adressierung","extern","Ja","Nein"]
[3722,"Straning","N","PLZ-Adressierung","extern","Ja","Nein"]
[3730,"Eggenburg","N","PLZ-Adressierung","extern","Ja","Ja"]
[3741,"Pulkau","N","PLZ-Adressierung","extern","Ja","Ja"]
[3742,"Theras","N","PLZ-Adressierung","extern","Ja","Nein"]
[3743,"Röschitz","N","PLZ-Adressierung","extern","Ja","Nein"]
[3744,"Stockern","N","PLZ-Adressierung","extern","Ja","Nein"]
[3751,"Sigmundsherberg","N","PLZ-Adressierung","extern","Ja","Ja"]
[3752,"Walkenstein","N","PLZ-Adressierung","extern","Ja","Nein"]
[3753,"Hötzelsdorf","N","PLZ-Adressierung","extern","Ja","Nein"]
[3754,"Irnfritz","N","PLZ-Adressierung","extern","Ja","Nein"]
[3761,"Messern","N","PLZ-Adressierung","extern","Ja","Nein"]
[3762,"Ludweis","N","PLZ-Adressierung","extern","Ja","Nein"]
[3763,"Japons","N","PLZ-Adressierung","extern","Ja","Ja"]
[3800,"Göpfritz an der Wild","N","PLZ-Adressierung","extern","Ja","Nein"]
[3804,"Allentsteig","N","PLZ-Adressierung","extern","Ja","Ja"]
[3811,"Kirchberg an der Wild","N","PLZ-Adressierung","extern","Ja","Nein"]
[3812,"Groß Siegharts","N","PLZ-Adressierung","extern","Ja","Ja"]
[3813,"Dietmanns","N","PLZ-Adressierung","extern","Ja","Nein"]
[3814,"Aigen","N","PLZ-Adressierung","extern","Ja","Nein"]
[3820,"Raabs an der Thaya","N","PLZ-Adressierung","extern","Ja","Ja"]
[3822,"Karlstein an der Thaya","N","PLZ-Adressierung","extern","Ja","Nein"]
[3823,"Weikertschlag an der Thaya","N","PLZ-Adressierung","extern","Ja","Nein"]
[3824,"Großau","N","PLZ-Adressierung","extern","Ja","Nein"]
[3830,"Waidhofen an der Thaya","N","PLZ-Adressierung","extern","Ja","Ja"]
[3834,"Pfaffenschlag bei Waidhofen an der Thaya","N","PLZ-Adressierung","extern","Ja","Nein"]
[3841,"Windigsteig","N","PLZ-Adressierung","extern","Ja","Nein"]
[3842,"Thaya","N","PLZ-Adressierung","extern","Ja","Nein"]
[3843,"Dobersberg","N","PLZ-Adressierung","extern","Ja","Ja"]
[3844,"Waldkirchen an der Thaya","N","PLZ-Adressierung","extern","Ja","Nein"]
[3851,"Kautzen","N","PLZ-Adressierung","extern","Ja","Nein"]
[3852,"Gastern","N","PLZ-Adressierung","extern","Ja","Ja"]
[3860,"Heidenreichstein","N","PLZ-Adressierung","extern","Ja","Ja"]
[3861,"Eggern","N","PLZ-Adressierung","extern","Ja","Nein"]
[3862,"Eisgarn","N","PLZ-Adressierung","extern","Ja","Nein"]
[3863,"Reingers","N","PLZ-Adressierung","extern","Ja","Nein"]
[3871,"Nagelberg","N","PLZ-Adressierung","extern","Ja","Ja"]
[3872,"Langegg","N","PLZ-Adressierung","extern","Ja","Nein"]
[3873,"Brand","N","PLZ-Adressierung","extern","Ja","Nein"]
[3874,"Litschau","N","PLZ-Adressierung","extern","Ja","Ja"]
[3900,"Schwarzenau","N","PLZ-Adressierung","extern","Ja","Ja"]
[3902,"Vitis","N","PLZ-Adressierung","extern","Ja","Ja"]
[3903,"Echsenbach","N","PLZ-Adressierung","extern","Ja","Ja"]
[3910,"Zwettl","N","PLZ-Adressierung","extern","Ja","Ja"]
[3911,"Rappottenstein","N","PLZ-Adressierung","extern","Ja","Ja"]
[3912,"Grafenschlag","N","PLZ-Adressierung","extern","Ja","Nein"]
[3913,"Großgöttfritz","N","PLZ-Adressierung","extern","Ja","Nein"]
[3914,"Waldhausen","N","PLZ-Adressierung","extern","Ja","Nein"]
[3920,"Groß Gerungs","N","PLZ-Adressierung","extern","Ja","Ja"]
[3921,"Langschlag","N","PLZ-Adressierung","extern","Ja","Nein"]
[3922,"Großschönau","N","PLZ-Adressierung","extern","Ja","Nein"]
[3923,"Jagenbach","N","PLZ-Adressierung","extern","Ja","Nein"]
[3924,"Rosenau Schloß","N","PLZ-Adressierung","extern","Ja","Nein"]
[3925,"Arbesbach","N","PLZ-Adressierung","extern","Ja","Ja"]
[3931,"Schweiggers","N","PLZ-Adressierung","extern","Ja","Ja"]
[3932,"Kirchberg am Walde","N","PLZ-Adressierung","extern","Ja","Nein"]
[3942,"Hirschbach","N","PLZ-Adressierung","extern","Ja","Nein"]
[3943,"Schrems","N","PLZ-Adressierung","extern","Ja","Ja"]
[3944,"Pürbach","N","PLZ-Adressierung","extern","Ja","Nein"]
[3945,"Hoheneich","N","PLZ-Adressierung","extern","Ja","Nein"]
[3950,"Gmünd","N","PLZ-Adressierung","extern","Ja","Ja"]
[3961,"Waldenstein","N","PLZ-Adressierung","extern","Ja","Nein"]
[3962,"Heinrichs bei Weitra","N","PLZ-Adressierung","extern","Ja","Nein"]
[3970,"Weitra","N","PLZ-Adressierung","extern","Ja","Ja"]
[3971,"St. Martin","N","PLZ-Adressierung","extern","Ja","Nein"]
[3972,"Bad Großpertholz","N","PLZ-Adressierung","extern","Ja","Ja"]
[3973,"Karlstift","N","PLZ-Adressierung","extern","Ja","Nein"]
[4010,"Linz, Donau","O","PLZ-Postfach","extern","Nein","Ja"]
[4013,"Linz, Donau","O","PLZ-Postfach","extern","Nein","Ja"]
[4014,"Linz, Donau","O","PLZ-Postfach","extern","Nein","Ja"]
[4015,"Linz, Donau","O","PLZ-Postfach","extern","Nein","Ja"]
[4017,"Linz, Donau","O","PLZ-Postfach","extern","Nein","Ja"]
[4018,"Linz, Donau","O","PLZ-Postfach","extern","Nein","Ja"]
[4020,"Linz","O","PLZ-Adressierung","extern","Ja","Ja"]
[4021,"Linz, Donau Postfach","O","PLZ-Postfach","extern","Nein","Ja"]
[4025,"Linz, Donau","O","PLZ-Postfach","extern","Nein","Ja"]
[4026,"Linz, Donau","O","PLZ-Postfach","extern","Nein","Ja"]
[4029,"Linz, Donau","O","PLZ-Postfach","extern","Nein","Ja"]
[4030,"Linz","O","PLZ-Adressierung","extern","Ja","Ja"]
[4031,"Linz, Donau Postfach","O","PLZ-Postfach","extern","Nein","Ja"]
[4033,"Linz-Ebelsberg","O","PLZ-Postfach","extern","Nein","Ja"]
[4034,"Linz, Donau","O","PLZ-Postfach","extern","Nein","Ja"]
[4040,"Linz","O","PLZ-Adressierung","extern","Ja","Ja"]
[4041,"Linz, Donau Postfach","O","PLZ-Postfach","extern","Nein","Ja"]
[4044,"Linz, Donau","O","PLZ-Postfach","extern","Nein","Ja"]
[4046,"Linz, Donau","O","PLZ-Postfach","extern","Nein","Ja"]
[4048,"Puchenau","O","PLZ-Adressierung","extern","Ja","Ja"]
[4050,"Traun","O","PLZ-Adressierung","extern","Ja","Ja"]
[4052,"Ansfelden","O","PLZ-Adressierung","extern","Ja","Ja"]
[4053,"Haid","O","PLZ-Adressierung","extern","Ja","Ja"]
[4055,"Pucking","O","PLZ-Adressierung","extern","Ja","Nein"]
[4059,"Leonding","O","PLZ-Postfach","extern","Nein","Ja"]
[4060,"Leonding","O","PLZ-Adressierung","extern","Ja","Ja"]
[4061,"Pasching","O","PLZ-Adressierung","extern","Ja","Ja"]
[4062,"Thening","O","PLZ-Adressierung","extern","Ja","Nein"]
[4063,"Hörsching","O","PLZ-Adressierung","extern","Ja","Ja"]
[4064,"Oftering","O","PLZ-Adressierung","extern","Ja","Ja"]
[4066,"Pasching","O","PLZ-Postfach","extern","Nein","Ja"]
[4069,"Leonding","O","PLZ-Postfach","extern","Nein","Ja"]
[4070,"Eferding","O","PLZ-Adressierung","extern","Ja","Ja"]
[4072,"Alkoven","O","PLZ-Adressierung","extern","Ja","Ja"]
[4073,"Wilhering","O","PLZ-Adressierung","extern","Ja","Ja"]
[4074,"Stroheim","O","PLZ-Adressierung","extern","Ja","Nein"]
[4075,"Breitenaich","O","PLZ-Adressierung","extern","Ja","Nein"]
[4076,"St. Marienkirchen an der Polsenz","O","PLZ-Adressierung","extern","Ja","Nein"]
[4081,"Hartkirchen","O","PLZ-Adressierung","extern","Ja","Ja"]
[4082,"Aschach an der Donau","O","PLZ-Adressierung","extern","Ja","Nein"]
[4083,"Haibach ob der Donau","O","PLZ-Adressierung","extern","Ja","Ja"]
[4084,"St. Agatha","O","PLZ-Adressierung","extern","Ja","Nein"]
[4085,"Wesenufer","O","PLZ-Adressierung","extern","Ja","Ja"]
[4090,"Engelhartszell","O","PLZ-Adressierung","extern","Ja","Ja"]
[4091,"Vichtenstein","O","PLZ-Adressierung","extern","Ja","Nein"]
[4092,"Esternberg","O","PLZ-Adressierung","extern","Ja","Ja"]
[4100,"Ottensheim","O","PLZ-Adressierung","extern","Ja","Ja"]
[4101,"Feldkirchen an der Donau","O","PLZ-Adressierung","extern","Ja","Ja"]
[4111,"Walding","O","PLZ-Adressierung","extern","Ja","Ja"]
[4112,"Rottenegg","O","PLZ-Adressierung","extern","Ja","Nein"]
[4113,"St. Martin im Mühlkreis","O","PLZ-Adressierung","extern","Ja","Ja"]
[4114,"Neuhaus an der Donau","O","PLZ-Adressierung","extern","Ja","Nein"]
[4115,"Kleinzell im Mühlkreis","O","PLZ-Adressierung","extern","Ja","Nein"]
[4120,"Neufelden","O","PLZ-Adressierung","extern","Ja","Ja"]
[4121,"Altenfelden","O","PLZ-Adressierung","extern","Ja","Ja"]
[4122,"Arnreit","O","PLZ-Adressierung","extern","Ja","Nein"]
[4131,"Obermühl","O","PLZ-Adressierung","extern","Ja","Nein"]
[4132,"Lembach im Mühlkreis","O","PLZ-Adressierung","extern","Ja","Ja"]
[4133,"Niederkappel","O","PLZ-Adressierung","extern","Ja","Nein"]
[4134,"Putzleinsdorf","O","PLZ-Adressierung","extern","Ja","Nein"]
[4141,"Pfarrkirchen im Mühlkreis","O","PLZ-Adressierung","extern","Ja","Nein"]
[4142,"Hofkirchen im Mühlkreis","O","PLZ-Adressierung","extern","Ja","Ja"]
[4143,"Neustift im Mühlkreis","O","PLZ-Adressierung","extern","Ja","Ja"]
[4144,"Oberkappel","O","PLZ-Adressierung","extern","Ja","Nein"]
[4150,"Rohrbach in Oberösterreich","O","PLZ-Adressierung","extern","Ja","Ja"]
[4152,"Sarleinsbach","O","PLZ-Adressierung","extern","Ja","Nein"]
[4153,"Peilstein im Mühlviertel","O","PLZ-Adressierung","extern","Ja","Ja"]
[4154,"Kollerschlag","O","PLZ-Adressierung","extern","Ja","Nein"]
[4160,"Aigen im Mühlkreis","O","PLZ-Adressierung","extern","Ja","Ja"]
[4161,"Ulrichsberg","O","PLZ-Adressierung","extern","Ja","Ja"]
[4162,"Julbach","O","PLZ-Adressierung","extern","Ja","Nein"]
[4163,"Klaffer am Hochficht","O","PLZ-Adressierung","extern","Ja","Nein"]
[4164,"Schwarzenberg am Böhmerwald","O","PLZ-Adressierung","extern","Ja","Nein"]
[4170,"Haslach an der Mühl","O","PLZ-Adressierung","extern","Ja","Ja"]
[4171,"St. Peter am Wimberg","O","PLZ-Adressierung","extern","Ja","Ja"]
[4172,"St. Johann am Wimberg","O","PLZ-Adressierung","extern","Ja","Nein"]
[4173,"St. Veit im Mühlkreis","O","PLZ-Adressierung","extern","Ja","Nein"]
[4174,"Niederwaldkirchen","O","PLZ-Adressierung","extern","Ja","Nein"]
[4175,"Herzogsdorf","O","PLZ-Adressierung","extern","Ja","Ja"]
[4180,"Zwettl an der Rodl","O","PLZ-Adressierung","extern","Ja","Ja"]
[4181,"Oberneukirchen","O","PLZ-Adressierung","extern","Ja","Ja"]
[4182,"Waxenberg","O","PLZ-Adressierung","extern","Ja","Nein"]
[4183,"Traberg","O","PLZ-Adressierung","extern","Ja","Nein"]
[4184,"Helfenberg","O","PLZ-Adressierung","extern","Ja","Nein"]
[4190,"Bad Leonfelden","O","PLZ-Adressierung","extern","Ja","Ja"]
[4191,"Vorderweißenbach","O","PLZ-Adressierung","extern","Ja","Nein"]
[4192,"Schenkenfelden","O","PLZ-Adressierung","extern","Ja","Ja"]
[4193,"Reichenthal","O","PLZ-Adressierung","extern","Ja","Ja"]
[4201,"Gramastetten","O","PLZ-Adressierung","extern","Ja","Ja"]
[4202,"Hellmonsödt","O","PLZ-Adressierung","extern","Ja","Ja"]
[4203,"Altenberg bei Linz","O","PLZ-Adressierung","extern","Ja","Ja"]
[4204,"Reichenau im Mühlkreis","O","PLZ-Adressierung","extern","Ja","Nein"]
[4209,"Engerwitzdorf","O","PLZ-Adressierung","extern","Ja","Nein"]
[4210,"Gallneukirchen","O","PLZ-Adressierung","extern","Ja","Ja"]
[4211,"Alberndorf in der Riedmark","O","PLZ-Adressierung","extern","Ja","Ja"]
[4212,"Neumarkt im Mühlkreis","O","PLZ-Adressierung","extern","Ja","Ja"]
[4221,"Steyregg","O","PLZ-Adressierung","extern","Ja","Ja"]
[4222,"St. Georgen an der Gusen","O","PLZ-Adressierung","extern","Ja","Ja"]
[4223,"Katsdorf","O","PLZ-Adressierung","extern","Ja","Ja"]
[4224,"Wartberg ob der Aist","O","PLZ-Adressierung","extern","Ja","Ja"]
[4230,"Pregarten","O","PLZ-Adressierung","extern","Ja","Ja"]
[4231,"Untergaisbach","O","PLZ-Adressierung","extern","Ja","Nein"]
[4232,"Hagenberg im Mühlkreis","O","PLZ-Adressierung","extern","Ja","Ja"]
[4240,"Freistadt","O","PLZ-Adressierung","extern","Ja","Ja"]
[4242,"Hirschbach im Mühlkreis","O","PLZ-Adressierung","extern","Ja","Ja"]
[4251,"Sandl","O","PLZ-Adressierung","extern","Ja","Ja"]
[4252,"Liebenau","O","PLZ-Adressierung","extern","Ja","Nein"]
[4261,"Rainbach im Mühlkreis","O","PLZ-Adressierung","extern","Ja","Ja"]
[4262,"Leopoldschlag","O","PLZ-Adressierung","extern","Ja","Nein"]
[4263,"Windhaag bei Freistadt","O","PLZ-Adressierung","extern","Ja","Ja"]
[4264,"Grünbach","O","PLZ-Adressierung","extern","Ja","Nein"]
[4271,"St. Oswald bei Freistadt","O","PLZ-Adressierung","extern","Ja","Nein"]
[4272,"Weitersfelden","O","PLZ-Adressierung","extern","Ja","Nein"]
[4273,"Unterweißenbach","O","PLZ-Adressierung","extern","Ja","Ja"]
[4274,"Schönau im Mühlkreis","O","PLZ-Adressierung","extern","Ja","Nein"]
[4280,"Königswiesen","O","PLZ-Adressierung","extern","Ja","Ja"]
[4281,"Mönchdorf","O","PLZ-Adressierung","extern","Ja","Nein"]
[4282,"Pierbach","O","PLZ-Adressierung","extern","Ja","Nein"]
[4283,"Bad Zell","O","PLZ-Adressierung","extern","Ja","Ja"]
[4284,"Tragwein","O","PLZ-Adressierung","extern","Ja","Nein"]
[4291,"Lasberg","O","PLZ-Adressierung","extern","Ja","Ja"]
[4292,"Kefermarkt","O","PLZ-Adressierung","extern","Ja","Nein"]
[4293,"Gutau","O","PLZ-Adressierung","extern","Ja","Ja"]
[4294,"St. Leonhard bei Freistadt","O","PLZ-Adressierung","extern","Ja","Nein"]
[4300,"St. Valentin","N","PLZ-Adressierung","extern","Ja","Ja"]
[4303,"St. Pantaleon","N","PLZ-Adressierung","extern","Ja","Nein"]
[4310,"Mauthausen","O","PLZ-Adressierung","extern","Ja","Ja"]
[4311,"Schwertberg","O","PLZ-Adressierung","extern","Ja","Ja"]
[4312,"Ried in der Riedmark","O","PLZ-Adressierung","extern","Ja","Ja"]
[4320,"Perg","O","PLZ-Adressierung","extern","Ja","Ja"]
[4322,"Windhaag bei Perg","O","PLZ-Adressierung","extern","Ja","Nein"]
[4323,"Münzbach","O","PLZ-Adressierung","extern","Ja","Nein"]
[4324,"Rechberg","O","PLZ-Adressierung","extern","Ja","Nein"]
[4331,"Naarn","O","PLZ-Adressierung","extern","Ja","Ja"]
[4332,"Au an der Donau","O","PLZ-Adressierung","extern","Ja","Nein"]
[4341,"Arbing","O","PLZ-Adressierung","extern","Ja","Nein"]
[4342,"Baumgartenberg","O","PLZ-Adressierung","extern","Ja","Nein"]
[4343,"Mitterkirchen","O","PLZ-Adressierung","extern","Ja","Ja"]
[4351,"Saxen","O","PLZ-Adressierung","extern","Ja","Nein"]
[4352,"Klam","O","PLZ-Adressierung","extern","Ja","Nein"]
[4360,"Grein","O","PLZ-Adressierung","extern","Ja","Ja"]
[4362,"Bad Kreuzen","O","PLZ-Adressierung","extern","Ja","Ja"]
[4363,"Pabneukirchen","O","PLZ-Adressierung","extern","Ja","Ja"]
[4364,"St. Thomas","O","PLZ-Adressierung","extern","Ja","Nein"]
[4371,"Dimbach","O","PLZ-Adressierung","extern","Ja","Nein"]
[4372,"St. Georgen am Walde","O","PLZ-Adressierung","extern","Ja","Ja"]
[4381,"St. Nikola an der Donau","O","PLZ-Adressierung","extern","Ja","Nein"]
[4382,"Sarmingstein","O","PLZ-Adressierung","extern","Ja","Nein"]
[4391,"Waldhausen im Strudengau","O","PLZ-Adressierung","extern","Ja","Ja"]
[4392,"Dorfstetten","N","PLZ-Adressierung","extern","Ja","Nein"]
[4400,"Steyr","O","PLZ-Adressierung","extern","Ja","Ja"]
[4401,"Steyr Postfach","O","PLZ-Postfach","extern","Nein","Ja"]
[4402,"Steyr","O","PLZ-Postfach","extern","Nein","Ja"]
[4403,"Steyr","O","PLZ-Postfach","extern","Nein","Ja"]
[4405,"Steyr-Münichholz","O","PLZ-Postfach","extern","Nein","Ja"]
[4406,"Steyr","O","PLZ-Postfach","extern","Nein","Ja"]
[4407,"Steyr-Gleink","O","PLZ-Adressierung","extern","Ja","Ja"]
[4411,"Christkindl","O","PLZ-Postfach","extern","Nein","Ja"]
[4421,"Aschach an der Steyr","O","PLZ-Adressierung","extern","Ja","Nein"]
[4431,"Haidershofen","N","PLZ-Adressierung","extern","Ja","Ja"]
[4432,"Ernsthofen","N","PLZ-Adressierung","extern","Ja","Nein"]
[4441,"Behamberg","N","PLZ-Adressierung","extern","Ja","Nein"]
[4442,"Kleinraming","O","PLZ-Adressierung","extern","Ja","Nein"]
[4443,"Maria Neustift","O","PLZ-Adressierung","extern","Ja","Ja"]
[4451,"Garsten","O","PLZ-Adressierung","extern","Ja","Ja"]
[4452,"Ternberg","O","PLZ-Adressierung","extern","Ja","Ja"]
[4453,"Trattenbach","O","PLZ-Adressierung","extern","Ja","Nein"]
[4460,"Losenstein","O","PLZ-Adressierung","extern","Ja","Nein"]
[4461,"Laussa","O","PLZ-Adressierung","extern","Ja","Nein"]
[4462,"Reichraming","O","PLZ-Adressierung","extern","Ja","Nein"]
[4463,"Großraming","O","PLZ-Adressierung","extern","Ja","Ja"]
[4464,"Kleinreifling","O","PLZ-Adressierung","extern","Ja","Nein"]
[4470,"Enns","O","PLZ-Adressierung","extern","Ja","Ja"]
[4481,"Asten","O","PLZ-Adressierung","extern","Ja","Ja"]
[4482,"Ennsdorf","N","PLZ-Adressierung","extern","Ja","Nein"]
[4483,"Hargelsberg","O","PLZ-Adressierung","extern","Ja","Nein"]
[4484,"Kronstorf","O","PLZ-Adressierung","extern","Ja","Ja"]
[4490,"St. Florian","O","PLZ-Adressierung","extern","Ja","Ja"]
[4491,"Niederneukirchen","O","PLZ-Adressierung","extern","Ja","Ja"]
[4492,"Hofkirchen im Traunkreis","O","PLZ-Adressierung","extern","Ja","Nein"]
[4493,"Wolfern","O","PLZ-Adressierung","extern","Ja","Nein"]
[4501,"Neuhofen an der Krems","O","PLZ-Adressierung","extern","Ja","Ja"]
[4502,"St. Marien","O","PLZ-Adressierung","extern","Ja","Ja"]
[4511,"Allhaming","O","PLZ-Adressierung","extern","Ja","Nein"]
[4521,"Schiedlberg","O","PLZ-Adressierung","extern","Ja","Nein"]
[4522,"Sierning","O","PLZ-Adressierung","extern","Ja","Ja"]
[4523,"Neuzeug","O","PLZ-Adressierung","extern","Ja","Nein"]
[4531,"Kematen an der Krems","O","PLZ-Adressierung","extern","Ja","Ja"]
[4532,"Rohr im Kremstal","O","PLZ-Adressierung","extern","Ja","Nein"]
[4533,"Piberbach","O","PLZ-Adressierung","extern","Ja","Nein"]
[4540,"Bad Hall","O","PLZ-Adressierung","extern","Ja","Ja"]
[4541,"Adlwang","O","PLZ-Adressierung","extern","Ja","Nein"]
[4542,"Nußbach","O","PLZ-Adressierung","extern","Ja","Nein"]
[4550,"Kremsmünster","O","PLZ-Adressierung","extern","Ja","Ja"]
[4551,"Ried im Traunkreis","O","PLZ-Adressierung","extern","Ja","Nein"]
[4552,"Wartberg an der Krems","O","PLZ-Adressierung","extern","Ja","Ja"]
[4553,"Schlierbach","O","PLZ-Adressierung","extern","Ja","Nein"]
[4560,"Kirchdorf an der Krems","O","PLZ-Adressierung","extern","Ja","Ja"]
[4562,"Steinbach am Ziehberg","O","PLZ-Adressierung","extern","Ja","Nein"]
[4563,"Micheldorf","O","PLZ-Adressierung","extern","Ja","Ja"]
[4564,"Klaus an der Pyhrnbahn","O","PLZ-Adressierung","extern","Ja","Nein"]
[4571,"Steyrling","O","PLZ-Adressierung","extern","Ja","Nein"]
[4572,"St. Pankraz","O","PLZ-Adressierung","extern","Ja","Nein"]
[4573,"Hinterstoder","O","PLZ-Adressierung","extern","Ja","Ja"]
[4574,"Vorderstoder","O","PLZ-Adressierung","extern","Ja","Nein"]
[4575,"Roßleithen","O","PLZ-Adressierung","extern","Ja","Nein"]
[4580,"Windischgarsten","O","PLZ-Adressierung","extern","Ja","Ja"]
[4581,"Rosenau am Hengstpaß","O","PLZ-Adressierung","extern","Ja","Nein"]
[4582,"Spital am Pyhrn","O","PLZ-Adressierung","extern","Ja","Ja"]
[4591,"Molln","O","PLZ-Adressierung","extern","Ja","Ja"]
[4592,"Leonstein","O","PLZ-Adressierung","extern","Ja","Nein"]
[4593,"Obergrünburg","O","PLZ-Adressierung","extern","Ja","Nein"]
[4594,"Grünburg","O","PLZ-Adressierung","extern","Ja","Ja"]
[4595,"Waldneukirchen","O","PLZ-Adressierung","extern","Ja","Nein"]
[4600,"Wels","O","PLZ-Adressierung","extern","Ja","Ja"]
[4601,"Wels","O","PLZ-Postfach","extern","Nein","Ja"]
[4602,"Wels Postfach","O","PLZ-Postfach","extern","Nein","Ja"]
[4603,"Wels","O","PLZ-Postfach","extern","Nein","Ja"]
[4604,"Wels","O","PLZ-Postfach","extern","Nein","Ja"]
[4605,"Wels","O","PLZ-Postfach","extern","Nein","Ja"]
[4606,"Wels","O","PLZ-Postfach","extern","Nein","Ja"]
[4607,"Wels","O","PLZ-Postfach","extern","Nein","Ja"]
[4609,"Thalheim bei Wels","O","PLZ-Postfach","extern","Nein","Ja"]
[4611,"Buchkirchen","O","PLZ-Adressierung","extern","Ja","Nein"]
[4612,"Scharten","O","PLZ-Adressierung","extern","Ja","Nein"]
[4613,"Mistelbach bei Wels","O","PLZ-Adressierung","extern","Ja","Nein"]
[4614,"Marchtrenk","O","PLZ-Adressierung","extern","Ja","Ja"]
[4615,"Holzhausen","O","PLZ-Adressierung","extern","Ja","Nein"]
[4616,"Weißkirchen","O","PLZ-Adressierung","extern","Ja","Nein"]
[4621,"Sipbachzell","O","PLZ-Adressierung","extern","Ja","Nein"]
[4622,"Eggendorf im Traunkreis","O","PLZ-Adressierung","extern","Ja","Nein"]
[4623,"Gunskirchen","O","PLZ-Adressierung","extern","Ja","Ja"]
[4624,"Pennewang","O","PLZ-Adressierung","extern","Ja","Nein"]
[4625,"Offenhausen","O","PLZ-Adressierung","extern","Ja","Nein"]
[4631,"Krenglbach","O","PLZ-Adressierung","extern","Ja","Nein"]
[4632,"Pichl bei Wels","O","PLZ-Adressierung","extern","Ja","Ja"]
[4633,"Kematen am Innbach","O","PLZ-Adressierung","extern","Ja","Nein"]
[4641,"Steinhaus","O","PLZ-Adressierung","extern","Ja","Nein"]
[4642,"Sattledt","O","PLZ-Adressierung","extern","Ja","Ja"]
[4643,"Pettenbach","O","PLZ-Adressierung","extern","Ja","Ja"]
[4644,"Scharnstein","O","PLZ-Adressierung","extern","Ja","Ja"]
[4645,"Grünau im Almtal","O","PLZ-Adressierung","extern","Ja","Nein"]
[4650,"Lambach","O","PLZ-Adressierung","extern","Ja","Ja"]
[4651,"Stadl-Paura","O","PLZ-Adressierung","extern","Ja","Ja"]
[4652,"Steinerkirchen an der Traun","O","PLZ-Adressierung","extern","Ja","Ja"]
[4653,"Eberstalzell","O","PLZ-Adressierung","extern","Ja","Nein"]
[4654,"Bad Wimsbach-Neydharting","O","PLZ-Adressierung","extern","Ja","Nein"]
[4655,"Vorchdorf","O","PLZ-Adressierung","extern","Ja","Ja"]
[4656,"Kirchham","O","PLZ-Adressierung","extern","Ja","Ja"]
[4661,"Roitham","O","PLZ-Adressierung","extern","Ja","Ja"]
[4662,"Steyrermühl","O","PLZ-Adressierung","extern","Ja","Nein"]
[4663,"Laakirchen","O","PLZ-Adressierung","extern","Ja","Ja"]
[4664,"Oberweis","O","PLZ-Adressierung","extern","Ja","Ja"]
[4671,"Neukirchen bei Lambach","O","PLZ-Adressierung","extern","Ja","Nein"]
[4672,"Bachmanning","O","PLZ-Adressierung","extern","Ja","Nein"]
[4673,"Gaspoltshofen","O","PLZ-Adressierung","extern","Ja","Ja"]
[4674,"Altenhof am Hausruck","O","PLZ-Adressierung","extern","Ja","Nein"]
[4675,"Weibern","O","PLZ-Adressierung","extern","Ja","Ja"]
[4676,"Aistersheim","O","PLZ-Adressierung","extern","Ja","Nein"]
[4680,"Haag am Hausruck","O","PLZ-Adressierung","extern","Ja","Ja"]
[4681,"Rottenbach","O","PLZ-Adressierung","extern","Ja","Nein"]
[4682,"Geboltskirchen","O","PLZ-Adressierung","extern","Ja","Nein"]
[4690,"Schwanenstadt","O","PLZ-Adressierung","extern","Ja","Ja"]
[4691,"Breitenschützing","O","PLZ-Adressierung","extern","Ja","Nein"]
[4692,"Niederthalheim","O","PLZ-Adressierung","extern","Ja","Nein"]
[4693,"Desselbrunn","O","PLZ-Adressierung","extern","Ja","Nein"]
[4694,"Ohlsdorf","O","PLZ-Adressierung","extern","Ja","Ja"]
[4701,"Bad Schallerbach","O","PLZ-Adressierung","extern","Ja","Ja"]
[4702,"Wallern an der Trattnach","O","PLZ-Adressierung","extern","Ja","Nein"]
[4707,"Schlüßlberg","O","PLZ-Adressierung","extern","Ja","Nein"]
[4710,"Grieskirchen","O","PLZ-Adressierung","extern","Ja","Ja"]
[4712,"Michaelnbach","O","PLZ-Adressierung","extern","Ja","Nein"]
[4713,"Gallspach","O","PLZ-Adressierung","extern","Ja","Ja"]
[4714,"Meggenhofen","O","PLZ-Adressierung","extern","Ja","Nein"]
[4715,"Taufkirchen an der Trattnach","O","PLZ-Adressierung","extern","Ja","Nein"]
[4716,"Hofkirchen an der Trattnach","O","PLZ-Adressierung","extern","Ja","Nein"]
[4720,"Neumarkt im Hausruckkreis","O","PLZ-Adressierung","extern","Ja","Ja"]
[4721,"Altschwendt","O","PLZ-Adressierung","extern","Ja","Nein"]
[4722,"Peuerbach","O","PLZ-Adressierung","extern","Ja","Ja"]
[4723,"Natternbach","O","PLZ-Adressierung","extern","Ja","Nein"]
[4724,"Neukirchen am Walde","O","PLZ-Adressierung","extern","Ja","Ja"]
[4725,"St. Aegidi","O","PLZ-Adressierung","extern","Ja","Nein"]
[4730,"Waizenkirchen","O","PLZ-Adressierung","extern","Ja","Ja"]
[4731,"Prambachkirchen","O","PLZ-Adressierung","extern","Ja","Ja"]
[4732,"St. Thomas","O","PLZ-Adressierung","extern","Ja","Nein"]
[4733,"Heiligenberg","O","PLZ-Adressierung","extern","Ja","Nein"]
[4741,"Wendling","O","PLZ-Adressierung","extern","Ja","Nein"]
[4742,"Pram","O","PLZ-Adressierung","extern","Ja","Nein"]
[4743,"Peterskirchen","O","PLZ-Adressierung","extern","Ja","Nein"]
[4751,"Dorf","O","PLZ-Adressierung","extern","Ja","Nein"]
[4752,"Riedau","O","PLZ-Adressierung","extern","Ja","Ja"]
[4753,"Taiskirchen im Innkreis","O","PLZ-Adressierung","extern","Ja","Ja"]
[4754,"Andrichsfurt","O","PLZ-Adressierung","extern","Ja","Nein"]
[4755,"Zell an der Pram","O","PLZ-Adressierung","extern","Ja","Nein"]
[4760,"Raab","O","PLZ-Adressierung","extern","Ja","Ja"]
[4761,"Enzenkirchen","O","PLZ-Adressierung","extern","Ja","Nein"]
[4762,"St. Willibald","O","PLZ-Adressierung","extern","Ja","Nein"]
[4770,"Andorf","O","PLZ-Adressierung","extern","Ja","Ja"]
[4771,"Sigharting","O","PLZ-Adressierung","extern","Ja","Nein"]
[4772,"Lambrechten","O","PLZ-Adressierung","extern","Ja","Nein"]
[4773,"Eggerding","O","PLZ-Adressierung","extern","Ja","Nein"]
[4774,"St. Marienkirchen bei Schärding","O","PLZ-Adressierung","extern","Ja","Nein"]
[4775,"Taufkirchen an der Pram","O","PLZ-Adressierung","extern","Ja","Ja"]
[4776,"Diersbach","O","PLZ-Adressierung","extern","Ja","Nein"]
[4777,"Mayrhof","O","PLZ-Adressierung","extern","Ja","Nein"]
[4780,"Schärding","O","PLZ-Adressierung","extern","Ja","Ja"]
[4782,"St. Florian am Inn","O","PLZ-Adressierung","extern","Ja","Nein"]
[4783,"Wernstein am Inn","O","PLZ-Adressierung","extern","Ja","Nein"]
[4784,"Schardenberg","O","PLZ-Adressierung","extern","Ja","Ja"]
[4785,"Freinberg","O","PLZ-Adressierung","extern","Ja","Nein"]
[4786,"Brunnenthal","O","PLZ-Adressierung","extern","Ja","Nein"]
[4791,"Rainbach im Innkreis","O","PLZ-Adressierung","extern","Ja","Ja"]
[4792,"Münzkirchen","O","PLZ-Adressierung","extern","Ja","Ja"]
[4793,"St. Roman","O","PLZ-Adressierung","extern","Ja","Nein"]
[4794,"Kopfing im Innkreis","O","PLZ-Adressierung","extern","Ja","Nein"]
[4800,"Attnang-Puchheim","O","PLZ-Adressierung","extern","Ja","Ja"]
[4801,"Traunkirchen","O","PLZ-Adressierung","extern","Ja","Nein"]
[4802,"Ebensee","O","PLZ-Adressierung","extern","Ja","Ja"]
[4810,"Gmunden","O","PLZ-Adressierung","extern","Ja","Ja"]
[4812,"Pinsdorf","O","PLZ-Adressierung","extern","Ja","Ja"]
[4813,"Altmünster","O","PLZ-Adressierung","extern","Ja","Ja"]
[4814,"Neukirchen","O","PLZ-Adressierung","extern","Ja","Ja"]
[4815,"Ort bei Gmunden","O","PLZ-Postfach","extern","Nein","Ja"]
[4816,"Gschwandt","O","PLZ-Adressierung","extern","Ja","Ja"]
[4817,"St. Konrad","O","PLZ-Adressierung","extern","Ja","Nein"]
[4819,"Gmunden","O","PLZ-Postfach","extern","Nein","Ja"]
[4820,"Bad Ischl","O","PLZ-Adressierung","extern","Ja","Ja"]
[4821,"Lauffen","O","PLZ-Adressierung","extern","Ja","Nein"]
[4822,"Bad Goisern","O","PLZ-Adressierung","extern","Ja","Ja"]
[4823,"Steeg","O","PLZ-Adressierung","extern","Ja","Nein"]
[4824,"Gosau","O","PLZ-Adressierung","extern","Ja","Ja"]
[4825,"Gosau-Hintertal","O","PLZ-Adressierung","extern","Ja","Nein"]
[4829,"Bad Ischl","O","PLZ-Postfach","extern","Nein","Ja"]
[4830,"Hallstatt","O","PLZ-Adressierung","extern","Ja","Nein"]
[4831,"Obertraun","O","PLZ-Adressierung","extern","Ja","Nein"]
[4840,"Vöcklabruck","O","PLZ-Adressierung","extern","Ja","Ja"]
[4841,"Ungenach","O","PLZ-Adressierung","extern","Ja","Nein"]
[4842,"Zell am Pettenfirst","O","PLZ-Adressierung","extern","Ja","Nein"]
[4843,"Ampflwang","O","PLZ-Adressierung","extern","Ja","Ja"]
[4844,"Regau","O","PLZ-Adressierung","extern","Ja","Ja"]
[4845,"Rutzenmoos","O","PLZ-Adressierung","extern","Ja","Nein"]
[4850,"Timelkam","O","PLZ-Adressierung","extern","Ja","Ja"]
[4851,"Gampern","O","PLZ-Adressierung","extern","Ja","Nein"]
[4852,"Weyregg am Attersee","O","PLZ-Adressierung","extern","Ja","Nein"]
[4853,"Steinbach am Attersee","O","PLZ-Adressierung","extern","Ja","Ja"]
[4854,"Weißenbach","O","PLZ-Adressierung","extern","Ja","Nein"]
[4860,"Lenzing","O","PLZ-Adressierung","extern","Ja","Ja"]
[4861,"Schörfling","O","PLZ-Adressierung","extern","Ja","Ja"]
[4863,"Seewalchen am Attersee","O","PLZ-Adressierung","extern","Ja","Ja"]
[4864,"Attersee","O","PLZ-Adressierung","extern","Ja","Nein"]
[4865,"Nußdorf am Attersee","O","PLZ-Adressierung","extern","Ja","Ja"]
[4866,"Unterach","O","PLZ-Adressierung","extern","Ja","Ja"]
[4870,"Vöcklamarkt","O","PLZ-Adressierung","extern","Ja","Ja"]
[4871,"Zipf","O","PLZ-Adressierung","extern","Ja","Ja"]
[4872,"Neukirchen an der Vöckla","O","PLZ-Adressierung","extern","Ja","Nein"]
[4873,"Frankenburg am Hausruck","O","PLZ-Adressierung","extern","Ja","Ja"]
[4874,"Pramet","O","PLZ-Historisch","intern","Nein","Nein"]
[4880,"St. Georgen im Attergau","O","PLZ-Adressierung","extern","Ja","Ja"]
[4881,"Straß im Attergau","O","PLZ-Adressierung","extern","Ja","Nein"]
[4882,"Oberwang","O","PLZ-Adressierung","extern","Ja","Nein"]
[4890,"Frankenmarkt","O","PLZ-Adressierung","extern","Ja","Ja"]
[4891,"Pöndorf","O","PLZ-Adressierung","extern","Ja","Nein"]
[4892,"Fornach","O","PLZ-Adressierung","extern","Ja","Nein"]
[4893,"Zell am Moos","O","PLZ-Adressierung","extern","Ja","Ja"]
[4894,"Oberhofen am Irrsee","O","PLZ-Adressierung","extern","Ja","Ja"]
[4901,"Ottnang","O","PLZ-Adressierung","extern","Ja","Ja"]
[4902,"Wolfsegg am Hausruck","O","PLZ-Adressierung","extern","Ja","Nein"]
[4904,"Atzbach","O","PLZ-Adressierung","extern","Ja","Nein"]
[4905,"Thomasroith","O","PLZ-Adressierung","extern","Ja","Nein"]
[4906,"Eberschwang","O","PLZ-Adressierung","extern","Ja","Ja"]
[4910,"Ried im Innkreis","O","PLZ-Adressierung","extern","Ja","Ja"]
[4912,"Neuhofen im Innkreis","O","PLZ-Adressierung","extern","Ja","Nein"]
[4920,"Schildorn","O","PLZ-Adressierung","extern","Ja","Nein"]
[4921,"Hohenzell","O","PLZ-Adressierung","extern","Ja","Nein"]
[4922,"Geiersberg","O","PLZ-Adressierung","extern","Ja","Nein"]
[4923,"Lohnsburg","O","PLZ-Adressierung","extern","Ja","Ja"]
[4924,"Waldzell","O","PLZ-Adressierung","extern","Ja","Ja"]
[4925,"Pramet","O","PLZ-Adressierung","extern","Ja","Nein"]
[4926,"St. Marienkirchen am Hausruck","O","PLZ-Adressierung","extern","Ja","Nein"]
[4931,"Mettmach","O","PLZ-Adressierung","extern","Ja","Ja"]
[4932,"Kirchheim im Innkreis","O","PLZ-Adressierung","extern","Ja","Nein"]
[4933,"Wildenau","O","PLZ-Adressierung","extern","Ja","Nein"]
[4941,"Mehrnbach","O","PLZ-Adressierung","extern","Ja","Nein"]
[4942,"Gurten","O","PLZ-Adressierung","extern","Ja","Nein"]
[4943,"Geinberg","O","PLZ-Adressierung","extern","Ja","Ja"]
[4950,"Altheim","O","PLZ-Adressierung","extern","Ja","Ja"]
[4951,"Polling im Innkreis","O","PLZ-Adressierung","extern","Ja","Nein"]
[4952,"Weng im Innkreis","O","PLZ-Adressierung","extern","Ja","Nein"]
[4961,"Mühlheim am Inn","O","PLZ-Adressierung","extern","Ja","Nein"]
[4962,"Mining","O","PLZ-Adressierung","extern","Ja","Nein"]
[4963,"St. Peter am Hart","O","PLZ-Adressierung","extern","Ja","Nein"]
[4970,"Eitzing","O","PLZ-Adressierung","extern","Ja","Nein"]
[4971,"Aurolzmünster","O","PLZ-Adressierung","extern","Ja","Ja"]
[4972,"Utzenaich","O","PLZ-Adressierung","extern","Ja","Nein"]
[4973,"St. Martin","O","PLZ-Adressierung","extern","Ja","Ja"]
[4974,"Ort im Innkreis","O","PLZ-Adressierung","extern","Ja","Nein"]
[4975,"Suben","O","PLZ-Adressierung","extern","Ja","Nein"]
[4980,"Antiesenhofen","O","PLZ-Adressierung","extern","Ja","Nein"]
[4981,"Reichersberg","O","PLZ-Adressierung","extern","Ja","Nein"]
[4982,"Obernberg am Inn","O","PLZ-Adressierung","extern","Ja","Ja"]
[4983,"St. Georgen bei Obernberg am Inn","O","PLZ-Adressierung","extern","Ja","Nein"]
[4984,"Weilbach","O","PLZ-Adressierung","extern","Ja","Nein"]
[5010,"Salzburg","Sa","PLZ-Postfach","extern","Nein","Ja"]
[5012,"Salzburg","Sa","PLZ-Postfach","extern","Nein","Ja"]
[5013,"Salzburg-Liefering","Sa","PLZ-Postfach","extern","Nein","Ja"]
[5014,"Salzburg","Sa","PLZ-Postfach","extern","Nein","Ja"]
[5015,"Salzburg","Sa","PLZ-Postfach","extern","Nein","Ja"]
[5016,"Salzburg","Sa","PLZ-Postfach","extern","Nein","Ja"]
[5017,"Salzburg","Sa","PLZ-Postfach","extern","Nein","Ja"]
[5018,"Salzburg-Europark","Sa","PLZ-Postfach","extern","Nein","Ja"]
[5020,"Salzburg","Sa","PLZ-Adressierung","extern","Ja","Ja"]
[5021,"Salzburg Postfach","Sa","PLZ-Postfach","extern","Nein","Ja"]
[5022,"Salzburg","Sa","PLZ-Postfach","extern","Nein","Ja"]
[5023,"Salzburg-Gnigl","Sa","PLZ-Adressierung","extern","Ja","Ja"]
[5024,"Salzburg","Sa","PLZ-Postfach","extern","Nein","Ja"]
[5025,"Salzburg-Parsch","Sa","PLZ-Postfach","extern","Nein","Ja"]
[5026,"Salzburg-Aigen","Sa","PLZ-Adressierung","extern","Ja","Ja"]
[5027,"Salzburg","Sa","PLZ-Postfach","extern","Nein","Ja"]
[5028,"Salzburg-Kasern","Sa","PLZ-Postfach","extern","Nein","Ja"]
[5029,"Salzburg","Sa","PLZ-Postfach","extern","Nein","Ja"]
[5033,"Salzburg","Sa","PLZ-Postfach","extern","Nein","Ja"]
[5034,"Salzburg-Morzg","Sa","PLZ-Postfach","extern","Nein","Ja"]
[5061,"Elsbethen-Glasenbach","Sa","PLZ-Adressierung","extern","Ja","Ja"]
[5071,"Wals","Sa","PLZ-Adressierung","extern","Ja","Ja"]
[5072,"Siezenheim","Sa","PLZ-Postfach","extern","Nein","Ja"]
[5073,"Wals-Himmelreich","Sa","PLZ-Postfach","extern","Nein","Ja"]
[5081,"Anif","Sa","PLZ-Adressierung","extern","Ja","Ja"]
[5082,"Grödig","Sa","PLZ-Adressierung","extern","Ja","Ja"]
[5083,"Gartenau-St. Leonhard","Sa","PLZ-Adressierung","extern","Ja","Ja"]
[5084,"Großgmain","Sa","PLZ-Adressierung","extern","Ja","Ja"]
[5089,"Niederalm","Sa","PLZ-Postfach","extern","Nein","Ja"]
[5090,"Lofer","Sa","PLZ-Adressierung","extern","Ja","Ja"]
[5091,"Unken","Sa","PLZ-Adressierung","extern","Ja","Ja"]
[5092,"St. Martin bei Lofer","Sa","PLZ-Adressierung","extern","Ja","Nein"]
[5093,"Weißbach bei Lofer","Sa","PLZ-Adressierung","extern","Ja","Nein"]
[5101,"Bergheim","Sa","PLZ-Adressierung","extern","Ja","Ja"]
[5102,"Anthering","Sa","PLZ-Adressierung","extern","Ja","Ja"]
[5110,"Oberndorf bei Salzburg","Sa","PLZ-Adressierung","extern","Ja","Ja"]
[5111,"Bürmoos","Sa","PLZ-Adressierung","extern","Ja","Ja"]
[5112,"Lamprechtshausen","Sa","PLZ-Adressierung","extern","Ja","Ja"]
[5113,"St. Georgen bei Salzburg","Sa","PLZ-Adressierung","extern","Ja","Nein"]
[5114,"Göming","Sa","PLZ-Adressierung","extern","Ja","Nein"]
[5120,"St. Pantaleon","O","PLZ-Adressierung","extern","Ja","Nein"]
[5121,"Ostermiething","O","PLZ-Adressierung","extern","Ja","Ja"]
[5122,"Ach","O","PLZ-Adressierung","extern","Ja","Ja"]
[5131,"Franking","O","PLZ-Adressierung","extern","Ja","Nein"]
[5132,"Geretsberg","O","PLZ-Adressierung","extern","Ja","Nein"]
[5133,"Gilgenberg am Weilhart","O","PLZ-Adressierung","extern","Ja","Nein"]
[5134,"Schwand im Innkreis","O","PLZ-Adressierung","extern","Ja","Nein"]
[5141,"Moosdorf","O","PLZ-Adressierung","extern","Ja","Nein"]
[5142,"Eggelsberg","O","PLZ-Adressierung","extern","Ja","Ja"]
[5143,"Feldkirchen bei Mattighofen","O","PLZ-Adressierung","extern","Ja","Nein"]
[5144,"Handenberg","O","PLZ-Adressierung","extern","Ja","Nein"]
[5145,"Neukirchen an der Enknach","O","PLZ-Adressierung","extern","Ja","Ja"]
[5151,"Nußdorf am Haunsberg","Sa","PLZ-Adressierung","extern","Ja","Nein"]
[5152,"Michaelbeuern","Sa","PLZ-Adressierung","extern","Ja","Nein"]
[5161,"Elixhausen","Sa","PLZ-Adressierung","extern","Ja","Ja"]
[5162,"Obertrum am See","Sa","PLZ-Adressierung","extern","Ja","Ja"]
[5163,"Mattsee","Sa","PLZ-Adressierung","extern","Ja","Ja"]
[5164,"Seeham","Sa","PLZ-Adressierung","extern","Ja","Nein"]
[5165,"Berndorf bei Salzburg","Sa","PLZ-Adressierung","extern","Ja","Ja"]
[5201,"Seekirchen","Sa","PLZ-Adressierung","extern","Ja","Ja"]
[5202,"Neumarkt am Wallersee","Sa","PLZ-Adressierung","extern","Ja","Ja"]
[5203,"Köstendorf","Sa","PLZ-Adressierung","extern","Ja","Nein"]
[5204,"Straßwalchen","Sa","PLZ-Adressierung","extern","Ja","Ja"]
[5205,"Schleedorf","Sa","PLZ-Adressierung","extern","Ja","Nein"]
[5211,"Friedburg","O","PLZ-Adressierung","extern","Ja","Ja"]
[5212,"Schneegattern","O","PLZ-Adressierung","extern","Ja","Nein"]
[5221,"Lochen","O","PLZ-Adressierung","extern","Ja","Ja"]
[5222,"Munderfing","O","PLZ-Adressierung","extern","Ja","Ja"]
[5223,"Pfaffstätt","O","PLZ-Adressierung","extern","Ja","Nein"]
[5224,"Auerbach","O","PLZ-Adressierung","extern","Ja","Nein"]
[5225,"Jeging","O","PLZ-Adressierung","extern","Ja","Nein"]
[5230,"Mattighofen","O","PLZ-Adressierung","extern","Ja","Ja"]
[5231,"Schalchen","O","PLZ-Adressierung","extern","Ja","Nein"]
[5232,"Kirchberg bei Mattighofen","O","PLZ-Adressierung","extern","Ja","Nein"]
[5233,"Pischelsdorf am Engelbach","O","PLZ-Adressierung","extern","Ja","Nein"]
[5241,"Maria Schmolln","O","PLZ-Adressierung","extern","Ja","Nein"]
[5242,"St. Johann am Walde","O","PLZ-Adressierung","extern","Ja","Nein"]
[5251,"Höhnhart","O","PLZ-Adressierung","extern","Ja","Ja"]
[5252,"Aspach","O","PLZ-Adressierung","extern","Ja","Ja"]
[5261,"Uttendorf","O","PLZ-Adressierung","extern","Ja","Ja"]
[5270,"Mauerkirchen","O","PLZ-Adressierung","extern","Ja","Ja"]
[5271,"Moosbach","O","PLZ-Adressierung","extern","Ja","Nein"]
[5272,"Treubach","O","PLZ-Adressierung","extern","Ja","Nein"]
[5273,"Roßbach","O","PLZ-Adressierung","extern","Ja","Nein"]
[5274,"Burgkirchen","O","PLZ-Adressierung","extern","Ja","Nein"]
[5280,"Braunau am Inn","O","PLZ-Adressierung","extern","Ja","Ja"]
[5282,"Braunau","O","PLZ-Adressierung","extern","Ja","Ja"]
[5300,"Hallwang","Sa","PLZ-Adressierung","extern","Ja","Ja"]
[5301,"Eugendorf","Sa","PLZ-Adressierung","extern","Ja","Ja"]
[5302,"Henndorf am Wallersee","Sa","PLZ-Adressierung","extern","Ja","Ja"]
[5303,"Thalgau","Sa","PLZ-Adressierung","extern","Ja","Ja"]
[5310,"Mondsee","O","PLZ-Adressierung","extern","Ja","Ja"]
[5311,"Loibichl","O","PLZ-Adressierung","extern","Ja","Nein"]
[5321,"Koppl","Sa","PLZ-Adressierung","extern","Ja","Nein"]
[5322,"Hof bei Salzburg","Sa","PLZ-Adressierung","extern","Ja","Ja"]
[5323,"Ebenau","Sa","PLZ-Adressierung","extern","Ja","Nein"]
[5324,"Faistenau","Sa","PLZ-Adressierung","extern","Ja","Ja"]
[5325,"Plainfeld","Sa","PLZ-Adressierung","extern","Ja","Nein"]
[5330,"Fuschl am See","Sa","PLZ-Adressierung","extern","Ja","Ja"]
[5340,"St. Gilgen","Sa","PLZ-Adressierung","extern","Ja","Ja"]
[5342,"Abersee","Sa","PLZ-Adressierung","extern","Ja","Nein"]
[5350,"Strobl","Sa","PLZ-Adressierung","extern","Ja","Ja"]
[5351,"Aigen-Voglhub","Sa","PLZ-Adressierung","extern","Ja","Nein"]
[5360,"St. Wolfgang im Salzkammergut","O","PLZ-Adressierung","extern","Ja","Ja"]
[5400,"Hallein","Sa","PLZ-Adressierung","extern","Ja","Ja"]
[5409,"Hallein","Sa","PLZ-Postfach","extern","Nein","Ja"]
[5411,"Oberalm","Sa","PLZ-Adressierung","extern","Ja","Ja"]
[5412,"Puch bei Hallein","Sa","PLZ-Adressierung","extern","Ja","Ja"]
[5421,"Adnet","Sa","PLZ-Adressierung","extern","Ja","Ja"]
[5422,"Heilbad Dürrnberg","Sa","PLZ-Adressierung","extern","Ja","Nein"]
[5423,"St. Koloman","Sa","PLZ-Adressierung","extern","Ja","Nein"]
[5424,"Bad Vigaun","Sa","PLZ-Adressierung","extern","Ja","Nein"]
[5431,"Kuchl","Sa","PLZ-Adressierung","extern","Ja","Ja"]
[5440,"Golling an der Salzach","Sa","PLZ-Adressierung","extern","Ja","Ja"]
[5441,"Abtenau","Sa","PLZ-Adressierung","extern","Ja","Ja"]
[5442,"Rußbach am Paß Gschütt","Sa","PLZ-Adressierung","extern","Ja","Nein"]
[5450,"Werfen","Sa","PLZ-Adressierung","extern","Ja","Ja"]
[5451,"Tenneck","Sa","PLZ-Adressierung","extern","Ja","Nein"]
[5452,"Pfarrwerfen","Sa","PLZ-Adressierung","extern","Ja","Ja"]
[5453,"Werfenweng","Sa","PLZ-Adressierung","extern","Ja","Nein"]
[5500,"Bischofshofen","Sa","PLZ-Adressierung","extern","Ja","Ja"]
[5505,"Mühlbach am Hochkönig","Sa","PLZ-Adressierung","extern","Ja","Ja"]
[5511,"Hüttau","Sa","PLZ-Adressierung","extern","Ja","Nein"]
[5521,"Niedernfritz","Sa","PLZ-Adressierung","extern","Ja","Nein"]
[5522,"St. Martin am Tennengebirge","Sa","PLZ-Adressierung","extern","Ja","Ja"]
[5523,"Lungötz","Sa","PLZ-Adressierung","extern","Ja","Nein"]
[5524,"Annaberg","Sa","PLZ-Adressierung","extern","Ja","Ja"]
[5531,"Eben im Pongau","Sa","PLZ-Adressierung","extern","Ja","Ja"]
[5532,"Filzmoos","Sa","PLZ-Adressierung","extern","Ja","Ja"]
[5541,"Altenmarkt im Pongau","Sa","PLZ-Adressierung","extern","Ja","Ja"]
[5542,"Flachau","Sa","PLZ-Adressierung","extern","Ja","Ja"]
[5550,"Radstadt","Sa","PLZ-Adressierung","extern","Ja","Ja"]
[5552,"Forstau","Sa","PLZ-Adressierung","extern","Ja","Nein"]
[5561,"Untertauern","Sa","PLZ-Adressierung","extern","Ja","Nein"]
[5562,"Obertauern","Sa","PLZ-Adressierung","extern","Ja","Ja"]
[5563,"Tweng","Sa","PLZ-Adressierung","extern","Ja","Nein"]
[5570,"Mauterndorf","Sa","PLZ-Adressierung","extern","Ja","Ja"]
[5571,"Mariapfarr","Sa","PLZ-Adressierung","extern","Ja","Ja"]
[5572,"St. Andrä im Lungau","Sa","PLZ-Adressierung","extern","Ja","Nein"]
[5573,"Weißpriach","Sa","PLZ-Adressierung","extern","Ja","Nein"]
[5580,"Tamsweg","Sa","PLZ-Adressierung","extern","Ja","Ja"]
[5581,"St. Margarethen im Lungau","Sa","PLZ-Adressierung","extern","Ja","Nein"]
[5582,"St. Michael im Lungau","Sa","PLZ-Adressierung","extern","Ja","Ja"]
[5583,"Muhr","Sa","PLZ-Adressierung","extern","Ja","Nein"]
[5584,"Zederhaus","Sa","PLZ-Adressierung","extern","Ja","Nein"]
[5585,"Unternberg","Sa","PLZ-Adressierung","extern","Ja","Nein"]
[5591,"Ramingstein","Sa","PLZ-Adressierung","extern","Ja","Nein"]
[5592,"Thomatal","Sa","PLZ-Adressierung","extern","Ja","Nein"]
[5600,"St. Johann im Pongau","Sa","PLZ-Adressierung","extern","Ja","Ja"]
[5602,"Wagrain","Sa","PLZ-Adressierung","extern","Ja","Ja"]
[5603,"Kleinarl","Sa","PLZ-Adressierung","extern","Ja","Nein"]
[5611,"Großarl","Sa","PLZ-Adressierung","extern","Ja","Ja"]
[5612,"Hüttschlag","Sa","PLZ-Adressierung","extern","Ja","Nein"]
[5620,"Schwarzach im Pongau","Sa","PLZ-Adressierung","extern","Ja","Ja"]
[5621,"St. Veit im Pongau","Sa","PLZ-Adressierung","extern","Ja","Nein"]
[5622,"Goldegg","Sa","PLZ-Adressierung","extern","Ja","Nein"]
[5623,"Schwarzach im Pongau","Sa","InteressentenPLZ","extern","Nein","Ja"]
[5630,"Bad Hofgastein","Sa","PLZ-Adressierung","extern","Ja","Ja"]
[5632,"Dorfgastein","Sa","PLZ-Adressierung","extern","Ja","Nein"]
[5640,"Bad Gastein","Sa","PLZ-Adressierung","extern","Ja","Ja"]
[5645,"Böckstein","Sa","PLZ-Adressierung","extern","Ja","Nein"]
[5651,"Lend","Sa","PLZ-Adressierung","extern","Ja","Nein"]
[5652,"Dienten am Hochkönig","Sa","PLZ-Adressierung","extern","Ja","Nein"]
[5660,"Taxenbach","Sa","PLZ-Adressierung","extern","Ja","Ja"]
[5661,"Rauris","Sa","PLZ-Adressierung","extern","Ja","Ja"]
[5662,"Gries","Sa","PLZ-Adressierung","extern","Ja","Nein"]
[5671,"Bruck an der Großglocknerstraße","Sa","PLZ-Adressierung","extern","Ja","Ja"]
[5672,"Fusch an der Glocknerstraße","Sa","PLZ-Adressierung","extern","Ja","Nein"]
[5700,"Zell am See","Sa","PLZ-Adressierung","extern","Ja","Ja"]
[5702,"Zell am See-Schüttdorf","Sa","PLZ-Postfach","extern","Nein","Ja"]
[5710,"Kaprun","Sa","PLZ-Adressierung","extern","Ja","Ja"]
[5721,"Piesendorf","Sa","PLZ-Adressierung","extern","Ja","Ja"]
[5722,"Niedernsill","Sa","PLZ-Adressierung","extern","Ja","Nein"]
[5723,"Uttendorf","Sa","PLZ-Adressierung","extern","Ja","Ja"]
[5724,"Stuhlfelden","Sa","PLZ-Adressierung","extern","Ja","Nein"]
[5730,"Mittersill","Sa","PLZ-Adressierung","extern","Ja","Ja"]
[5731,"Hollersbach im Pinzgau","Sa","PLZ-Adressierung","extern","Ja","Nein"]
[5732,"Mühlbach","Sa","PLZ-Adressierung","extern","Ja","Nein"]
[5733,"Bramberg am Wildkogel","Sa","PLZ-Adressierung","extern","Ja","Ja"]
[5741,"Neukirchen am Großvenediger","Sa","PLZ-Adressierung","extern","Ja","Ja"]
[5742,"Wald im Pinzgau","Sa","PLZ-Adressierung","extern","Ja","Ja"]
[5743,"Krimml","Sa","PLZ-Adressierung","extern","Ja","Ja"]
[5751,"Maishofen","Sa","PLZ-Adressierung","extern","Ja","Ja"]
[5752,"Viehhofen","Sa","PLZ-Adressierung","extern","Ja","Nein"]
[5753,"Saalbach","Sa","PLZ-Adressierung","extern","Ja","Ja"]
[5754,"Hinterglemm","Sa","PLZ-Adressierung","extern","Ja","Ja"]
[5760,"Saalfelden am Steinernen Meer","Sa","PLZ-Adressierung","extern","Ja","Ja"]
[5761,"Maria Alm am Steinernen Meer","Sa","PLZ-Adressierung","extern","Ja","Ja"]
[5771,"Leogang","Sa","PLZ-Adressierung","extern","Ja","Ja"]
[6010,"Innsbruck","T","PLZ-Postfach","extern","Nein","Ja"]
[6012,"Innsbruck","T","PLZ-Postfach","extern","Nein","Ja"]
[6013,"Innsbruck","T","PLZ-Postfach","extern","Nein","Ja"]
[6014,"Innsbruck","T","PLZ-Postfach","extern","Nein","Ja"]
[6020,"Innsbruck","T","PLZ-Adressierung","extern","Ja","Nein"]
[6021,"Innsbruck Postfach","T","PLZ-Postfach","extern","Nein","Ja"]
[6022,"Innsbruck","T","PLZ-Postfach","extern","Nein","Ja"]
[6023,"Innsbruck","T","PLZ-Postfach","extern","Nein","Ja"]
[6026,"Innsbruck","T","PLZ-Postfach","extern","Nein","Ja"]
[6027,"Innsbruck","T","PLZ-Postfach","extern","Nein","Ja"]
[6029,"Innsbruck","T","PLZ-Postfach","extern","Nein","Ja"]
[6033,"Innsbruck-Arzl","T","PLZ-Postfach","extern","Nein","Ja"]
[6040,"Innsbruck-Neuarzl","T","PLZ-Postfach","extern","Nein","Ja"]
[6050,"Hall in Tirol","T","PLZ-Postfach","extern","Nein","Ja"]
[6060,"Hall in Tirol","T","PLZ-Adressierung","extern","Ja","Ja"]
[6063,"Rum","T","PLZ-Adressierung","extern","Ja","Ja"]
[6064,"Rum","T","PLZ-Postfach","extern","Nein","Ja"]
[6065,"Thaur","T","PLZ-Adressierung","extern","Ja","Nein"]
[6067,"Absam","T","PLZ-Adressierung","extern","Ja","Ja"]
[6068,"Mils","T","PLZ-Adressierung","extern","Ja","Ja"]
[6069,"Gnadenwald","T","PLZ-Adressierung","extern","Ja","Nein"]
[6070,"Ampass","T","PLZ-Adressierung","extern","Ja","Nein"]
[6071,"Aldrans","T","PLZ-Adressierung","extern","Ja","Ja"]
[6072,"Lans","T","PLZ-Adressierung","extern","Ja","Nein"]
[6073,"Sistrans","T","PLZ-Adressierung","extern","Ja","Nein"]
[6074,"Rinn","T","PLZ-Adressierung","extern","Ja","Nein"]
[6075,"Tulfes","T","PLZ-Adressierung","extern","Ja","Nein"]
[6080,"Innsbruck-Igls","T","PLZ-Adressierung","extern","Ja","Ja"]
[6082,"Patsch","T","PLZ-Adressierung","extern","Ja","Nein"]
[6083,"Ellbögen","T","PLZ-Adressierung","extern","Ja","Nein"]
[6091,"Götzens","T","PLZ-Adressierung","extern","Ja","Ja"]
[6092,"Birgitz","T","PLZ-Adressierung","extern","Ja","Nein"]
[6094,"Axams","T","PLZ-Adressierung","extern","Ja","Ja"]
[6095,"Grinzens","T","PLZ-Adressierung","extern","Ja","Nein"]
[6100,"Seefeld in Tirol","T","PLZ-Adressierung","extern","Ja","Ja"]
[6103,"Reith bei Seefeld","T","PLZ-Adressierung","extern","Ja","Nein"]
[6105,"Leutasch","T","PLZ-Adressierung","extern","Ja","Nein"]
[6108,"Scharnitz","T","PLZ-Adressierung","extern","Ja","Nein"]
[6111,"Volders","T","PLZ-Adressierung","extern","Ja","Ja"]
[6112,"Wattens","T","PLZ-Adressierung","extern","Ja","Ja"]
[6113,"Wattenberg","T","PLZ-Adressierung","extern","Ja","Nein"]
[6114,"Kolsass","T","PLZ-Adressierung","extern","Ja","Ja"]
[6115,"Kolsassberg","T","PLZ-Adressierung","extern","Ja","Nein"]
[6121,"Baumkirchen","T","PLZ-Adressierung","extern","Ja","Nein"]
[6122,"Fritzens","T","PLZ-Adressierung","extern","Ja","Nein"]
[6123,"Terfens","T","PLZ-Adressierung","extern","Ja","Nein"]
[6130,"Schwaz","T","PLZ-Adressierung","extern","Ja","Ja"]
[6131,"Schwaz","T","PLZ-Postfach","extern","Nein","Ja"]
[6133,"Weerberg","T","PLZ-Adressierung","extern","Ja","Nein"]
[6134,"Vomp","T","PLZ-Adressierung","extern","Ja","Ja"]
[6135,"Stans","T","PLZ-Adressierung","extern","Ja","Ja"]
[6141,"Schönberg im Stubaital","T","PLZ-Adressierung","extern","Ja","Nein"]
[6142,"Mieders","T","PLZ-Adressierung","extern","Ja","Nein"]
[6143,"Matrei am Brenner","T","PLZ-Adressierung","extern","Ja","Ja"]
[6145,"Navis","T","PLZ-Adressierung","extern","Ja","Nein"]
[6150,"Steinach am Brenner","T","PLZ-Adressierung","extern","Ja","Ja"]
[6152,"Trins","T","PLZ-Adressierung","extern","Ja","Nein"]
[6154,"St. Jodok am Brenner","T","PLZ-Adressierung","extern","Ja","Nein"]
[6156,"Gries am Brenner","T","PLZ-Adressierung","extern","Ja","Nein"]
[6157,"Obernberg am Brenner","T","PLZ-Adressierung","extern","Ja","Nein"]
[6161,"Natters","T","PLZ-Adressierung","extern","Ja","Nein"]
[6162,"Mutters","T","PLZ-Adressierung","extern","Ja","Ja"]
[6165,"Telfes im Stubai","T","PLZ-Adressierung","extern","Ja","Nein"]
[6166,"Fulpmes","T","PLZ-Adressierung","extern","Ja","Ja"]
[6167,"Neustift im Stubaital","T","PLZ-Adressierung","extern","Ja","Ja"]
[6170,"Zirl","T","PLZ-Adressierung","extern","Ja","Ja"]
[6173,"Oberperfuss","T","PLZ-Adressierung","extern","Ja","Ja"]
[6175,"Kematen in Tirol","T","PLZ-Adressierung","extern","Ja","Ja"]
[6176,"Völs","T","PLZ-Adressierung","extern","Ja","Ja"]
[6177,"Völs","T","PLZ-Postfach","extern","Nein","Ja"]
[6178,"Unterperfuss","T","PLZ-Adressierung","extern","Ja","Nein"]
[6179,"Ranggen","T","PLZ-Adressierung","extern","Ja","Nein"]
[6181,"Sellrain","T","PLZ-Adressierung","extern","Ja","Ja"]
[6182,"Gries im Sellrain","T","PLZ-Adressierung","extern","Ja","Ja"]
[6183,"Kühtai","T","PLZ-Adressierung","extern","Ja","Nein"]
[6184,"St. Sigmund","T","PLZ-Adressierung","extern","Ja","Nein"]
[6200,"Jenbach","T","PLZ-Adressierung","extern","Ja","Ja"]
[6210,"Wiesing","T","PLZ-Adressierung","extern","Ja","Nein"]
[6212,"Maurach","T","PLZ-Adressierung","extern","Ja","Ja"]
[6213,"Pertisau","T","PLZ-Adressierung","extern","Ja","Nein"]
[6215,"Achenkirch","T","PLZ-Adressierung","extern","Ja","Ja"]
[6222,"Gallzein","T","PLZ-Adressierung","extern","Ja","Nein"]
[6230,"Brixlegg","T","PLZ-Adressierung","extern","Ja","Ja"]
[6232,"Münster","T","PLZ-Adressierung","extern","Ja","Ja"]
[6233,"Kramsach","T","PLZ-Adressierung","extern","Ja","Ja"]
[6234,"Brandenberg","T","PLZ-Adressierung","extern","Ja","Nein"]
[6235,"Reith im Alpbachtal","T","PLZ-Adressierung","extern","Ja","Nein"]
[6236,"Alpbach","T","PLZ-Adressierung","extern","Ja","Ja"]
[6240,"Rattenberg","T","PLZ-Adressierung","extern","Ja","Ja"]
[6250,"Kundl","T","PLZ-Adressierung","extern","Ja","Ja"]
[6252,"Breitenbach am Inn","T","PLZ-Adressierung","extern","Ja","Nein"]
[6260,"Bruck am Ziller","T","PLZ-Adressierung","extern","Ja","Nein"]
[6261,"Strass im Zillertal","T","PLZ-Adressierung","extern","Ja","Nein"]
[6262,"Schlitters","T","PLZ-Adressierung","extern","Ja","Ja"]
[6263,"Fügen","T","PLZ-Adressierung","extern","Ja","Ja"]
[6265,"Hart im Zillertal","T","PLZ-Adressierung","extern","Ja","Nein"]
[6271,"Uderns","T","PLZ-Adressierung","extern","Ja","Ja"]
[6272,"Kaltenbach","T","PLZ-Adressierung","extern","Ja","Ja"]
[6274,"Aschau","T","PLZ-Adressierung","extern","Ja","Ja"]
[6275,"Stumm","T","PLZ-Adressierung","extern","Ja","Nein"]
[6276,"Stummerberg","T","PLZ-Adressierung","extern","Ja","Nein"]
[6280,"Zell am Ziller","T","PLZ-Adressierung","extern","Ja","Ja"]
[6281,"Gerlos","T","PLZ-Adressierung","extern","Ja","Ja"]
[6283,"Hippach","T","PLZ-Adressierung","extern","Ja","Ja"]
[6284,"Ramsau im Zillertal","T","PLZ-Adressierung","extern","Ja","Nein"]
[6290,"Mayrhofen","T","PLZ-Adressierung","extern","Ja","Ja"]
[6292,"Finkenberg","T","PLZ-Adressierung","extern","Ja","Nein"]
[6293,"Tux","T","PLZ-Adressierung","extern","Ja","Ja"]
[6294,"Hintertux","T","PLZ-Adressierung","extern","Ja","Nein"]
[6295,"Ginzling","T","PLZ-Adressierung","extern","Ja","Nein"]
[6300,"Wörgl","T","PLZ-Adressierung","extern","Ja","Ja"]
[6302,"Wörgl","T","PLZ-Postfach","extern","Nein","Ja"]
[6305,"Itter","T","PLZ-Adressierung","extern","Ja","Nein"]
[6306,"Söll","T","PLZ-Adressierung","extern","Ja","Ja"]
[6311,"Wildschönau-Oberau","T","PLZ-Adressierung","extern","Ja","Ja"]
[6313,"Wildschönau-Auffach","T","PLZ-Adressierung","extern","Ja","Nein"]
[6314,"Wildschönau-Niederau","T","PLZ-Adressierung","extern","Ja","Nein"]
[6320,"Angerberg","T","PLZ-Adressierung","extern","Ja","Nein"]
[6322,"Kirchbichl","T","PLZ-Adressierung","extern","Ja","Ja"]
[6323,"Bad Häring","T","PLZ-Adressierung","extern","Ja","Ja"]
[6324,"Mariastein","T","PLZ-Adressierung","extern","Ja","Nein"]
[6330,"Kufstein","T","PLZ-Adressierung","extern","Ja","Ja"]
[6332,"Kufstein","T","PLZ-Postfach","extern","Nein","Ja"]
[6333,"Kufstein","T","PLZ-Postfach","extern","Nein","Ja"]
[6334,"Schwoich","T","PLZ-Adressierung","extern","Ja","Nein"]
[6335,"Thiersee","T","PLZ-Adressierung","extern","Ja","Ja"]
[6336,"Langkampfen","T","PLZ-Adressierung","extern","Ja","Nein"]
[6341,"Ebbs","T","PLZ-Adressierung","extern","Ja","Ja"]
[6342,"Niederndorf","T","PLZ-Adressierung","extern","Ja","Ja"]
[6343,"Erl","T","PLZ-Adressierung","extern","Ja","Nein"]
[6344,"Walchsee","T","PLZ-Adressierung","extern","Ja","Ja"]
[6345,"Kössen","T","PLZ-Adressierung","extern","Ja","Ja"]
[6351,"Scheffau am Wilden Kaiser","T","PLZ-Adressierung","extern","Ja","Ja"]
[6352,"Ellmau","T","PLZ-Adressierung","extern","Ja","Ja"]
[6353,"Going am Wilden Kaiser","T","PLZ-Adressierung","extern","Ja","Ja"]
[6361,"Hopfgarten","T","PLZ-Adressierung","extern","Ja","Ja"]
[6363,"Westendorf","T","PLZ-Adressierung","extern","Ja","Ja"]
[6364,"Brixen im Thale","T","PLZ-Adressierung","extern","Ja","Ja"]
[6365,"Kirchberg in Tirol","T","PLZ-Adressierung","extern","Ja","Ja"]
[6370,"Kitzbühel","T","PLZ-Adressierung","extern","Ja","Ja"]
[6372,"Oberndorf in Tirol","T","PLZ-Adressierung","extern","Ja","Ja"]
[6373,"Jochberg","T","PLZ-Adressierung","extern","Ja","Nein"]
[6380,"St. Johann in Tirol","T","PLZ-Adressierung","extern","Ja","Ja"]
[6382,"Kirchdorf in Tirol","T","PLZ-Adressierung","extern","Ja","Nein"]
[6383,"Erpfendorf","T","PLZ-Adressierung","extern","Ja","Ja"]
[6384,"Waidring","T","PLZ-Adressierung","extern","Ja","Ja"]
[6385,"Schwendt","T","PLZ-Adressierung","extern","Ja","Nein"]
[6391,"Fieberbrunn","T","PLZ-Adressierung","extern","Ja","Ja"]
[6392,"St. Jakob in Haus","T","PLZ-Adressierung","extern","Ja","Nein"]
[6393,"St. Ulrich am Pillersee","T","PLZ-Adressierung","extern","Ja","Ja"]
[6395,"Hochfilzen","T","PLZ-Adressierung","extern","Ja","Nein"]
[6401,"Inzing","T","PLZ-Adressierung","extern","Ja","Ja"]
[6402,"Hatting","T","PLZ-Adressierung","extern","Ja","Nein"]
[6403,"Flaurling","T","PLZ-Adressierung","extern","Ja","Nein"]
[6404,"Polling","T","PLZ-Adressierung","extern","Ja","Nein"]
[6405,"Pfaffenhofen","T","PLZ-Adressierung","extern","Ja","Nein"]
[6406,"Oberhofen im Inntal","T","PLZ-Adressierung","extern","Ja","Nein"]
[6408,"Pettnau","T","PLZ-Adressierung","extern","Ja","Nein"]
[6410,"Telfs","T","PLZ-Adressierung","extern","Ja","Ja"]
[6412,"Telfs-St. Georgen","T","PLZ-Postfach","extern","Nein","Ja"]
[6414,"Mieming","T","PLZ-Adressierung","extern","Ja","Ja"]
[6416,"Obsteig","T","PLZ-Adressierung","extern","Ja","Nein"]
[6421,"Rietz","T","PLZ-Adressierung","extern","Ja","Nein"]
[6422,"Stams","T","PLZ-Adressierung","extern","Ja","Ja"]
[6423,"Mötz","T","PLZ-Adressierung","extern","Ja","Nein"]
[6424,"Silz","T","PLZ-Adressierung","extern","Ja","Ja"]
[6425,"Haiming","T","PLZ-Adressierung","extern","Ja","Ja"]
[6426,"Roppen","T","PLZ-Adressierung","extern","Ja","Nein"]
[6430,"Ötztal Bahnhof","T","PLZ-Adressierung","extern","Ja","Ja"]
[6432,"Sautens","T","PLZ-Adressierung","extern","Ja","Nein"]
[6433,"Oetz","T","PLZ-Adressierung","extern","Ja","Ja"]
[6441,"Umhausen","T","PLZ-Adressierung","extern","Ja","Ja"]
[6444,"Längenfeld","T","PLZ-Adressierung","extern","Ja","Ja"]
[6450,"Sölden","T","PLZ-Adressierung","extern","Ja","Ja"]
[6452,"Hochsölden","T","PLZ-Adressierung","extern","Ja","Nein"]
[6456,"Obergurgl","T","PLZ-Adressierung","extern","Ja","Ja"]
[6458,"Vent","T","PLZ-Adressierung","extern","Ja","Nein"]
[6460,"Imst","T","PLZ-Adressierung","extern","Ja","Ja"]
[6462,"Karres","T","PLZ-Adressierung","extern","Ja","Nein"]
[6464,"Tarrenz","T","PLZ-Adressierung","extern","Ja","Nein"]
[6465,"Nassereith","T","PLZ-Adressierung","extern","Ja","Ja"]
[6471,"Arzl im Pitztal","T","PLZ-Adressierung","extern","Ja","Ja"]
[6473,"Wenns","T","PLZ-Adressierung","extern","Ja","Ja"]
[6474,"Jerzens","T","PLZ-Adressierung","extern","Ja","Nein"]
[6481,"St. Leonhard im Pitztal","T","PLZ-Adressierung","extern","Ja","Ja"]
[6491,"Schönwies","T","PLZ-Adressierung","extern","Ja","Nein"]
[6492,"Imsterberg","T","PLZ-Adressierung","extern","Ja","Nein"]
[6500,"Landeck","T","PLZ-Adressierung","extern","Ja","Ja"]
[6503,"Landeck-Öd","T","PLZ-Postfach","extern","Nein","Ja"]
[6511,"Zams","T","PLZ-Adressierung","extern","Ja","Ja"]
[6521,"Fließ","T","PLZ-Adressierung","extern","Ja","Nein"]
[6522,"Prutz","T","PLZ-Adressierung","extern","Ja","Ja"]
[6524,"Feichten im Kaunertal","T","PLZ-Adressierung","extern","Ja","Nein"]
[6527,"Kaunerberg","T","PLZ-Adressierung","extern","Ja","Nein"]
[6528,"Fendels","T","PLZ-Adressierung","extern","Ja","Nein"]
[6531,"Ried im Oberinntal","T","PLZ-Adressierung","extern","Ja","Ja"]
[6532,"Ladis","T","PLZ-Adressierung","extern","Ja","Nein"]
[6533,"Fiss","T","PLZ-Adressierung","extern","Ja","Ja"]
[6534,"Serfaus","T","PLZ-Adressierung","extern","Ja","Ja"]
[6541,"Tösens","T","PLZ-Adressierung","extern","Ja","Nein"]
[6542,"Pfunds","T","PLZ-Adressierung","extern","Ja","Ja"]
[6543,"Nauders","T","PLZ-Adressierung","extern","Ja","Ja"]
[6544,"Spiss","T","PLZ-Adressierung","extern","Ja","Nein"]
[6551,"Pians","T","PLZ-Adressierung","extern","Ja","Ja"]
[6552,"Tobadill","T","PLZ-Adressierung","extern","Ja","Nein"]
[6553,"See","T","PLZ-Adressierung","extern","Ja","Ja"]
[6555,"Kappl","T","PLZ-Adressierung","extern","Ja","Ja"]
[6561,"Ischgl","T","PLZ-Adressierung","extern","Ja","Ja"]
[6562,"Mathon","T","PLZ-Adressierung","extern","Ja","Nein"]
[6563,"Galtür","T","PLZ-Adressierung","extern","Ja","Ja"]
[6571,"Strengen","T","PLZ-Adressierung","extern","Ja","Nein"]
[6572,"Flirsch","T","PLZ-Adressierung","extern","Ja","Ja"]
[6574,"Pettneu am Arlberg","T","PLZ-Adressierung","extern","Ja","Ja"]
[6580,"St. Anton am Arlberg","T","PLZ-Adressierung","extern","Ja","Ja"]
[6591,"Grins","T","PLZ-Adressierung","extern","Ja","Nein"]
[6600,"Reutte","T","PLZ-Adressierung","extern","Ja","Ja"]
[6610,"Wängle","T","PLZ-Adressierung","extern","Ja","Nein"]
[6611,"Heiterwang","T","PLZ-Adressierung","extern","Ja","Nein"]
[6621,"Bichlbach","T","PLZ-Adressierung","extern","Ja","Ja"]
[6622,"Berwang","T","PLZ-Adressierung","extern","Ja","Nein"]
[6623,"Namlos","T","PLZ-Adressierung","extern","Ja","Nein"]
[6631,"Lermoos","T","PLZ-Adressierung","extern","Ja","Ja"]
[6632,"Ehrwald","T","PLZ-Adressierung","extern","Ja","Ja"]
[6633,"Biberwier","T","PLZ-Adressierung","extern","Ja","Nein"]
[6642,"Stanzach","T","PLZ-Adressierung","extern","Ja","Nein"]
[6644,"Elmen","T","PLZ-Adressierung","extern","Ja","Nein"]
[6645,"Vorderhornbach","T","PLZ-Adressierung","extern","Ja","Nein"]
[6646,"Hinterhornbach","T","PLZ-Adressierung","extern","Ja","Nein"]
[6647,"Pfafflar","T","PLZ-Adressierung","extern","Ja","Nein"]
[6650,"Gramais","T","PLZ-Adressierung","extern","Ja","Nein"]
[6651,"Häselgehr","T","PLZ-Adressierung","extern","Ja","Nein"]
[6652,"Elbigenalp","T","PLZ-Adressierung","extern","Ja","Ja"]
[6653,"Bach","T","PLZ-Adressierung","extern","Ja","Nein"]
[6654,"Holzgau","T","PLZ-Adressierung","extern","Ja","Nein"]
[6655,"Steeg","T","PLZ-Adressierung","extern","Ja","Nein"]
[6670,"Forchach","T","PLZ-Adressierung","extern","Ja","Nein"]
[6671,"Weißenbach am Lech","T","PLZ-Adressierung","extern","Ja","Ja"]
[6672,"Nesselwängle","T","PLZ-Adressierung","extern","Ja","Nein"]
[6673,"Grän","T","PLZ-Adressierung","extern","Ja","Nein"]
[6675,"Tannheim","T","PLZ-Adressierung","extern","Ja","Ja"]
[6677,"Schattwald","T","PLZ-Adressierung","extern","Ja","Nein"]
[6682,"Vils","T","PLZ-Adressierung","extern","Ja","Ja"]
[6691,"Jungholz","T","PLZ-Adressierung","extern","Ja","Ja"]
[6700,"Bludenz","V","PLZ-Adressierung","extern","Ja","Ja"]
[6701,"Bludenz Postfach","V","PLZ-Postfach","extern","Nein","Ja"]
[6706,"Bürs","V","PLZ-Adressierung","extern","Ja","Ja"]
[6707,"Bürserberg","V","PLZ-Adressierung","extern","Ja","Nein"]
[6708,"Brand","V","PLZ-Adressierung","extern","Ja","Nein"]
[6710,"Nenzing","V","PLZ-Adressierung","extern","Ja","Ja"]
[6712,"Thüringen","V","PLZ-Adressierung","extern","Ja","Ja"]
[6713,"Ludesch","V","PLZ-Adressierung","extern","Ja","Ja"]
[6714,"Nüziders","V","PLZ-Adressierung","extern","Ja","Ja"]
[6719,"Bludesch","V","PLZ-Adressierung","extern","Ja","Nein"]
[6721,"Thüringerberg","V","PLZ-Adressierung","extern","Ja","Nein"]
[6722,"St. Gerold","V","PLZ-Adressierung","extern","Ja","Nein"]
[6723,"Blons","V","PLZ-Adressierung","extern","Ja","Nein"]
[6731,"Sonntag","V","PLZ-Adressierung","extern","Ja","Ja"]
[6733,"Fontanella","V","PLZ-Adressierung","extern","Ja","Nein"]
[6741,"Raggal","V","PLZ-Adressierung","extern","Ja","Nein"]
[6751,"Braz","V","PLZ-Adressierung","extern","Ja","Nein"]
[6752,"Dalaas","V","PLZ-Adressierung","extern","Ja","Ja"]
[6754,"Klösterle","V","PLZ-Adressierung","extern","Ja","Nein"]
[6762,"Stuben","V","PLZ-Adressierung","extern","Ja","Nein"]
[6763,"Zürs","V","PLZ-Adressierung","extern","Ja","Nein"]
[6764,"Lech","V","PLZ-Adressierung","extern","Ja","Ja"]
[6767,"Warth","V","PLZ-Adressierung","extern","Ja","Nein"]
[6771,"St. Anton im Montafon","V","PLZ-Adressierung","extern","Ja","Nein"]
[6773,"Vandans","V","PLZ-Adressierung","extern","Ja","Ja"]
[6774,"Tschagguns","V","PLZ-Adressierung","extern","Ja","Ja"]
[6780,"Schruns","V","PLZ-Adressierung","extern","Ja","Ja"]
[6787,"Gargellen","V","PLZ-Adressierung","extern","Ja","Nein"]
[6791,"St. Gallenkirch","V","PLZ-Adressierung","extern","Ja","Ja"]
[6793,"Gaschurn","V","PLZ-Adressierung","extern","Ja","Ja"]
[6794,"Partenen","V","PLZ-Adressierung","extern","Ja","Nein"]
[6800,"Feldkirch","V","PLZ-Adressierung","extern","Ja","Ja"]
[6801,"Feldkirch Postfach","V","PLZ-Postfach","extern","Nein","Ja"]
[6803,"Feldkirch","V","PLZ-Postfach","extern","Nein","Ja"]
[6804,"Feldkirch-Altenstadt","V","PLZ-Postfach","extern","Nein","Ja"]
[6805,"Feldkirch-Gisingen","V","PLZ-Postfach","extern","Nein","Ja"]
[6806,"Feldkirch-Tosters","V","PLZ-Postfach","extern","Nein","Ja"]
[6807,"Feldkirch-Tisis","V","PLZ-Postfach","extern","Nein","Ja"]
[6811,"Göfis","V","PLZ-Adressierung","extern","Ja","Nein"]
[6812,"Meiningen","V","PLZ-Adressierung","extern","Ja","Nein"]
[6820,"Frastanz","V","PLZ-Adressierung","extern","Ja","Ja"]
[6822,"Satteins","V","PLZ-Adressierung","extern","Ja","Ja"]
[6824,"Schlins","V","PLZ-Adressierung","extern","Ja","Nein"]
[6830,"Rankweil","V","PLZ-Adressierung","extern","Ja","Ja"]
[6832,"Sulz-Röthis","V","PLZ-Adressierung","extern","Ja","Ja"]
[6833,"Klaus-Weiler","V","PLZ-Adressierung","extern","Ja","Ja"]
[6834,"Übersaxen","V","PLZ-Adressierung","extern","Ja","Nein"]
[6836,"Viktorsberg","V","PLZ-Adressierung","extern","Ja","Nein"]
[6840,"Götzis","V","PLZ-Adressierung","extern","Ja","Ja"]
[6841,"Mäder","V","PLZ-Adressierung","extern","Ja","Ja"]
[6842,"Koblach","V","PLZ-Adressierung","extern","Ja","Ja"]
[6844,"Altach","V","PLZ-Adressierung","extern","Ja","Ja"]
[6845,"Hohenems","V","PLZ-Adressierung","extern","Ja","Ja"]
[6850,"Dornbirn","V","PLZ-Adressierung","extern","Ja","Ja"]
[6851,"Dornbirn Postfach","V","PLZ-Postfach","extern","Nein","Ja"]
[6852,"Dornbirn-Oberdorf","V","PLZ-Postfach","extern","Nein","Ja"]
[6853,"Dornbirn-Hatlerdorf","V","PLZ-Postfach","extern","Nein","Ja"]
[6854,"Dornbirn-Messepark","V","PLZ-Postfach","extern","Nein","Ja"]
[6857,"Dornbirn-Haselstauden","V","PLZ-Postfach","extern","Nein","Ja"]
[6858,"Schwarzach","V","PLZ-Adressierung","extern","Ja","Ja"]
[6861,"Alberschwende","V","PLZ-Adressierung","extern","Ja","Ja"]
[6863,"Egg","V","PLZ-Adressierung","extern","Ja","Ja"]
[6866,"Andelsbuch","V","PLZ-Adressierung","extern","Ja","Nein"]
[6867,"Schwarzenberg","V","PLZ-Adressierung","extern","Ja","Nein"]
[6870,"Bezau","V","PLZ-Adressierung","extern","Ja","Ja"]
[6874,"Bizau","V","PLZ-Adressierung","extern","Ja","Nein"]
[6881,"Mellau","V","PLZ-Adressierung","extern","Ja","Ja"]
[6882,"Schnepfau","V","PLZ-Adressierung","extern","Ja","Nein"]
[6883,"Au","V","PLZ-Adressierung","extern","Ja","Ja"]
[6884,"Damüls","V","PLZ-Adressierung","extern","Ja","Nein"]
[6886,"Schoppernau","V","PLZ-Adressierung","extern","Ja","Nein"]
[6888,"Schröcken","V","PLZ-Adressierung","extern","Ja","Nein"]
[6890,"Lustenau","V","PLZ-Adressierung","extern","Ja","Ja"]
[6893,"Lustenau-Rheindorf","V","PLZ-Postfach","extern","Nein","Ja"]
[6900,"Bregenz","V","PLZ-Adressierung","extern","Ja","Ja"]
[6901,"Bregenz Postfach","V","PLZ-Postfach","extern","Nein","Ja"]
[6903,"Bregenz-Vorkloster","V","PLZ-Postfach","extern","Nein","Ja"]
[6904,"Bregenz-Schendlingen","V","PLZ-Postfach","extern","Nein","Ja"]
[6905,"Bregenz-Achsiedlung","V","PLZ-Postfach","extern","Nein","Ja"]
[6911,"Lochau","V","PLZ-Adressierung","extern","Ja","Ja"]
[6912,"Hörbranz","V","PLZ-Adressierung","extern","Ja","Ja"]
[6914,"Hohenweiler","V","PLZ-Adressierung","extern","Ja","Nein"]
[6921,"Kennelbach","V","PLZ-Adressierung","extern","Ja","Ja"]
[6922,"Wolfurt","V","PLZ-Adressierung","extern","Ja","Ja"]
[6923,"Lauterach","V","PLZ-Adressierung","extern","Ja","Ja"]
[6932,"Langen bei Bregenz","V","PLZ-Adressierung","extern","Ja","Ja"]
[6933,"Doren","V","PLZ-Adressierung","extern","Ja","Nein"]
[6934,"Sulzberg","V","PLZ-Adressierung","extern","Ja","Nein"]
[6941,"Langenegg","V","PLZ-Adressierung","extern","Ja","Nein"]
[6942,"Krumbach","V","PLZ-Adressierung","extern","Ja","Ja"]
[6943,"Riefensberg","V","PLZ-Adressierung","extern","Ja","Nein"]
[6951,"Lingenau","V","PLZ-Adressierung","extern","Ja","Nein"]
[6952,"Hittisau","V","PLZ-Adressierung","extern","Ja","Ja"]
[6960,"Wolfurt-Bahnhof","V","PLZ-Adressierung","extern","Ja","Ja"]
[6961,"Wolfurt-Bahnhof Postfach","V","PLZ-Postfach","extern","Nein","Ja"]
[6971,"Hard","V","PLZ-Adressierung","extern","Ja","Ja"]
[6972,"Fußach","V","PLZ-Adressierung","extern","Ja","Ja"]
[6973,"Höchst","V","PLZ-Adressierung","extern","Ja","Ja"]
[6974,"Gaißau","V","PLZ-Adressierung","extern","Ja","Ja"]
[6991,"Riezlern","V","PLZ-Adressierung","extern","Ja","Ja"]
[6992,"Hirschegg","V","PLZ-Adressierung","extern","Ja","Ja"]
[6993,"Mittelberg","V","PLZ-Adressierung","extern","Ja","Nein"]
[7000,"Eisenstadt","B","PLZ-Adressierung","extern","Ja","Ja"]
[7001,"Eisenstadt Postfach","B","PLZ-Postfach","extern","Nein","Ja"]
[7002,"Eisenstadt","B","PLZ-Postfach","extern","Nein","Ja"]
[7011,"Siegendorf","B","PLZ-Adressierung","extern","Ja","Nein"]
[7013,"Klingenbach","B","PLZ-Adressierung","extern","Ja","Ja"]
[7021,"Draßburg","B","PLZ-Adressierung","extern","Ja","Ja"]
[7022,"Schattendorf","B","PLZ-Adressierung","extern","Ja","Ja"]
[7023,"Zemendorf","B","PLZ-Adressierung","extern","Ja","Nein"]
[7024,"Hirm","B","PLZ-Adressierung","extern","Ja","Ja"]
[7031,"Krensdorf","B","PLZ-Adressierung","extern","Ja","Nein"]
[7032,"Sigleß","B","PLZ-Adressierung","extern","Ja","Nein"]
[7033,"Pöttsching","B","PLZ-Adressierung","extern","Ja","Ja"]
[7034,"Zillingtal","B","PLZ-Adressierung","extern","Ja","Nein"]
[7035,"Steinbrunn","B","PLZ-Adressierung","extern","Ja","Ja"]
[7041,"Wulkaprodersdorf","B","PLZ-Adressierung","extern","Ja","Ja"]
[7051,"Großhöflein","B","PLZ-Adressierung","extern","Ja","Nein"]
[7052,"Müllendorf","B","PLZ-Adressierung","extern","Ja","Nein"]
[7053,"Hornstein","B","PLZ-Adressierung","extern","Ja","Ja"]
[7061,"Trausdorf an der Wulka","B","PLZ-Adressierung","extern","Ja","Nein"]
[7062,"St. Margarethen im Burgenland","B","PLZ-Adressierung","extern","Ja","Ja"]
[7063,"Oggau","B","PLZ-Adressierung","extern","Ja","Ja"]
[7064,"Oslip","B","PLZ-Adressierung","extern","Ja","Nein"]
[7071,"Rust","B","PLZ-Adressierung","extern","Ja","Ja"]
[7072,"Mörbisch am See","B","PLZ-Adressierung","extern","Ja","Ja"]
[7073,"Rust, Burgenland","B","InteressentenPLZ","extern","Nein","Ja"]
[7081,"Schützen am Gebirge","B","PLZ-Adressierung","extern","Ja","Nein"]
[7082,"Donnerskirchen","B","PLZ-Adressierung","extern","Ja","Nein"]
[7083,"Purbach am Neusiedler See","B","PLZ-Adressierung","extern","Ja","Ja"]
[7091,"Breitenbrunn","B","PLZ-Adressierung","extern","Ja","Ja"]
[7092,"Winden am See","B","PLZ-Adressierung","extern","Ja","Nein"]
[7093,"Jois","B","PLZ-Adressierung","extern","Ja","Nein"]
[7100,"Neusiedl am See","B","PLZ-Adressierung","extern","Ja","Ja"]
[7111,"Parndorf","B","PLZ-Adressierung","extern","Ja","Ja"]
[7121,"Weiden am See","B","PLZ-Adressierung","extern","Ja","Nein"]
[7122,"Gols","B","PLZ-Adressierung","extern","Ja","Ja"]
[7123,"Mönchhof","B","PLZ-Adressierung","extern","Ja","Ja"]
[7131,"Halbturn","B","PLZ-Adressierung","extern","Ja","Ja"]
[7132,"Frauenkirchen","B","PLZ-Adressierung","extern","Ja","Ja"]
[7141,"Podersdorf am See","B","PLZ-Adressierung","extern","Ja","Ja"]
[7142,"Illmitz","B","PLZ-Adressierung","extern","Ja","Ja"]
[7143,"Apetlon","B","PLZ-Adressierung","extern","Ja","Nein"]
[7151,"Wallern im Burgenland","B","PLZ-Adressierung","extern","Ja","Ja"]
[7152,"Pamhagen","B","PLZ-Adressierung","extern","Ja","Ja"]
[7161,"St. Andrä am Zicksee","B","PLZ-Adressierung","extern","Ja","Nein"]
[7162,"Tadten","B","PLZ-Adressierung","extern","Ja","Nein"]
[7163,"Andau","B","PLZ-Adressierung","extern","Ja","Ja"]
[7201,"Neudörfl","B","PLZ-Adressierung","extern","Ja","Ja"]
[7202,"Bad Sauerbrunn","B","PLZ-Adressierung","extern","Ja","Ja"]
[7203,"Wiesen","B","PLZ-Adressierung","extern","Ja","Nein"]
[7210,"Mattersburg","B","PLZ-Adressierung","extern","Ja","Ja"]
[7212,"Forchtenstein","B","PLZ-Adressierung","extern","Ja","Nein"]
[7221,"Marz","B","PLZ-Adressierung","extern","Ja","Nein"]
[7222,"Rohrbach bei Mattersburg","B","PLZ-Adressierung","extern","Ja","Ja"]
[7223,"Sieggraben","B","PLZ-Adressierung","extern","Ja","Nein"]
[7301,"Deutschkreutz","B","PLZ-Adressierung","extern","Ja","Ja"]
[7302,"Nikitsch","B","PLZ-Adressierung","extern","Ja","Nein"]
[7304,"Großwarasdorf","B","PLZ-Adressierung","extern","Ja","Nein"]
[7311,"Neckenmarkt","B","PLZ-Adressierung","extern","Ja","Nein"]
[7312,"Horitschon","B","PLZ-Adressierung","extern","Ja","Ja"]
[7321,"Lackendorf","B","PLZ-Adressierung","extern","Ja","Ja"]
[7322,"Lackenbach","B","PLZ-Adressierung","extern","Ja","Nein"]
[7323,"Ritzing","B","PLZ-Adressierung","extern","Ja","Nein"]
[7331,"Weppersdorf","B","PLZ-Adressierung","extern","Ja","Ja"]
[7332,"Kobersdorf","B","PLZ-Adressierung","extern","Ja","Ja"]
[7341,"Markt St. Martin","B","PLZ-Adressierung","extern","Ja","Nein"]
[7342,"Kaisersdorf","B","PLZ-Adressierung","extern","Ja","Nein"]
[7343,"Neutal","B","PLZ-Adressierung","extern","Ja","Nein"]
[7344,"Stoob","B","PLZ-Adressierung","extern","Ja","Nein"]
[7350,"Oberpullendorf","B","PLZ-Adressierung","extern","Ja","Ja"]
[7361,"Lutzmannsburg","B","PLZ-Adressierung","extern","Ja","Nein"]
[7371,"Unterrabnitz","B","PLZ-Adressierung","extern","Ja","Ja"]
[7372,"Draßmarkt","B","PLZ-Adressierung","extern","Ja","Nein"]
[7400,"Oberwart","B","PLZ-Adressierung","extern","Ja","Ja"]
[7411,"Markt Allhau","B","PLZ-Adressierung","extern","Ja","Ja"]
[7412,"Wolfau","B","PLZ-Adressierung","extern","Ja","Nein"]
[7421,"Tauchen-Schaueregg","St","PLZ-Adressierung","extern","Ja","Nein"]
[7422,"Riedlingsdorf","B","PLZ-Adressierung","extern","Ja","Ja"]
[7423,"Pinkafeld","B","PLZ-Adressierung","extern","Ja","Ja"]
[7431,"Bad Tatzmannsdorf","B","PLZ-Adressierung","extern","Ja","Ja"]
[7432,"Oberschützen","B","PLZ-Adressierung","extern","Ja","Ja"]
[7433,"Mariasdorf","B","PLZ-Adressierung","extern","Ja","Nein"]
[7434,"Bernstein","B","PLZ-Adressierung","extern","Ja","Ja"]
[7435,"Unterkohlstätten","B","PLZ-Adressierung","extern","Ja","Nein"]
[7441,"Pilgersdorf","B","PLZ-Adressierung","extern","Ja","Nein"]
[7442,"Lockenhaus","B","PLZ-Adressierung","extern","Ja","Ja"]
[7443,"Rattersdorf-Liebing","B","PLZ-Adressierung","extern","Ja","Nein"]
[7444,"Mannersdorf an der Rabnitz","B","PLZ-Adressierung","extern","Ja","Nein"]
[7451,"Oberloisdorf","B","PLZ-Adressierung","extern","Ja","Nein"]
[7452,"Unterpullendorf","B","PLZ-Adressierung","extern","Ja","Nein"]
[7453,"Steinberg-Dörfl","B","PLZ-Adressierung","extern","Ja","Nein"]
[7461,"Stadtschlaining","B","PLZ-Adressierung","extern","Ja","Ja"]
[7463,"Weiden bei Rechnitz","B","PLZ-Adressierung","extern","Ja","Nein"]
[7464,"Markt Neuhodis","B","PLZ-Adressierung","extern","Ja","Nein"]
[7471,"Rechnitz","B","PLZ-Adressierung","extern","Ja","Ja"]
[7472,"Schachendorf","B","PLZ-Adressierung","extern","Ja","Nein"]
[7473,"Hannersdorf","B","PLZ-Adressierung","extern","Ja","Nein"]
[7474,"Deutsch Schützen","B","PLZ-Adressierung","extern","Ja","Nein"]
[7501,"Rotenturm an der Pinka","B","PLZ-Adressierung","extern","Ja","Ja"]
[7503,"Großpetersdorf","B","PLZ-Adressierung","extern","Ja","Ja"]
[7511,"Mischendorf","B","PLZ-Adressierung","extern","Ja","Nein"]
[7512,"Kohfidisch","B","PLZ-Adressierung","extern","Ja","Nein"]
[7521,"Eberau","B","PLZ-Adressierung","extern","Ja","Nein"]
[7522,"Strem","B","PLZ-Adressierung","extern","Ja","Nein"]
[7531,"Kemeten","B","PLZ-Adressierung","extern","Ja","Ja"]
[7532,"Litzelsdorf","B","PLZ-Adressierung","extern","Ja","Nein"]
[7533,"Ollersdorf im Burgenland","B","PLZ-Adressierung","extern","Ja","Nein"]
[7534,"Olbendorf","B","PLZ-Adressierung","extern","Ja","Nein"]
[7535,"St. Michael im Burgenland","B","PLZ-Adressierung","extern","Ja","Ja"]
[7540,"Güssing","B","PLZ-Adressierung","extern","Ja","Ja"]
[7542,"Gerersdorf bei Güssing","B","PLZ-Adressierung","extern","Ja","Nein"]
[7543,"Kukmirn","B","PLZ-Adressierung","extern","Ja","Nein"]
[7551,"Stegersbach","B","PLZ-Adressierung","extern","Ja","Ja"]
[7552,"Stinatz","B","PLZ-Adressierung","extern","Ja","Nein"]
[7561,"Heiligenkreuz im Lafnitztal","B","PLZ-Adressierung","extern","Ja","Ja"]
[7562,"Eltendorf","B","PLZ-Adressierung","extern","Ja","Nein"]
[7563,"Königsdorf","B","PLZ-Adressierung","extern","Ja","Nein"]
[7564,"Dobersdorf","B","PLZ-Adressierung","extern","Ja","Nein"]
[7571,"Rudersdorf","B","PLZ-Adressierung","extern","Ja","Ja"]
[7572,"Deutsch Kaltenbrunn","B","PLZ-Adressierung","extern","Ja","Nein"]
[8010,"Graz","St","PLZ-Adressierung","extern","Ja","Ja"]
[8011,"Graz Postfach","St","PLZ-Postfach","extern","Nein","Ja"]
[8013,"Graz","St","PLZ-Postfach","extern","Nein","Ja"]
[8015,"Graz","St","PLZ-Postfach","extern","Nein","Ja"]
[8016,"Graz","St","PLZ-Postfach","extern","Nein","Ja"]
[8017,"Graz","St","PLZ-Postfach","extern","Nein","Ja"]
[8018,"Graz","St","PLZ-Postfach","extern","Nein","Ja"]
[8019,"Graz","St","PLZ-Postfach","extern","Nein","Ja"]
[8020,"Graz","St","PLZ-Adressierung","extern","Ja","Ja"]
[8021,"Graz Postfach","St","PLZ-Postfach","extern","Nein","Ja"]
[8022,"Graz","St","PLZ-Postfach","extern","Nein","Ja"]
[8023,"Graz","St","PLZ-Postfach","extern","Nein","Ja"]
[8024,"Graz","St","PLZ-Postfach","extern","Nein","Ja"]
[8025,"Graz","St","PLZ-Postfach","extern","Nein","Ja"]
[8026,"Graz","St","PLZ-Postfach","extern","Nein","Ja"]
[8027,"Graz","St","PLZ-Postfach","extern","Nein","Ja"]
[8028,"Graz","St","PLZ-Postfach","extern","Nein","Ja"]
[8029,"Graz","St","PLZ-Postfach","extern","Nein","Ja"]
[8035,"Graz","St","PLZ-Postfach","extern","Nein","Ja"]
[8036,"Graz","St","PLZ-Adressierung","extern","Ja","Ja"]
[8041,"Graz-Liebenau","St","PLZ-Adressierung","extern","Ja","Ja"]
[8042,"Graz-St. Peter","St","PLZ-Adressierung","extern","Ja","Ja"]
[8043,"Graz-Kroisbach","St","PLZ-Adressierung","extern","Ja","Ja"]
[8044,"Graz-Mariatrost","St","PLZ-Adressierung","extern","Ja","Ja"]
[8045,"Graz-Andritz","St","PLZ-Adressierung","extern","Ja","Ja"]
[8046,"Graz-St. Veit","St","PLZ-Adressierung","extern","Ja","Nein"]
[8047,"Graz-Ragnitz","St","PLZ-Adressierung","extern","Ja","Ja"]
[8051,"Graz-Gösting","St","PLZ-Adressierung","extern","Ja","Ja"]
[8052,"Graz-Wetzelsdorf","St","PLZ-Adressierung","extern","Ja","Ja"]
[8053,"Graz-Neuhart","St","PLZ-Adressierung","extern","Ja","Ja"]
[8054,"Graz-Straßgang","St","PLZ-Adressierung","extern","Ja","Ja"]
[8055,"Graz-Puntigam","St","PLZ-Adressierung","extern","Ja","Ja"]
[8061,"St. Radegund bei Graz","St","PLZ-Adressierung","extern","Ja","Ja"]
[8062,"Kumberg","St","PLZ-Adressierung","extern","Ja","Ja"]
[8063,"Eggersdorf bei Graz","St","PLZ-Adressierung","extern","Ja","Ja"]
[8071,"Hausmannstätten","St","PLZ-Adressierung","extern","Ja","Ja"]
[8072,"Fernitz","St","PLZ-Adressierung","extern","Ja","Ja"]
[8073,"Feldkirchen bei Graz","St","PLZ-Adressierung","extern","Ja","Ja"]
[8074,"Raaba","St","PLZ-Adressierung","extern","Ja","Ja"]
[8075,"Hart bei Graz","St","PLZ-Adressierung","extern","Ja","Ja"]
[8081,"Heiligenkreuz am Waasen","St","PLZ-Adressierung","extern","Ja","Ja"]
[8082,"Kirchbach in Steiermark","St","PLZ-Adressierung","extern","Ja","Ja"]
[8083,"St. Stefan im Rosental","St","PLZ-Adressierung","extern","Ja","Ja"]
[8091,"Jagerberg","St","PLZ-Adressierung","extern","Ja","Nein"]
[8092,"Mettersdorf am Saßbach","St","PLZ-Adressierung","extern","Ja","Nein"]
[8093,"St. Peter am Ottersbach","St","PLZ-Adressierung","extern","Ja","Ja"]
[8101,"Gratkorn","St","PLZ-Adressierung","extern","Ja","Ja"]
[8102,"Semriach","St","PLZ-Adressierung","extern","Ja","Ja"]
[8103,"Rein","St","PLZ-Adressierung","extern","Ja","Nein"]
[8111,"Judendorf-Straßengel","St","PLZ-Adressierung","extern","Ja","Ja"]
[8112,"Gratwein","St","PLZ-Adressierung","extern","Ja","Ja"]
[8113,"St. Oswald bei Plankenwarth","St","PLZ-Adressierung","extern","Ja","Nein"]
[8114,"Stübing","St","PLZ-Adressierung","extern","Ja","Nein"]
[8120,"Peggau","St","PLZ-Adressierung","extern","Ja","Nein"]
[8121,"Deutschfeistritz","St","PLZ-Adressierung","extern","Ja","Ja"]
[8122,"Waldstein","St","PLZ-Adressierung","extern","Ja","Nein"]
[8124,"Übelbach","St","PLZ-Adressierung","extern","Ja","Ja"]
[8130,"Frohnleiten","St","PLZ-Adressierung","extern","Ja","Ja"]
[8131,"Mixnitz","St","PLZ-Adressierung","extern","Ja","Nein"]
[8132,"Pernegg an der Mur","St","PLZ-Adressierung","extern","Ja","Nein"]
[8141,"Unterpremstätten","St","PLZ-Adressierung","extern","Ja","Ja"]
[8142,"Wundschuh","St","PLZ-Adressierung","extern","Ja","Ja"]
[8143,"Dobl","St","PLZ-Adressierung","extern","Ja","Nein"]
[8144,"Tobelbad","St","PLZ-Adressierung","extern","Ja","Nein"]
[8151,"Hitzendorf","St","PLZ-Adressierung","extern","Ja","Ja"]
[8152,"Stallhofen","St","PLZ-Adressierung","extern","Ja","Ja"]
[8153,"Geistthal","St","PLZ-Adressierung","extern","Ja","Nein"]
[8160,"Weiz","St","PLZ-Adressierung","extern","Ja","Ja"]
[8162,"Passail","St","PLZ-Adressierung","extern","Ja","Ja"]
[8163,"Fladnitz an der Teichalm","St","PLZ-Adressierung","extern","Ja","Nein"]
[8171,"St. Kathrein am Offenegg","St","PLZ-Adressierung","extern","Ja","Nein"]
[8172,"Heilbrunn","St","PLZ-Adressierung","extern","Ja","Nein"]
[8181,"St. Ruprecht an der Raab","St","PLZ-Adressierung","extern","Ja","Ja"]
[8182,"Puch bei Weiz","St","PLZ-Adressierung","extern","Ja","Nein"]
[8183,"Floing","St","PLZ-Adressierung","extern","Ja","Nein"]
[8184,"Anger","St","PLZ-Adressierung","extern","Ja","Ja"]
[8190,"Birkfeld","St","PLZ-Adressierung","extern","Ja","Ja"]
[8191,"Koglhof","St","PLZ-Adressierung","extern","Ja","Nein"]
[8192,"Strallegg","St","PLZ-Adressierung","extern","Ja","Nein"]
[8200,"Gleisdorf","St","PLZ-Adressierung","extern","Ja","Ja"]
[8211,"Großpesendorf","St","PLZ-Adressierung","extern","Ja","Nein"]
[8212,"Pischelsdorf in der Steiermark","St","PLZ-Adressierung","extern","Ja","Ja"]
[8221,"Hirnsdorf","St","PLZ-Adressierung","extern","Ja","Nein"]
[8222,"St. Johann bei Herberstein","St","PLZ-Adressierung","extern","Ja","Nein"]
[8223,"Stubenberg am See","St","PLZ-Adressierung","extern","Ja","Ja"]
[8224,"Kaindorf bei Hartberg","St","PLZ-Adressierung","extern","Ja","Ja"]
[8225,"Pöllau bei Hartberg","St","PLZ-Adressierung","extern","Ja","Ja"]
[8230,"Hartberg","St","PLZ-Adressierung","extern","Ja","Ja"]
[8232,"Grafendorf bei Hartberg","St","PLZ-Adressierung","extern","Ja","Ja"]
[8233,"Lafnitz","St","PLZ-Adressierung","extern","Ja","Nein"]
[8234,"Rohrbach an der Lafnitz","St","PLZ-Adressierung","extern","Ja","Nein"]
[8240,"Friedberg","St","PLZ-Adressierung","extern","Ja","Ja"]
[8241,"Dechantskirchen","St","PLZ-Adressierung","extern","Ja","Ja"]
[8242,"St. Lorenzen am Wechsel","St","PLZ-Adressierung","extern","Ja","Nein"]
[8243,"Pinggau","St","PLZ-Adressierung","extern","Ja","Ja"]
[8244,"Schäffern","St","PLZ-Adressierung","extern","Ja","Nein"]
[8250,"Vorau","St","PLZ-Adressierung","extern","Ja","Ja"]
[8251,"Bruck an der Lafnitz","St","PLZ-Adressierung","extern","Ja","Nein"]
[8252,"Mönichwald","St","PLZ-Adressierung","extern","Ja","Nein"]
[8253,"Waldbach","St","PLZ-Adressierung","extern","Ja","Ja"]
[8254,"Wenigzell","St","PLZ-Adressierung","extern","Ja","Ja"]
[8255,"St. Jakob","St","PLZ-Adressierung","extern","Ja","Nein"]
[8261,"Sinabelkirchen","St","PLZ-Adressierung","extern","Ja","Ja"]
[8262,"Ilz","St","PLZ-Adressierung","extern","Ja","Ja"]
[8263,"Großwilfersdorf","St","PLZ-Adressierung","extern","Ja","Ja"]
[8264,"Hainersdorf","St","PLZ-Adressierung","extern","Ja","Nein"]
[8265,"Großsteinbach","St","PLZ-Adressierung","extern","Ja","Nein"]
[8271,"Bad Waltersdorf","St","PLZ-Adressierung","extern","Ja","Ja"]
[8272,"Sebersdorf","St","PLZ-Adressierung","extern","Ja","Nein"]
[8273,"Ebersdorf","St","PLZ-Adressierung","extern","Ja","Nein"]
[8274,"Buch","St","PLZ-Adressierung","extern","Ja","Nein"]
[8280,"Fürstenfeld","St","PLZ-Adressierung","extern","Ja","Ja"]
[8282,"Loipersdorf bei Fürstenfeld","St","PLZ-Adressierung","extern","Ja","Ja"]
[8283,"Bad Blumau","St","PLZ-Adressierung","extern","Ja","Ja"]
[8291,"Burgau","St","PLZ-Adressierung","extern","Ja","Nein"]
[8292,"Neudau","St","PLZ-Adressierung","extern","Ja","Ja"]
[8293,"Wörth an der Lafnitz","St","PLZ-Adressierung","extern","Ja","Nein"]
[8294,"Unterrohr","St","PLZ-Adressierung","extern","Ja","Nein"]
[8295,"St. Johann in der Haide","St","PLZ-Adressierung","extern","Ja","Ja"]
[8301,"Laßnitzhöhe","St","PLZ-Adressierung","extern","Ja","Ja"]
[8302,"Nestelbach bei Graz","St","PLZ-Adressierung","extern","Ja","Nein"]
[8311,"Markt Hartmannsdorf","St","PLZ-Adressierung","extern","Ja","Ja"]
[8312,"Ottendorf an der Rittschein","St","PLZ-Adressierung","extern","Ja","Nein"]
[8313,"Breitenfeld an der Rittschein","St","PLZ-Adressierung","extern","Ja","Ja"]
[8321,"St. Margarethen an der Raab","St","PLZ-Adressierung","extern","Ja","Ja"]
[8322,"Studenzen","St","PLZ-Adressierung","extern","Ja","Ja"]
[8323,"St. Marein bei Graz","St","PLZ-Adressierung","extern","Ja","Ja"]
[8324,"Kirchberg an der Raab","St","PLZ-Adressierung","extern","Ja","Nein"]
[8330,"Feldbach","St","PLZ-Adressierung","extern","Ja","Ja"]
[8332,"Edelsbach bei Feldbach","St","PLZ-Adressierung","extern","Ja","Nein"]
[8333,"Riegersburg","St","PLZ-Adressierung","extern","Ja","Nein"]
[8334,"Lödersdorf","St","PLZ-Adressierung","extern","Ja","Nein"]
[8341,"Paldau","St","PLZ-Adressierung","extern","Ja","Ja"]
[8342,"Gnas","St","PLZ-Adressierung","extern","Ja","Ja"]
[8343,"Trautmannsdorf in Oststeiermark","St","PLZ-Adressierung","extern","Ja","Nein"]
[8344,"Bad Gleichenberg","St","PLZ-Adressierung","extern","Ja","Ja"]
[8345,"Straden","St","PLZ-Adressierung","extern","Ja","Ja"]
[8350,"Fehring","St","PLZ-Adressierung","extern","Ja","Ja"]
[8352,"Unterlamm","St","PLZ-Adressierung","extern","Ja","Nein"]
[8353,"Kapfenstein","St","PLZ-Adressierung","extern","Ja","Nein"]
[8354,"St. Anna am Aigen","St","PLZ-Adressierung","extern","Ja","Ja"]
[8355,"Tieschen","St","PLZ-Adressierung","extern","Ja","Nein"]
[8361,"Hatzendorf","St","PLZ-Adressierung","extern","Ja","Nein"]
[8362,"Söchau","St","PLZ-Adressierung","extern","Ja","Nein"]
[8380,"Jennersdorf","B","PLZ-Adressierung","extern","Ja","Ja"]
[8382,"Mogersdorf","B","PLZ-Adressierung","extern","Ja","Nein"]
[8383,"St. Martin an der Raab","B","PLZ-Adressierung","extern","Ja","Nein"]
[8384,"Minihof-Liebau","B","PLZ-Adressierung","extern","Ja","Ja"]
[8385,"Neuhaus am Klausenbach","B","PLZ-Adressierung","extern","Ja","Nein"]
[8401,"Kalsdorf bei Graz","St","PLZ-Adressierung","extern","Ja","Ja"]
[8402,"Werndorf","St","PLZ-Adressierung","extern","Ja","Nein"]
[8403,"Lebring","St","PLZ-Adressierung","extern","Ja","Ja"]
[8410,"Wildon","St","PLZ-Adressierung","extern","Ja","Ja"]
[8411,"Hengsberg","St","PLZ-Adressierung","extern","Ja","Nein"]
[8412,"Allerheiligen bei Wildon","St","PLZ-Adressierung","extern","Ja","Nein"]
[8413,"St. Georgen an der Stiefing","St","PLZ-Adressierung","extern","Ja","Nein"]
[8421,"Wolfsberg im Schwarzautal","St","PLZ-Adressierung","extern","Ja","Ja"]
[8422,"St. Nikolai ob Draßling","St","PLZ-Adressierung","extern","Ja","Nein"]
[8423,"St. Veit am Vogau","St","PLZ-Adressierung","extern","Ja","Nein"]
[8424,"Gabersdorf","St","PLZ-Adressierung","extern","Ja","Nein"]
[8430,"Leibnitz","St","PLZ-Adressierung","extern","Ja","Ja"]
[8435,"Wagna","St","PLZ-Adressierung","extern","Ja","Ja"]
[8441,"Fresing","St","PLZ-Adressierung","extern","Ja","Ja"]
[8442,"Kitzeck im Sausal","St","PLZ-Adressierung","extern","Ja","Nein"]
[8443,"Gleinstätten","St","PLZ-Adressierung","extern","Ja","Ja"]
[8444,"St. Andrä im Sausal","St","PLZ-Adressierung","extern","Ja","Nein"]
[8451,"Heimschuh","St","PLZ-Adressierung","extern","Ja","Nein"]
[8452,"Großklein","St","PLZ-Adressierung","extern","Ja","Ja"]
[8453,"St. Johann im Saggautal","St","PLZ-Adressierung","extern","Ja","Nein"]
[8454,"Arnfels","St","PLZ-Adressierung","extern","Ja","Ja"]
[8455,"Oberhaag","St","PLZ-Adressierung","extern","Ja","Nein"]
[8461,"Ehrenhausen","St","PLZ-Adressierung","extern","Ja","Ja"]
[8462,"Gamlitz","St","PLZ-Adressierung","extern","Ja","Ja"]
[8463,"Leutschach","St","PLZ-Adressierung","extern","Ja","Ja"]
[8471,"Spielfeld","St","PLZ-Adressierung","extern","Ja","Ja"]
[8472,"Straß in Steiermark","St","PLZ-Adressierung","extern","Ja","Ja"]
[8473,"Weitersfeld an der Mur","St","PLZ-Adressierung","extern","Ja","Nein"]
[8480,"Mureck","St","PLZ-Adressierung","extern","Ja","Ja"]
[8481,"Weinburg am Saßbach","St","PLZ-Adressierung","extern","Ja","Nein"]
[8482,"Gosdorf","St","PLZ-Adressierung","extern","Ja","Nein"]
[8483,"Deutsch Goritz","St","PLZ-Adressierung","extern","Ja","Nein"]
[8484,"Unterpurkla","St","PLZ-Adressierung","extern","Ja","Nein"]
[8490,"Bad Radkersburg","St","PLZ-Adressierung","extern","Ja","Ja"]
[8492,"Halbenrain","St","PLZ-Adressierung","extern","Ja","Nein"]
[8493,"Klöch","St","PLZ-Adressierung","extern","Ja","Nein"]
[8501,"Lieboch","St","PLZ-Adressierung","extern","Ja","Ja"]
[8502,"Lannach","St","PLZ-Adressierung","extern","Ja","Ja"]
[8503,"St. Josef Weststeiermark","St","PLZ-Adressierung","extern","Ja","Nein"]
[8504,"Preding","St","PLZ-Adressierung","extern","Ja","Ja"]
[8505,"St. Nikolai im Sausal","St","PLZ-Adressierung","extern","Ja","Ja"]
[8510,"Stainz","St","PLZ-Adressierung","extern","Ja","Ja"]
[8511,"St. Stefan ob Stainz","St","PLZ-Adressierung","extern","Ja","Ja"]
[8521,"Wettmannstätten","St","PLZ-Adressierung","extern","Ja","Nein"]
[8522,"Groß St. Florian","St","PLZ-Adressierung","extern","Ja","Ja"]
[8523,"Frauental an der Laßnitz","St","PLZ-Adressierung","extern","Ja","Ja"]
[8524,"Bad Gams","St","PLZ-Adressierung","extern","Ja","Nein"]
[8530,"Deutschlandsberg","St","PLZ-Adressierung","extern","Ja","Ja"]
[8541,"Schwanberg","St","PLZ-Adressierung","extern","Ja","Ja"]
[8542,"St. Peter im Sulmtal","St","PLZ-Adressierung","extern","Ja","Ja"]
[8543,"St. Martin im Sulmtal","St","PLZ-Adressierung","extern","Ja","Nein"]
[8544,"Pölfing-Brunn","St","PLZ-Adressierung","extern","Ja","Nein"]
[8551,"Wies","St","PLZ-Adressierung","extern","Ja","Ja"]
[8552,"Eibiswald","St","PLZ-Adressierung","extern","Ja","Ja"]
[8553,"St. Oswald ob Eibiswald","St","PLZ-Adressierung","extern","Ja","Nein"]
[8554,"Soboth","St","PLZ-Adressierung","extern","Ja","Nein"]
[8561,"Söding","St","PLZ-Adressierung","extern","Ja","Nein"]
[8562,"Mooskirchen","St","PLZ-Adressierung","extern","Ja","Nein"]
[8563,"Ligist","St","PLZ-Adressierung","extern","Ja","Ja"]
[8564,"Krottendorf-Gaisfeld","St","PLZ-Adressierung","extern","Ja","Ja"]
[8565,"St. Johann ob Hohenburg","St","PLZ-Adressierung","extern","Ja","Nein"]
[8570,"Voitsberg","St","PLZ-Adressierung","extern","Ja","Ja"]
[8572,"Bärnbach","St","PLZ-Adressierung","extern","Ja","Ja"]
[8573,"Kainach bei Voitsberg","St","PLZ-Adressierung","extern","Ja","Nein"]
[8580,"Köflach","St","PLZ-Adressierung","extern","Ja","Ja"]
[8582,"Rosental an der Kainach","St","PLZ-Adressierung","extern","Ja","Nein"]
[8583,"Edelschrott","St","PLZ-Adressierung","extern","Ja","Ja"]
[8584,"Hirschegg","St","PLZ-Adressierung","extern","Ja","Nein"]
[8591,"Maria Lankowitz","St","PLZ-Adressierung","extern","Ja","Nein"]
[8592,"Salla","St","PLZ-Adressierung","extern","Ja","Nein"]
[8593,"Graden","St","PLZ-Adressierung","extern","Ja","Nein"]
[8600,"Bruck an der Mur","St","PLZ-Adressierung","extern","Ja","Ja"]
[8601,"Bruck an der Mur","St","PLZ-Postfach","extern","Nein","Ja"]
[8605,"Kapfenberg","St","PLZ-Adressierung","extern","Ja","Ja"]
[8607,"Kapfenberg","St","PLZ-Postfach","extern","Nein","Ja"]
[8611,"St. Katharein an der Laming","St","PLZ-Adressierung","extern","Ja","Ja"]
[8612,"Tragöß-Oberort","St","PLZ-Adressierung","extern","Ja","Nein"]
[8614,"Breitenau","St","PLZ-Adressierung","extern","Ja","Ja"]
[8616,"Gasen","St","PLZ-Adressierung","extern","Ja","Nein"]
[8621,"Thörl","St","PLZ-Adressierung","extern","Ja","Ja"]
[8622,"Etmißl","St","PLZ-Adressierung","extern","Ja","Nein"]
[8623,"Aflenz Kurort","St","PLZ-Adressierung","extern","Ja","Ja"]
[8624,"Au","St","PLZ-Adressierung","extern","Ja","Nein"]
[8625,"Turnau","St","PLZ-Adressierung","extern","Ja","Nein"]
[8630,"Mariazell","St","PLZ-Adressierung","extern","Ja","Ja"]
[8632,"Gußwerk","St","PLZ-Adressierung","extern","Ja","Nein"]
[8634,"Wegscheid","St","PLZ-Adressierung","extern","Ja","Nein"]
[8635,"Gollrad","St","PLZ-Adressierung","extern","Ja","Nein"]
[8636,"Seewiesen","St","PLZ-Adressierung","extern","Ja","Nein"]
[8641,"St. Marein im Mürztal","St","PLZ-Adressierung","extern","Ja","Ja"]
[8642,"St. Lorenzen im Mürztal","St","PLZ-Adressierung","extern","Ja","Nein"]
[8643,"Allerheiligen im Mürztal","St","PLZ-Adressierung","extern","Ja","Ja"]
[8644,"Mürzhofen","St","PLZ-Adressierung","extern","Ja","Nein"]
[8650,"Kindberg","St","PLZ-Adressierung","extern","Ja","Ja"]
[8652,"Kindberg-Aumühl","St","PLZ-Adressierung","extern","Ja","Nein"]
[8653,"Stanz im Mürztal","St","PLZ-Adressierung","extern","Ja","Nein"]
[8654,"Fischbach","St","PLZ-Adressierung","extern","Ja","Nein"]
[8661,"Wartberg im Mürztal","St","PLZ-Adressierung","extern","Ja","Ja"]
[8662,"Mitterdorf im Mürztal","St","PLZ-Adressierung","extern","Ja","Nein"]
[8663,"Dorf Veitsch","St","PLZ-Adressierung","extern","Ja","Ja"]
[8664,"Großveitsch","St","PLZ-Adressierung","extern","Ja","Nein"]
[8665,"Langenwang","St","PLZ-Adressierung","extern","Ja","Ja"]
[8670,"Krieglach","St","PLZ-Adressierung","extern","Ja","Ja"]
[8671,"Alpl","St","PLZ-Adressierung","extern","Ja","Nein"]
[8672,"St. Kathrein am Hauenstein","St","PLZ-Adressierung","extern","Ja","Nein"]
[8673,"Ratten","St","PLZ-Adressierung","extern","Ja","Ja"]
[8674,"Rettenegg","St","PLZ-Adressierung","extern","Ja","Ja"]
[8680,"Mürzzuschlag","St","PLZ-Adressierung","extern","Ja","Ja"]
[8682,"Mürzzuschlag-Hönigsberg","St","PLZ-Adressierung","extern","Ja","Nein"]
[8684,"Spital am Semmering","St","PLZ-Adressierung","extern","Ja","Nein"]
[8685,"Steinhaus am Semmering","St","PLZ-Adressierung","extern","Ja","Nein"]
[8691,"Kapellen","St","PLZ-Adressierung","extern","Ja","Nein"]
[8692,"Neuberg an der Mürz","St","PLZ-Adressierung","extern","Ja","Ja"]
[8693,"Mürzsteg","St","PLZ-Adressierung","extern","Ja","Nein"]
[8694,"Frein an der Mürz","St","PLZ-Adressierung","extern","Ja","Nein"]
[8700,"Leoben","St","PLZ-Adressierung","extern","Ja","Ja"]
[8701,"Leoben","St","PLZ-Postfach","extern","Nein","Ja"]
[8704,"Leoben","St","PLZ-Postfach","extern","Nein","Ja"]
[8707,"Leoben","St","PLZ-Postfach","extern","Nein","Ja"]
[8712,"Niklasdorf","St","PLZ-Adressierung","extern","Ja","Ja"]
[8713,"St. Stefan ob Leoben","St","PLZ-Adressierung","extern","Ja","Ja"]
[8714,"Kraubath an der Mur","St","PLZ-Adressierung","extern","Ja","Ja"]
[8715,"St. Lorenzen bei Knittelfeld","St","PLZ-Adressierung","extern","Ja","Nein"]
[8720,"Knittelfeld","St","PLZ-Adressierung","extern","Ja","Ja"]
[8724,"Spielberg","St","PLZ-Adressierung","extern","Ja","Ja"]
[8731,"Bischoffeld","St","PLZ-Adressierung","extern","Ja","Nein"]
[8732,"Seckau","St","PLZ-Adressierung","extern","Ja","Nein"]
[8733,"St. Marein bei Knittelfeld","St","PLZ-Adressierung","extern","Ja","Nein"]
[8734,"Großlobming","St","PLZ-Adressierung","extern","Ja","Nein"]
[8740,"Zeltweg","St","PLZ-Adressierung","extern","Ja","Ja"]
[8741,"Weißkirchen in Steiermark","St","PLZ-Adressierung","extern","Ja","Ja"]
[8742,"Obdach","St","PLZ-Adressierung","extern","Ja","Ja"]
[8750,"Judenburg","St","PLZ-Adressierung","extern","Ja","Ja"]
[8752,"Fohnsdorf-Arena","St","PLZ-Postfach","extern","Nein","Ja"]
[8753,"Fohnsdorf","St","PLZ-Adressierung","extern","Ja","Ja"]
[8754,"Thalheim","St","PLZ-Adressierung","extern","Ja","Nein"]
[8755,"St. Peter ob Judenburg","St","PLZ-Adressierung","extern","Ja","Nein"]
[8756,"St. Georgen ob Judenburg","St","PLZ-Adressierung","extern","Ja","Nein"]
[8761,"Pöls","St","PLZ-Adressierung","extern","Ja","Ja"]
[8762,"Oberzeiring","St","PLZ-Adressierung","extern","Ja","Ja"]
[8763,"Möderbrugg","St","PLZ-Adressierung","extern","Ja","Ja"]
[8764,"Pusterwald","St","PLZ-Adressierung","extern","Ja","Nein"]
[8765,"St. Johann am Tauern","St","PLZ-Adressierung","extern","Ja","Nein"]
[8770,"St. Michael in Obersteiermark","St","PLZ-Adressierung","extern","Ja","Ja"]
[8772,"Timmersdorf","St","PLZ-Adressierung","extern","Ja","Nein"]
[8773,"Kammern im Liesingtal","St","PLZ-Adressierung","extern","Ja","Ja"]
[8774,"Mautern in Steiermark","St","PLZ-Adressierung","extern","Ja","Nein"]
[8775,"Kalwang","St","PLZ-Adressierung","extern","Ja","Ja"]
[8781,"Wald am Schoberpaß","St","PLZ-Adressierung","extern","Ja","Nein"]
[8782,"Treglwang","St","PLZ-Adressierung","extern","Ja","Nein"]
[8783,"Gaishorn am See","St","PLZ-Adressierung","extern","Ja","Nein"]
[8784,"Trieben","St","PLZ-Adressierung","extern","Ja","Ja"]
[8785,"Hohentauern","St","PLZ-Adressierung","extern","Ja","Nein"]
[8786,"Rottenmann","St","PLZ-Adressierung","extern","Ja","Ja"]
[8790,"Eisenerz","St","PLZ-Adressierung","extern","Ja","Ja"]
[8792,"St. Peter-Freienstein","St","PLZ-Adressierung","extern","Ja","Nein"]
[8793,"Trofaiach","St","PLZ-Adressierung","extern","Ja","Ja"]
[8794,"Vordernberg","St","PLZ-Adressierung","extern","Ja","Nein"]
[8795,"Radmer","St","PLZ-Adressierung","extern","Ja","Nein"]
[8800,"Unzmarkt","St","PLZ-Adressierung","extern","Ja","Ja"]
[8811,"Scheifling","St","PLZ-Adressierung","extern","Ja","Ja"]
[8812,"Mariahof","St","PLZ-Adressierung","extern","Ja","Nein"]
[8813,"St. Lambrecht","St","PLZ-Adressierung","extern","Ja","Nein"]
[8820,"Neumarkt in Steiermark","St","PLZ-Adressierung","extern","Ja","Ja"]
[8822,"Mühlen","St","PLZ-Adressierung","extern","Ja","Nein"]
[8831,"Niederwölz","St","PLZ-Adressierung","extern","Ja","Nein"]
[8832,"Oberwölz","St","PLZ-Adressierung","extern","Ja","Ja"]
[8833,"Teufenbach","St","PLZ-Adressierung","extern","Ja","Nein"]
[8841,"Frojach","St","PLZ-Adressierung","extern","Ja","Nein"]
[8842,"Katsch an der Mur","St","PLZ-Adressierung","extern","Ja","Ja"]
[8843,"St. Peter am Kammersberg","St","PLZ-Adressierung","extern","Ja","Nein"]
[8844,"Schöder","St","PLZ-Adressierung","extern","Ja","Nein"]
[8850,"Murau","St","PLZ-Adressierung","extern","Ja","Ja"]
[8852,"Stolzalpe","St","PLZ-Adressierung","extern","Ja","Nein"]
[8853,"Ranten","St","PLZ-Adressierung","extern","Ja","Nein"]
[8854,"Krakaudorf","St","PLZ-Adressierung","extern","Ja","Nein"]
[8861,"St. Georgen ob Murau","St","PLZ-Adressierung","extern","Ja","Nein"]
[8862,"Stadl an der Mur","St","PLZ-Adressierung","extern","Ja","Ja"]
[8863,"Predlitz","St","PLZ-Adressierung","extern","Ja","Nein"]
[8864,"Turrach","St","PLZ-Adressierung","extern","Ja","Nein"]
[8900,"Selzthal","St","PLZ-Adressierung","extern","Ja","Nein"]
[8903,"Lassing","St","PLZ-Adressierung","extern","Ja","Nein"]
[8904,"Ardning","St","PLZ-Adressierung","extern","Ja","Nein"]
[8911,"Admont","St","PLZ-Adressierung","extern","Ja","Ja"]
[8912,"Johnsbach","St","PLZ-Adressierung","extern","Ja","Nein"]
[8913,"Weng","St","PLZ-Adressierung","extern","Ja","Nein"]
[8920,"Hieflau","St","PLZ-Adressierung","extern","Ja","Ja"]
[8921,"Lainbach","St","PLZ-Adressierung","extern","Ja","Nein"]
[8922,"Gams bei Hieflau","St","PLZ-Adressierung","extern","Ja","Nein"]
[8923,"Palfau","St","PLZ-Adressierung","extern","Ja","Nein"]
[8924,"Wildalpen","St","PLZ-Adressierung","extern","Ja","Nein"]
[8931,"Landl","St","PLZ-Adressierung","extern","Ja","Ja"]
[8932,"Weißenbach an der Enns","St","PLZ-Adressierung","extern","Ja","Nein"]
[8933,"St. Gallen","St","PLZ-Adressierung","extern","Ja","Ja"]
[8934,"Altenmarkt bei St. Gallen","St","PLZ-Adressierung","extern","Ja","Nein"]
[8940,"Liezen","St","PLZ-Adressierung","extern","Ja","Ja"]
[8942,"Wörschach","St","PLZ-Adressierung","extern","Ja","Nein"]
[8943,"Aigen im Ennstal","St","PLZ-Adressierung","extern","Ja","Ja"]
[8950,"Stainach","St","PLZ-Adressierung","extern","Ja","Ja"]
[8951,"Trautenfels","St","PLZ-Adressierung","extern","Ja","Nein"]
[8952,"Irdning","St","PLZ-Adressierung","extern","Ja","Ja"]
[8953,"Donnersbach","St","PLZ-Adressierung","extern","Ja","Nein"]
[8954,"St. Martin am Grimming","St","PLZ-Adressierung","extern","Ja","Nein"]
[8960,"Öblarn","St","PLZ-Adressierung","extern","Ja","Ja"]
[8961,"Stein an der Enns","St","PLZ-Adressierung","extern","Ja","Nein"]
[8962,"Gröbming","St","PLZ-Adressierung","extern","Ja","Ja"]
[8965,"Pruggern","St","PLZ-Adressierung","extern","Ja","Nein"]
[8966,"Aich-Assach","St","PLZ-Adressierung","extern","Ja","Nein"]
[8967,"Haus","St","PLZ-Adressierung","extern","Ja","Ja"]
[8970,"Schladming","St","PLZ-Adressierung","extern","Ja","Ja"]
[8971,"Rohrmoos-Untertal","St","PLZ-Adressierung","extern","Ja","Nein"]
[8972,"Ramsau","St","PLZ-Adressierung","extern","Ja","Ja"]
[8973,"Pichl","St","PLZ-Adressierung","extern","Ja","Nein"]
[8974,"Mandling","St","PLZ-Adressierung","extern","Ja","Nein"]
[8982,"Tauplitz","St","PLZ-Adressierung","extern","Ja","Nein"]
[8983,"Bad Mitterndorf","St","PLZ-Adressierung","extern","Ja","Ja"]
[8984,"Kainisch","St","PLZ-Adressierung","extern","Ja","Nein"]
[8990,"Bad Aussee","St","PLZ-Adressierung","extern","Ja","Ja"]
[8992,"Altaussee","St","PLZ-Adressierung","extern","Ja","Ja"]
[8993,"Grundlsee","St","PLZ-Adressierung","extern","Ja","Nein"]
[9010,"Klagenfurt am Wörthersee","K","PLZ-Postfach","extern","Nein","Ja"]
[9013,"Klagenfurt am Wörthersee","K","PLZ-Postfach","extern","Nein","Ja"]
[9020,"Klagenfurt am Wörthersee","K","PLZ-Adressierung","extern","Ja","Ja"]
[9021,"Klagenfurt am Wörthersee Postfach","K","PLZ-Postfach","extern","Nein","Ja"]
[9022,"Klagenfurt am Wörthersee","K","PLZ-Postfach","extern","Nein","Ja"]
[9023,"Klagenfurt am Wörthersee","K","PLZ-Postfach","extern","Nein","Ja"]
[9024,"Klagenfurt am Wörthersee","K","PLZ-Postfach","extern","Nein","Ja"]
[9025,"Klagenfurt am Wörthersee","K","PLZ-Postfach","extern","Nein","Ja"]
[9026,"Klagenfurt am Wörthersee","K","PLZ-Postfach","extern","Nein","Ja"]
[9027,"Klagenfurt am Wörthersee","K","PLZ-Postfach","extern","Nein","Ja"]
[9028,"Klagenfurt am Wörthersee","K","PLZ-Postfach","extern","Nein","Ja"]
[9029,"Klagenfurt am Wörthersee","K","PLZ-Postfach","extern","Nein","Ja"]
[9061,"Klagenfurt-Wölfnitz","K","PLZ-Adressierung","extern","Ja","Ja"]
[9062,"Moosburg","K","PLZ-Adressierung","extern","Ja","Ja"]
[9063,"Maria Saal","K","PLZ-Adressierung","extern","Ja","Ja"]
[9064,"Pischeldorf","K","PLZ-Adressierung","extern","Ja","Ja"]
[9065,"Ebenthal","K","PLZ-Adressierung","extern","Ja","Ja"]
[9071,"Köttmannsdorf","K","PLZ-Adressierung","extern","Ja","Ja"]
[9072,"Ludmannsdorf","K","PLZ-Adressierung","extern","Ja","Nein"]
[9073,"Klagenfurt-Viktring","K","PLZ-Adressierung","extern","Ja","Ja"]
[9074,"Keutschach","K","PLZ-Adressierung","extern","Ja","Ja"]
[9081,"Reifnitz","K","PLZ-Adressierung","extern","Ja","Ja"]
[9082,"Maria Wörth","K","PLZ-Adressierung","extern","Ja","Nein"]
[9100,"Völkermarkt","K","PLZ-Adressierung","extern","Ja","Ja"]
[9102,"Mittertrixen","K","PLZ-Adressierung","extern","Ja","Nein"]
[9103,"Diex","K","PLZ-Adressierung","extern","Ja","Ja"]
[9104,"Pustritz","K","PLZ-Adressierung","extern","Ja","Nein"]
[9111,"Haimburg","K","PLZ-Adressierung","extern","Ja","Nein"]
[9112,"Griffen","K","PLZ-Adressierung","extern","Ja","Ja"]
[9113,"Ruden","K","PLZ-Adressierung","extern","Ja","Ja"]
[9121,"Tainach","K","PLZ-Adressierung","extern","Ja","Ja"]
[9122,"St. Kanzian am Klopeiner See","K","PLZ-Adressierung","extern","Ja","Ja"]
[9123,"St. Primus","K","PLZ-Adressierung","extern","Ja","Nein"]
[9125,"Kühnsdorf","K","PLZ-Adressierung","extern","Ja","Ja"]
[9130,"Poggersdorf","K","PLZ-Adressierung","extern","Ja","Nein"]
[9131,"Grafenstein","K","PLZ-Adressierung","extern","Ja","Ja"]
[9132,"Gallizien","K","PLZ-Adressierung","extern","Ja","Nein"]
[9133,"Miklauzhof","K","PLZ-Adressierung","extern","Ja","Nein"]
[9135,"Bad Eisenkappel","K","PLZ-Adressierung","extern","Ja","Ja"]
[9141,"Eberndorf","K","PLZ-Adressierung","extern","Ja","Ja"]
[9142,"Globasnitz","K","PLZ-Adressierung","extern","Ja","Ja"]
[9143,"St. Michael ob Bleiburg","K","PLZ-Adressierung","extern","Ja","Nein"]
[9150,"Bleiburg","K","PLZ-Adressierung","extern","Ja","Ja"]
[9155,"Neuhaus","K","PLZ-Adressierung","extern","Ja","Nein"]
[9161,"Maria Rain","K","PLZ-Adressierung","extern","Ja","Ja"]
[9162,"Strau","K","PLZ-Adressierung","extern","Ja","Ja"]
[9163,"Unterbergen","K","PLZ-Adressierung","extern","Ja","Nein"]
[9170,"Ferlach","K","PLZ-Adressierung","extern","Ja","Ja"]
[9173,"St. Margareten im Rosental","K","PLZ-Adressierung","extern","Ja","Nein"]
[9181,"Feistritz im Rosental","K","PLZ-Adressierung","extern","Ja","Ja"]
[9182,"Maria Elend","K","PLZ-Adressierung","extern","Ja","Nein"]
[9183,"Rosenbach","K","PLZ-Adressierung","extern","Ja","Nein"]
[9184,"St. Jakob im Rosental","K","PLZ-Adressierung","extern","Ja","Ja"]
[9201,"Krumpendorf","K","PLZ-Adressierung","extern","Ja","Ja"]
[9210,"Pörtschach am Wörther See","K","PLZ-Adressierung","extern","Ja","Ja"]
[9212,"Techelsberg am Wörther See","K","PLZ-Adressierung","extern","Ja","Nein"]
[9220,"Velden am Wörther See","K","PLZ-Adressierung","extern","Ja","Ja"]
[9231,"Köstenberg","K","PLZ-Adressierung","extern","Ja","Nein"]
[9232,"Rosegg","K","PLZ-Adressierung","extern","Ja","Ja"]
[9241,"Wernberg","K","PLZ-Adressierung","extern","Ja","Ja"]
[9300,"St. Veit an der Glan","K","PLZ-Adressierung","extern","Ja","Ja"]
[9302,"St. Veit an der Glan","K","PLZ-Postfach","extern","Nein","Ja"]
[9311,"Kraig","K","PLZ-Adressierung","extern","Ja","Nein"]
[9312,"Meiselding","K","PLZ-Adressierung","extern","Ja","Nein"]
[9313,"St. Georgen am Längsee","K","PLZ-Adressierung","extern","Ja","Nein"]
[9314,"Launsdorf","K","PLZ-Adressierung","extern","Ja","Ja"]
[9321,"Kappel am Krappfeld","K","PLZ-Adressierung","extern","Ja","Nein"]
[9322,"Micheldorf","K","PLZ-Adressierung","extern","Ja","Nein"]
[9323,"Wildbad Einöd","St","PLZ-Adressierung","extern","Ja","Nein"]
[9330,"Treibach-Althofen","K","PLZ-Adressierung","extern","Ja","Ja"]
[9334,"Guttaring","K","PLZ-Adressierung","extern","Ja","Nein"]
[9335,"Lölling","K","PLZ-Adressierung","extern","Ja","Nein"]
[9341,"Straßburg","K","PLZ-Adressierung","extern","Ja","Ja"]
[9342,"Gurk","K","PLZ-Adressierung","extern","Ja","Nein"]
[9343,"Zweinitz","K","PLZ-Adressierung","extern","Ja","Nein"]
[9344,"Weitensfeld","K","PLZ-Adressierung","extern","Ja","Ja"]
[9345,"Kleinglödnitz","K","PLZ-Adressierung","extern","Ja","Nein"]
[9346,"Glödnitz","K","PLZ-Adressierung","extern","Ja","Nein"]
[9360,"Friesach","K","PLZ-Adressierung","extern","Ja","Ja"]
[9361,"St. Salvator","K","PLZ-Adressierung","extern","Ja","Nein"]
[9362,"Grades","K","PLZ-Adressierung","extern","Ja","Nein"]
[9363,"Metnitz","K","PLZ-Adressierung","extern","Ja","Ja"]
[9371,"Brückl","K","PLZ-Adressierung","extern","Ja","Ja"]
[9372,"Eberstein","K","PLZ-Adressierung","extern","Ja","Nein"]
[9373,"Klein St. Paul","K","PLZ-Adressierung","extern","Ja","Ja"]
[9374,"Wieting","K","PLZ-Adressierung","extern","Ja","Nein"]
[9375,"Hüttenberg","K","PLZ-Adressierung","extern","Ja","Ja"]
[9376,"Knappenberg","K","PLZ-Adressierung","extern","Ja","Nein"]
[9400,"Wolfsberg","K","PLZ-Adressierung","extern","Ja","Ja"]
[9402,"Wolfsberg, Kärnten","K","PLZ-Postfach","extern","Nein","Ja"]
[9411,"St. Michael","K","PLZ-Adressierung","extern","Ja","Nein"]
[9412,"St. Margarethen im Lavanttal","K","PLZ-Adressierung","extern","Ja","Nein"]
[9413,"St. Gertraud","K","PLZ-Adressierung","extern","Ja","Nein"]
[9421,"Eitweg","K","PLZ-Adressierung","extern","Ja","Ja"]
[9422,"Maria Rojach","K","PLZ-Adressierung","extern","Ja","Nein"]
[9423,"St. Georgen","K","PLZ-Adressierung","extern","Ja","Nein"]
[9431,"St. Stefan","K","PLZ-Adressierung","extern","Ja","Ja"]
[9433,"St. Andrä","K","PLZ-Adressierung","extern","Ja","Ja"]
[9441,"Twimberg","K","PLZ-Adressierung","extern","Ja","Nein"]
[9451,"Preitenegg","K","PLZ-Adressierung","extern","Ja","Nein"]
[9461,"Prebl","K","PLZ-Adressierung","extern","Ja","Nein"]
[9462,"Bad St. Leonhard im Lavanttal","K","PLZ-Adressierung","extern","Ja","Ja"]
[9463,"Reichenfels","K","PLZ-Adressierung","extern","Ja","Nein"]
[9470,"St. Paul im Lavanttal","K","PLZ-Adressierung","extern","Ja","Ja"]
[9472,"Ettendorf","K","PLZ-Adressierung","extern","Ja","Nein"]
[9473,"Lavamünd","K","PLZ-Adressierung","extern","Ja","Ja"]
[9500,"Villach","K","PLZ-Adressierung","extern","Ja","Ja"]
[9501,"Villach","K","PLZ-Postfach","extern","Nein","Ja"]
[9503,"Villach","K","PLZ-Postfach","extern","Nein","Ja"]
[9504,"Villach-Warmbad Villach","K","PLZ-Adressierung","extern","Ja","Nein"]
[9505,"Villach","K","PLZ-Postfach","extern","Nein","Ja"]
[9506,"Villach","K","PLZ-Postfach","extern","Nein","Ja"]
[9507,"Villach","K","PLZ-Postfach","extern","Nein","Ja"]
[9508,"Villach","K","PLZ-Postfach","extern","Nein","Ja"]
[9520,"Sattendorf","K","PLZ-Adressierung","extern","Ja","Nein"]
[9521,"Treffen","K","PLZ-Adressierung","extern","Ja","Ja"]
[9523,"Villach-Landskron","K","PLZ-Adressierung","extern","Ja","Ja"]
[9524,"Villach-St. Magdalen","K","PLZ-Adressierung","extern","Ja","Ja"]
[9530,"Bad Bleiberg","K","PLZ-Adressierung","extern","Ja","Ja"]
[9531,"Kreuth","K","PLZ-Adressierung","extern","Ja","Nein"]
[9535,"Schiefling","K","PLZ-Adressierung","extern","Ja","Ja"]
[9536,"St. Egyden","K","PLZ-Adressierung","extern","Ja","Nein"]
[9541,"Einöde","K","PLZ-Adressierung","extern","Ja","Nein"]
[9542,"Afritz","K","PLZ-Adressierung","extern","Ja","Ja"]
[9543,"Arriach","K","PLZ-Adressierung","extern","Ja","Nein"]
[9544,"Feld am See","K","PLZ-Adressierung","extern","Ja","Nein"]
[9545,"Radenthein","K","PLZ-Adressierung","extern","Ja","Ja"]
[9546,"Bad Kleinkirchheim","K","PLZ-Adressierung","extern","Ja","Ja"]
[9551,"Bodensdorf","K","PLZ-Adressierung","extern","Ja","Ja"]
[9552,"Steindorf am Ossiacher See","K","PLZ-Adressierung","extern","Ja","Nein"]
[9554,"St. Urban","K","PLZ-Adressierung","extern","Ja","Nein"]
[9555,"Glanegg","K","PLZ-Adressierung","extern","Ja","Ja"]
[9556,"Liebenfels","K","PLZ-Adressierung","extern","Ja","Ja"]
[9560,"Feldkirchen in Kärnten","K","PLZ-Adressierung","extern","Ja","Ja"]
[9562,"Himmelberg","K","PLZ-Adressierung","extern","Ja","Nein"]
[9563,"Gnesau","K","PLZ-Adressierung","extern","Ja","Nein"]
[9564,"Patergassen","K","PLZ-Adressierung","extern","Ja","Ja"]
[9565,"Ebene Reichenau","K","PLZ-Adressierung","extern","Ja","Nein"]
[9570,"Ossiach","K","PLZ-Adressierung","extern","Ja","Nein"]
[9571,"Sirnitz","K","PLZ-Adressierung","extern","Ja","Ja"]
[9572,"Deutsch Griffen","K","PLZ-Adressierung","extern","Ja","Nein"]
[9580,"Villach-Drobollach am Faaker See","K","PLZ-Adressierung","extern","Ja","Ja"]
[9581,"Ledenitzen","K","PLZ-Adressierung","extern","Ja","Ja"]
[9582,"Latschach","K","PLZ-Adressierung","extern","Ja","Nein"]
[9583,"Faak am See","K","PLZ-Adressierung","extern","Ja","Nein"]
[9584,"Finkenstein","K","PLZ-Adressierung","extern","Ja","Nein"]
[9585,"Gödersdorf","K","PLZ-Adressierung","extern","Ja","Nein"]
[9586,"Fürnitz","K","PLZ-Adressierung","extern","Ja","Ja"]
[9587,"Riegersdorf","K","PLZ-Adressierung","extern","Ja","Ja"]
[9601,"Arnoldstein","K","PLZ-Adressierung","extern","Ja","Ja"]
[9602,"Thörl-Maglern","K","PLZ-Adressierung","extern","Ja","Ja"]
[9611,"Nötsch","K","PLZ-Adressierung","extern","Ja","Ja"]
[9612,"St. Georgen im Gailtal","K","PLZ-Adressierung","extern","Ja","Nein"]
[9613,"Feistritz an der Gail","K","PLZ-Adressierung","extern","Ja","Nein"]
[9614,"Vorderberg","K","PLZ-Adressierung","extern","Ja","Nein"]
[9615,"Görtschach","K","PLZ-Adressierung","extern","Ja","Nein"]
[9620,"Hermagor","K","PLZ-Adressierung","extern","Ja","Ja"]
[9622,"Weißbriach","K","PLZ-Adressierung","extern","Ja","Nein"]
[9623,"St. Stefan an der Gail","K","PLZ-Adressierung","extern","Ja","Ja"]
[9624,"Egg","K","PLZ-Adressierung","extern","Ja","Nein"]
[9631,"Jenig","K","PLZ-Adressierung","extern","Ja","Nein"]
[9632,"Kirchbach","K","PLZ-Adressierung","extern","Ja","Ja"]
[9633,"Reisach","K","PLZ-Adressierung","extern","Ja","Nein"]
[9634,"Gundersheim","K","PLZ-Adressierung","extern","Ja","Nein"]
[9635,"Dellach","K","PLZ-Adressierung","extern","Ja","Nein"]
[9640,"Kötschach-Mauthen","K","PLZ-Adressierung","extern","Ja","Ja"]
[9651,"St. Jakob im Lesachtal","K","PLZ-Adressierung","extern","Ja","Nein"]
[9652,"Birnbaum","K","PLZ-Adressierung","extern","Ja","Nein"]
[9653,"Liesing","K","PLZ-Adressierung","extern","Ja","Nein"]
[9654,"St. Lorenzen im Lesachtal","K","PLZ-Adressierung","extern","Ja","Ja"]
[9655,"Maria Luggau","K","PLZ-Adressierung","extern","Ja","Nein"]
[9701,"Rothenthurn","K","PLZ-Adressierung","extern","Ja","Nein"]
[9702,"Ferndorf","K","PLZ-Adressierung","extern","Ja","Ja"]
[9710,"Feistritz an der Drau","K","PLZ-Adressierung","extern","Ja","Ja"]
[9711,"Paternion","K","PLZ-Adressierung","extern","Ja","Nein"]
[9712,"Fresach","K","PLZ-Adressierung","extern","Ja","Nein"]
[9713,"Zlan","K","PLZ-Adressierung","extern","Ja","Ja"]
[9714,"Stockenboi","K","PLZ-Adressierung","extern","Ja","Nein"]
[9721,"Weißenstein","K","PLZ-Adressierung","extern","Ja","Ja"]
[9722,"Gummern","K","PLZ-Adressierung","extern","Ja","Nein"]
[9751,"Sachsenburg","K","PLZ-Adressierung","extern","Ja","Nein"]
[9753,"Lind im Drautal","K","PLZ-Adressierung","extern","Ja","Nein"]
[9754,"Steinfeld","K","PLZ-Adressierung","extern","Ja","Ja"]
[9761,"Greifenburg","K","PLZ-Adressierung","extern","Ja","Ja"]
[9762,"Weißensee","K","PLZ-Adressierung","extern","Ja","Ja"]
[9771,"Berg im Drautal","K","PLZ-Adressierung","extern","Ja","Nein"]
[9772,"Dellach","K","PLZ-Adressierung","extern","Ja","Ja"]
[9773,"Irschen","K","PLZ-Adressierung","extern","Ja","Nein"]
[9781,"Oberdrauburg","K","PLZ-Adressierung","extern","Ja","Ja"]
[9782,"Nikolsdorf","T","PLZ-Adressierung","extern","Ja","Nein"]
[9800,"Spittal an der Drau","K","PLZ-Adressierung","extern","Ja","Ja"]
[9802,"Spittal an der Drau","K","PLZ-Postfach","extern","Nein","Ja"]
[9803,"Spittal an der Drau","K","PLZ-Postfach","extern","Nein","Ja"]
[9805,"Baldramsdorf","K","PLZ-Adressierung","extern","Ja","Nein"]
[9811,"Lendorf","K","PLZ-Adressierung","extern","Ja","Nein"]
[9812,"Pusarnitz","K","PLZ-Adressierung","extern","Ja","Nein"]
[9813,"Möllbrücke","K","PLZ-Adressierung","extern","Ja","Ja"]
[9814,"Mühldorf","K","PLZ-Adressierung","extern","Ja","Nein"]
[9815,"Kolbnitz","K","PLZ-Adressierung","extern","Ja","Ja"]
[9816,"Penk","K","PLZ-Adressierung","extern","Ja","Nein"]
[9821,"Obervellach","K","PLZ-Adressierung","extern","Ja","Ja"]
[9822,"Mallnitz","K","PLZ-Adressierung","extern","Ja","Nein"]
[9831,"Flattach","K","PLZ-Adressierung","extern","Ja","Nein"]
[9832,"Stall","K","PLZ-Adressierung","extern","Ja","Ja"]
[9833,"Rangersdorf","K","PLZ-Adressierung","extern","Ja","Nein"]
[9841,"Winklern","K","PLZ-Adressierung","extern","Ja","Ja"]
[9842,"Mörtschach","K","PLZ-Adressierung","extern","Ja","Nein"]
[9843,"Großkirchheim","K","PLZ-Adressierung","extern","Ja","Ja"]
[9844,"Heiligenblut","K","PLZ-Adressierung","extern","Ja","Nein"]
[9851,"Lieserbrücke","K","PLZ-Adressierung","extern","Ja","Nein"]
[9852,"Trebesing","K","PLZ-Adressierung","extern","Ja","Nein"]
[9853,"Gmünd","K","PLZ-Adressierung","extern","Ja","Ja"]
[9854,"Malta","K","PLZ-Adressierung","extern","Ja","Nein"]
[9861,"Eisentratten","K","PLZ-Adressierung","extern","Ja","Nein"]
[9862,"Kremsbrücke","K","PLZ-Adressierung","extern","Ja","Nein"]
[9863,"Rennweg","K","PLZ-Adressierung","extern","Ja","Ja"]
[9871,"Seeboden","K","PLZ-Adressierung","extern","Ja","Ja"]
[9872,"Millstatt","K","PLZ-Adressierung","extern","Ja","Ja"]
[9873,"Döbriach","K","PLZ-Adressierung","extern","Ja","Nein"]
[9900,"Lienz","T","PLZ-Adressierung","extern","Ja","Ja"]
[9904,"Thurn","T","PLZ-Adressierung","extern","Ja","Nein"]
[9911,"Assling","T","PLZ-Adressierung","extern","Ja","Ja"]
[9912,"Anras","T","PLZ-Adressierung","extern","Ja","Nein"]
[9913,"Abfaltersbach","T","PLZ-Adressierung","extern","Ja","Ja"]
[9920,"Sillian","T","PLZ-Adressierung","extern","Ja","Ja"]
[9931,"Außervillgraten","T","PLZ-Adressierung","extern","Ja","Nein"]
[9932,"Innervillgraten","T","PLZ-Adressierung","extern","Ja","Ja"]
[9941,"Kartitsch","T","PLZ-Adressierung","extern","Ja","Ja"]
[9942,"Obertilliach","T","PLZ-Adressierung","extern","Ja","Nein"]
[9943,"Untertilliach","T","PLZ-Adressierung","extern","Ja","Nein"]
[9951,"Ainet","T","PLZ-Adressierung","extern","Ja","Ja"]
[9953,"Huben","T","PLZ-Historisch","intern","Nein","Nein"]
[9954,"Schlaiten","T","PLZ-Adressierung","extern","Ja","Nein"]
[9961,"Hopfgarten in Defereggen","T","PLZ-Adressierung","extern","Ja","Nein"]
[9962,"St. Veit in Defereggen","T","PLZ-Adressierung","extern","Ja","Nein"]
[9963,"St. Jakob in Defereggen","T","PLZ-Adressierung","extern","Ja","Ja"]
[9971,"Matrei in Osttirol","T","PLZ-Adressierung","extern","Ja","Ja"]
[9972,"Virgen","T","PLZ-Adressierung","extern","Ja","Nein"]
[9974,"Prägraten","T","PLZ-Adressierung","extern","Ja","Nein"]
[9981,"Kals","T","PLZ-Adressierung","extern","Ja","Ja"]
[9990,"Nußdorf-Debant","T","PLZ-Adressierung","extern","Ja","Ja"]
[9991,"Dölsach","T","PLZ-Adressierung","extern","Ja","Nein"]

{"sheet":"Strompreis","index":8,"n_rows":126,"n_cols":87,"rows_kept":126,"cut":false,"hidden":true,"merged":[[0,4,0,20]]}
["Strompreisentwicklung am 17.03.09 ",null,null,null,"http://www.e-control.at/portal/page/portal/ECONTROL_HOME/STROM/STROMPREISE/ENDVERBRAUCHERPREISE"]
[]
[null,null,null,null,null,null,null,null,null,null,null,null,null,null,null,null,"Ökostrompreisentwicklung ( für Erzeuger) gemäß energie-Control vom 17.03.09"]
[]
[]
[]
[]
[]
[]
[]
[]
[]
[]
[]
[]
[]
[]
[]
[]
[]
[]
[]
[]
[]
[]
[]
[]
[]
[]
[]
[]
[]
[]
[]
["Abgerufen am 17.03.09 von http://www.oekostrom.at/default.asp?id=60837&tt=OEKOAG_R8&hl=3"]
["Der oekostrom®-Preis beträgt brutto 21,5 ct/kWh mit Preisgarantie bis 31.12.2010 und ist österreichweit einheitlich."]
["Für geschaltete Leistungen – Wärmepumpen, Warmwasserboiler, Nachtstrom – bieten wir unseren günstigen Tarif oekostrom®-click zu brutto 15,5, ct/kWh mit Preisgarantie bis 31.12.2010"]
[]
[null,"Jan. 02","2002-02-01","Mar.02","2002-04-01","May 02","2002-06-01","2002-07-01","2002-08-01","2002-09-01","Oct.02","2002-11-01","Dec.02","Jan. 03","2003-02-01","Mar.03","2003-04-01","May 03","2003-06-01","2003-07-01","2003-08-01","2003-09-01","Oct.03","2003-11-01","Dec.03","Jan. 04","2004-02-01","Mar.04","2004-04-01","May 04","2004-06-01","2004-07-01","2004-08-01","2004-09-01","Oct.04","2004-11-01","Dec. 04","Jan. 05","2005-02-01","Mar. 05","2005-04-01","May 05","June 05","July 05","2005-08-01","2005-09-01","Oct. 05","2005-11-01","Dec. 05","Jan 06","2006-02-01","Mar. 06","2006-04-01","May 06","2006-06-01","2006-07-01","2006-08-01","2006-09-01","Oct. 06","2006-11-01","Dec. 06","Jan. 07","2007-02-01","Mar. 07","2007-04-01","May  07","June 07","July 07","2007-08-01","2007-09-01","Oct. 07","2007-11-01","2007-12-01","Jan. 08","2008-02-01","March 08","2008-04-01","2008-05-01","2008-06-01","2008-07-01","2008-08-01","2008-09-01","2008-10-01","2008-11-01","2008-12-01","Jan. 09","2009-02-01"]
[null,"2002-01-01","2002-02-01","2002-03-01","2002-04-01","2002-05-01","2002-06-01","2002-07-01","2002-08-01","2002-09-01","2002-10-01","2002-11-01","2002-12-01","2003-01-01","2003-02-01","2003-03-01","2003-04-01","2003-05-01","2003-06-01","2003-07-01","2003-08-01","2003-09-01","2003-10-01","2003-11-01","2003-12-01","2004-01-01","2004-02-01","2004-03-01","2004-04-01","2004-05-01","2004-06-01","2004-07-01","2004-08-01","2004-09-01","2004-10-01","2004-11-01","2004-12-01","2005-01-01","2005-02-01","2005-03-01","2005-04-01","2005-05-01","2005-06-01","2005-07-01","2005-08-01","2005-09-01","2005-10-01","2005-11-01","2005-12-01","2006-01-01","2006-02-01","2006-03-01","2006-04-01","2006-05-01","2006-06-01","2006-07-01","2006-08-01","2006-09-01","2006-10-01","2006-11-01","2006-12-01","Jan 07","2007-02-01","2007-03-01","2007-04-01","2007-05-01","2007-06-01","2007-07-01","2007-08-01","2007-09-01","Oct. 07","2007-11-01","2007-12-01","Jan. 08","2008-02-01","2008-03-01","2008-04-01","2008-05-01","2008-06-01","2008-07-01","2008-08-01","2008-09-01","2008-10-01","2008-11-01","Dec. 08","Jan. 09","2009-02-01"]
["Stromnetz Steiermark GmbH",16.241714285714288,16.241714285714288,16.241714285714288,16.242171428571428,16.242171428571428,16.24182857142857,16.24182857142857,16.24182857142857,16.24182857142857,16.413257142857141,16.413257142857141,16.413257142857141,16.570971428571426,16.515085714285714,16.515085714285714,16.515085714285714,16.391657142857145,16.391657142857145,16.391657142857145,16.391657142857145,16.391657142857145,16.391657142857145,16.391657142857145,16.391657142857145,16.385828571428572,16.385828571428572,16.385828571428572,16.505485714285715,16.505485714285715,16.505485714285715,16.505485714285715,16.505485714285715,16.50582857142857,16.50582857142857,16.50582857142857,16.50582857142857,16.50582857142857,16.50582857142857,16.521257142857145,16.521257142857145,16.521257142857145,15.2508571428571,15.627428571428572,15.627428571428572,15.627428571428572,15.627428571428572,15.627428571428601,15.627428571428601,15.293428571428571,15.807771428571426,15.807771428571426,15.807771428571426,15.807771428571426,15.807771428571426,15.783428571428571,15.783428571428571,15.783428571428571,15.783428571428599,15.783428571428599,15.783428571428701,16.995999999999999,16.995999999999999,16.995999999999999,16.995999999999999,16.995999999999999,16.995999999999999,17,17,17,17,17,16.55,16.940000000000001,16.940000000000001,16.940000000000001,16.940000000000001,16.940000000000001,17.66,17.66,17.66,17.66,17.66,17.559999999999999,17.559999999999999,17.149999999999999,16.420000000000002]
["Energie AG",16.277142857142859,16.277142857142859,16.381142857142859,16.381028571428573,15.712800000000003,15.712800000000003,15.712800000000003,15.712800000000003,15.712800000000003,15.712800000000003,15.712800000000003,15.712800000000003,16.087542857142857,16.029600000000002,16.029600000000002,16.029600000000002,16.029600000000002,16.029600000000002,16.029600000000002,16.029600000000002,16.029600000000002,16.029600000000002,15.526285714285713,15.526285714285713,15.852000000000002,15.852000000000002,15.852000000000002,15.971657142857143,15.971657142857143,15.971657142857143,15.971657142857143,15.971657142857143,15.972,15.972,15.972,15.972,15.972,15.972,15.98742857142857,15.98742857142857,15.987428571428573,15.0394285714285,15.415885714285716,15.415885714285716,15.415885714285716,15.415885714285716,15.4158857142857,15.4158857142857,15.225714285714284,15.739885714285712,15.739885714285712,15.739885714285712,15.739885714285712,15.739885714285712,15.696,15.696,15.696,15.696,15.696,15.696,16.68542857142857,16.68542857142857,16.68542857142857,16.68542857142857,16.68542857142857,16.68542857142857,16.690000000000001,16.690000000000001,16.690000000000001,16.690000000000001,16.690000000000001,16.239999999999998,16.61,16.61,16.61,16.61,16.61,17.329999999999998,17.329999999999998,17.329999999999998,17.329999999999998,17.329999999999998,17.23,17.23,17.149999999999999,16.45]
["Salzburg AG",15.751714285714284,15.751714285714284,15.741142857142858,15.741257142857142,15.741257142857142,15.521485714285717,15.521485714285717,15.521485714285717,15.418285714285714,15.418285714285714,15.418285714285714,15.418285714285714,15.285257142857141,15.285257142857141,15.567428571428572,15.79337142857143,15.79337142857143,15.79337142857143,15.79337142857143,15.79337142857143,15.79337142857143,15.79337142857143,15.35417142857143,15.35417142857143,15.679885714285716,15.679885714285716,15.679885714285716,15.799542857142859,15.799542857142859,15.799542857142859,15.799542857142859,15.799542857142859,15.799885714285713,15.799885714285713,15.799885714285713,15.799885714285713,15.799885714285713,15.078171428571428,15.078171428571428,15.078171428571428,15.078171428571432,15.078171428571432,15.454628571428572,15.454628571428572,15.454628571428572,15.454628571428572,15.4546285714286,15.4546285714286,15.097142857142856,15.611314285714284,15.611314285714284,15.611314285714284,15.611314285714284,15.611314285714284,15.553714285714285,15.553714285714285,15.553714285714285,15.5537142857143,15.5537142857143,15.5537142857143,16.483428571428572,16.483428571428572,16.483428571428572,16.483428571428572,16.483428571428572,16.483428571428572,16.48,16.48,16.48,16.48,16.48,16.04,16.41,16.41,16.41,16.41,16.41,17.13,17.13,17.13,17.13,17.13,17.03,17.03,16.91,16.16]
["KELAG Netz",14.736857142857142,14.736857142857142,14.736857142857142,14.736685714285715,14.736685714285715,14.736685714285715,14.736685714285715,14.736685714285715,14.736685714285715,14.736685714285715,14.736685714285715,14.736685714285715,15.40217142857143,15.344228571428571,15.344228571428571,15.344228571428571,15.344228571428571,15.344228571428571,15.344228571428571,15.344228571428571,15.344228571428571,15.344228571428571,15.34937142857143,15.34937142857143,15.91954285714286,15.91954285714286,15.91954285714286,16.039200000000001,16.039200000000001,16.039200000000001,16.039200000000001,16.030285714285714,16.030628571428576,15.489942857142857,15.727885714285717,15.727885714285717,15.727885714285717,15.5214,15.215314285714287,15.256114285714288,15.256114285714288,15.256114285714288,15.125142857142857,15.125142857142857,15.125142857142857,15.125142857142857,15.125142857142899,15.125142857142899,15.003428571428572,15.517714285714286,15.517714285714286,15.517714285714286,15.517714285714286,15.517714285714286,15.476914285714287,15.476914285714287,15.476914285714287,15.476914285714299,15.476914285714299,15.476914285714299,16.722857142857141,16.722857142857141,16.722857142857141,16.722857142857141,16.722857142857141,16.722857142857141,16.72,16.72,16.72,16.72,16.72,16.28,16.739999999999998,16.739999999999998,16.739999999999998,16.739999999999998,16.739999999999998,17.46,17.46,17.46,17.46,17.46,17.350000000000001,17.350000000000001,17.46,16.7]
["BEWAG",17.002285714285716,17.002285714285716,17.002285714285716,15.988114285714287,15.988114285714287,15.988114285714287,15.988114285714287,16.333714285714283,16.333714285714283,16.333714285714283,16.333714285714283,16.333714285714283,16.576457142857144,16.518514285714286,16.518514285714286,16.518514285714286,16.518514285714286,16.518514285714286,16.518514285714286,16.518514285714286,16.518514285714286,16.518514285714286,15.919885714285716,15.919885714285716,16.434857142857144,16.434857142857144,16.434857142857144,16.554514285714287,16.554514285714287,16.554514285714287,16.554514285714287,16.554514285714287,16.554857142857141,16.554857142857141,16.554857142857141,16.554857142857141,16.554857142857141,14.692457142857142,14.692457142857142,14.692457142857142,14.692457142857142,14.692457142857142,15.068914285714287,15.068914285714287,15.068914285714287,15.068914285714287,15.0689142857143,15.0689142857143,14.731999999999999,15.246514285714284,15.246514285714284,15.246514285714284,15.246514285714284,15.246514285714284,15.135771428571427,15.135771428571427,15.135771428571427,15.135771428571401,15.135771428571401,15.135771428571299,16.192571428571426,16.192571428571426,16.192571428571426,16.192571428571426,16.192571428571426,16.192571428571426,16.190000000000001,16.190000000000001,16.190000000000001,16.190000000000001,16.190000000000001,15.75,16.14,16.14,16.14,16.14,16.14,16.86,16.86,16.86,16.86,16.86,16.86,16.940000000000001,16.850000000000001,16.850000000000001]
["Linz Strom",15.44,15.543714285714286,15.543714285714286,15.54377142857143,14.705142857142855,14.705142857142855,14.705142857142855,14.705142857142855,14.705142857142855,14.705142857142855,14.705142857142855,14.705142857142855,15.079885714285716,15.021942857142857,15.021942857142857,15.021942857142857,15.021942857142857,15.021942857142857,15.021942857142857,15.021942857142857,15.021942857142857,15.021942857142857,14.771314285714285,14.771314285714285,15.179314285714284,15.179314285714284,15.179314285714284,15.298971428571431,15.298971428571431,15.298971428571431,15.298971428571431,15.298971428571431,15.299314285714285,15.299314285714285,15.299314285714285,15.299314285714285,15.299314285714285,15.299314285714285,15.314742857142859,15.314742857142859,15.314742857142855,14.376571428571401,14.753142857142857,14.753142857142857,14.753142857142857,14.753142857142857,14.753142857142899,14.753142857142899,14.407999999999999,15.016114285714288,15.016114285714288,15.016114285714288,15.016114285714288,15.016114285714288,14.996571428571432,14.996571428571432,14.996571428571432,14.9965714285714,14.9965714285714,14.996571428571301,16.126000000000001,16.126000000000001,16.126000000000001,16.126000000000001,16.126000000000001,16.126000000000001,16.13,16.13,16.13,16.13,16.13,15.68,15.92,15.92,15.92,15.92,15.92,16.64,16.64,16.64,16.64,16.64,16.54,16.54,16.29,15.51]
["VKW",12.881428571428572,12.881428571428572,12.881714285714287,12.881828571428573,12.881828571428573,12.881828571428573,12.768000000000001,12.768000000000001,12.804342857142855,12.804342857142855,12.804342857142855,12.804342857142855,13.214057142857142,13.104685714285713,13.104685714285713,13.104685714285713,13.104685714285713,13.104685714285713,13.104685714285713,13.104685714285713,13.104685714285713,13.104685714285713,13.120114285714285,13.120114285714285,13.74,13.74,13.74,13.859657142857142,13.859657142857142,13.859657142857142,13.859657142857142,13.859657142857142,13.86,13.86,13.86,13.86,13.86,13.86,13.875428571428571,13.394400000000001,13.394400000000001,13.394400000000001,13.469828571428572,13.469828571428572,13.469828571428572,13.469828571428572,13.4698285714286,13.4698285714286,14.196,14.710285714285714,14.710285714285714,14.710285714285714,14.710285714285714,14.710285714285714,14.684228571428575,14.684228571428575,14.684228571428575,14.6842285714286,14.6842285714286,14.6842285714286,16.033714285714286,16.033714285714286,16.033714285714286,16.033714285714286,16.033714285714286,16.033714285714286,16.03,16.03,16.03,16.03,16.03,15.59,16.02,16.02,16.02,16.02,16.02,16.739999999999998,16.739999999999998,16.739999999999998,16.739999999999998,16.739999999999998,16.64,16.64,16.71,15.92]
["EVN",14.325428571428571,14.325428571428571,14.325714285714286,14.3256,14.3256,13.985828571428572,13.985828571428572,13.985828571428572,14.069828571428571,14.069828571428571,14.069828571428571,14.069828571428571,14.516571428571428,14.458628571428571,14.458628571428571,14.458628571428571,14.458628571428571,14.458628571428571,14.458628571428571,14.458628571428571,14.458628571428571,14.458628571428571,14.042057142857146,14.042057142857146,14.36777142857143,14.36777142857143,14.36777142857143,14.487428571428572,14.487428571428572,14.487428571428572,14.487428571428572,14.487428571428572,14.487771428571429,14.487771428571429,14.487771428571429,14.487771428571429,14.487771428571429,14.487771428571429,14.5032,13.947771428571428,13.947771428571428,13.947771428571428,14.32422857142857,14.32422857142857,14.32422857142857,14.32422857142857,14.3242285714286,14.3242285714286,14.154857142857143,14.790514285714286,14.790514285714286,14.790514285714286,14.790514285714286,14.790514285714286,14.73942857142857,14.73942857142857,14.73942857142857,14.739428571428601,14.739428571428601,14.7394285714287,15.859142857142858,15.859142857142858,15.859142857142858,15.859142857142858,15.859142857142858,15.859142857142858,15.86,15.86,15.86,15.86,15.86,15.41,15.8,15.8,15.8,15.8,15.8,16.52,16.52,16.52,16.52,16.52,16.600000000000001,16.690000000000001,16.75,16.75]
["Wien Energie Stromnetz GmbH",14.756571428571428,14.756571428571428,14.756571428571428,14.091085714285715,14.091085714285715,14.091085714285715,14.091085714285715,14.091085714285715,14.090742857142859,14.090742857142859,14.090742857142859,14.090742857142859,13.763657142857145,13.705714285714285,13.705714285714285,13.705714285714285,13.705714285714285,13.705714285714285,13.705714285714285,13.705714285714285,13.705714285714285,13.705714285714285,13.377600000000001,13.377600000000001,13.703314285714288,13.703314285714288,13.703314285714288,13.822971428571432,13.822971428571432,13.822971428571432,13.822971428571432,13.822971428571432,13.823314285714286,13.823314285714286,13.823314285714286,13.823314285714286,13.823314285714286,13.823314285714286,13.838742857142856,13.337485714285714,13.337485714285714,13.337485714285714,13.713942857142856,13.713942857142856,13.713942857142856,13.713942857142856,13.7139428571429,13.7139428571429,13.675714285714285,14.189828571428572,14.189828571428572,14.189828571428572,14.189828571428572,14.189828571428572,14.12777142857143,14.12777142857143,14.12777142857143,14.1277714285714,14.1277714285714,14.1277714285713,15.321142857142858,15.321142857142858,15.321142857142858,15.321142857142858,15.321142857142858,15.321142857142858,15.32,15.32,15.32,15.32,15.32,14.89,15.5,15.5,15.5,15.5,15.5,16.22,16.22,16.22,16.22,16.22,16.3,16.3,16.399999999999999,16.579999999999998]
["Stromnetz Graz GmbH & Co KG",14.264857142857142,14.264857142857142,14.264857142857142,14.265257142857143,14.265257142857143,14.265257142857143,14.265257142857143,14.265257142857143,14.265257142857143,14.436685714285714,14.436685714285714,14.436685714285714,14.596457142857142,14.538514285714285,14.538514285714285,14.538514285714285,14.538514285714285,14.538514285714285,14.538514285714285,14.538514285714285,14.538514285714285,14.538514285714285,14.538514285714285,14.538514285714285,14.113714285714286,14.113714285714286,14.113714285714286,14.233371428571429,14.233371428571429,14.233371428571429,14.233371428571429,14.233371428571429,14.233714285714285,14.233714285714285,14.233714285714285,14.233714285714285,14.233714285714285,14.233714285714285,14.249142857142857,14.249142857142857,14.249142857142857,13.3762857142857,13.752685714285715,13.752685714285715,13.752685714285715,13.752685714285715,13.7526857142857,13.7526857142857,13.483428571428572,13.99782857142857,13.99782857142857,13.99782857142857,13.99782857142857,13.99782857142857,13.961828571428571,13.961828571428571,13.961828571428571,13.961828571428599,13.961828571428599,13.9618285714287,15.061428571428571,15.061428571428571,15.061428571428571,15.061428571428571,15.061428571428571,15.061428571428571,15.06,15.06,15.06,15.06,15.06,14.62,14.93,14.93,14.93,14.93,14.93,15.65,15.65,15.65,15.65,15.65,15.55,15.55,15.49,14.83]
["Tiwag",12.683714285714286,12.683714285714286,12.683714285714286,12.683657142857143,12.683657142857143,12.683657142857143,12.683657142857143,12.683657142857143,12.683657142857143,12.57737142857143,12.57737142857143,12.57737142857143,13.132114285714286,13.074171428571429,13.074171428571429,13.074171428571429,13.074171428571429,13.074171428571429,13.074171428571429,13.074171428571429,13.074171428571429,13.074171428571429,12.457714285714285,12.457714285714285,13.770857142857144,13.770857142857144,13.770857142857144,13.890514285714286,13.890514285714286,13.890514285714286,13.890514285714286,13.890514285714286,13.890857142857143,13.890857142857143,13.890857142857143,13.823657142857144,13.823657142857144,13.823657142857144,13.906285714285715,13.521942857142855,13.521942857142855,13.521942857142855,13.898399999999999,13.898399999999999,13.898399999999999,13.898399999999999,13.898400000000001,13.898400000000001,13.467428571428572,13.981714285714286,13.981714285714286,13.981714285714286,13.981714285714286,13.981714285714286,13.497942857142856,13.497942857142856,13.497942857142856,13.497942857142901,13.497942857142901,13.497942857143,15.276,15.276,15.276,15.276,15.276,15.276,15.28,15.28,15.28,15.28,15.28,14.83,15.28,15.28,15.28,15.28,15.28,15.8,15.8,15.8,15.8,15.8,15.8,15.8,15.9,15.2]
["IKB",12.692285714285715,12.692285714285715,12.692285714285715,12.692228571428572,12.692228571428572,12.692228571428572,12.692228571428572,12.692228571428572,12.692228571428572,12.40457142857143,12.40457142857143,12.40457142857143,12.918171428571428,13.052914285714285,13.052914285714285,13.052914285714285,13.052914285714285,13.052914285714285,13.052914285714285,13.052914285714285,13.052914285714285,13.052914285714285,12.793028571428573,12.793028571428573,13.118742857142859,13.119085714285715,13.119085714285715,13.238742857142856,13.238742857142856,13.238742857142856,13.238742857142856,13.238742857142856,13.239085714285716,13.171885714285716,13.171885714285716,13.171885714285716,13.171885714285716,13.171885714285716,13.254514285714286,12.892457142857143,12.892457142857143,12.892457142857143,13.515085714285714,13.515085714285714,13.515085714285714,13.515085714285714,13.5150857142857,13.5150857142857,13.324,13.508914285714287,13.508914285714287,13.508914285714287,13.508914285714287,13.508914285714287,13.962514285714285,13.962514285714285,13.962514285714285,13.962514285714301,13.962514285714301,13.962514285714301,14.77,14.77,14.77,14.77,14.77,14.77,14.77,14.77,14.77,14.77,14.77,14.33,14.69,14.69,14.69,14.69,14.69,15.41,15.41,15.41,15.41,15.41,15.49,15.49,15.53,16.05]
["Energie Klagenfurt GmbH",12.483428571428572,12.483428571428572,12.483428571428572,12.483428571428572,12.483428571428572,12.483428571428572,12.483428571428572,12.483428571428572,12.483428571428572,12.534514285714286,12.534514285714286,12.534514285714286,13.038514285714285,12.980571428571428,12.980571428571428,12.980571428571428,12.980571428571428,12.980571428571428,12.980571428571428,12.980571428571428,12.980571428571428,12.980571428571428,12.615428571428572,12.615428571428572,12.941142857142857,12.941142857142857,12.941142857142857,13.0608,13.0608,13.0608,13.0608,13.0608,13.061142857142856,12.993942857142857,12.993942857142857,12.993942857142857,12.993942857142857,12.652799999999999,12.652799999999999,12.652799999999999,12.652799999999999,12.652799999999999,13.029257142857142,13.029257142857142,13.029257142857142,13.029257142857142,13.0292571428571,13.0292571428571,12.919714285714285,13.43382857142857,13.43382857142857,13.43382857142857,13.43382857142857,13.43382857142857,13.402285714285714,13.402285714285714,13.402285714285714,13.4022857142857,13.4022857142857,13.4022857142857,13.89,13.89,13.89,13.89,13.89,13.89,13.89,13.89,13.89,13.89,13.89,13.44,13.77,13.77,13.77,13.77,13.77,14.49,14.49,14.49,14.49,14.49,14.57,14.57,14.76,14.76]
["STEG",15.605142857142855,15.605142857142855,15.605142857142855,15.605485714285715,15.605485714285715,15.605485714285715,15.605485714285715,15.605485714285715,15.605142857142855,15.776571428571428,15.776571428571428,15.776571428571428,15.936342857142856,15.878400000000001,15.878400000000001,15.878400000000001,15.878400000000001,15.878400000000001,15.878400000000001,15.878400000000001,15.878400000000001,15.878400000000001,15.878400000000001,15.878400000000001]
[null,{"$f":"AVERAGE(B41:B54)","v":14.653040816326527},14.660448979591834,14.667163265306119,14.547257142857145,14.43962448979592,14.399632653061227,14.391502040816325,14.41618775510204,14.417363265306124,14.429608163265311,14.429608163265311,14.429608163265311,14.722726530612245,14.679159183673468,14.699314285714285,14.71545306122449,14.706636734693877,14.706636734693877,14.706636734693877,14.706636734693877,14.706636734693877,14.706636734693877,14.438253061224488,14.438253061224488,14.708228571428574,14.708254945054948,14.708254945054948,14.827912087912088,14.827912087912088,14.827912087912088,14.827912087912088,14.827226373626372,{"$f":"AVERAGE(AH41:AH54)","v":14.827569230769235},14.77563956043956,14.793942857142856,14.788773626373626,14.788773626373626,14.547870329670328,14.545345054945056,14.372782417582417,14.372782417582417,14.062826373626361,14.396043956043957,14.396043956043957,14.396043956043957,14.396043956043957,14.396043956043968,14.396043956043968,14.229296703296702,14.734786813186812,14.734786813186812,14.734786813186812,14.734786813186812,14.734786813186812,14.693723076923078,14.693723076923078,14.693723076923078,14.693723076923087,14.693723076923087,14.69372307692309,15.801362637362637,15.801362637362637,15.801362637362637,15.801362637362637,{"$f":"AVERAGE(BN41:BN54)","v":15.801362637362637},15.801362637362637,15.801538461538463,15.801538461538463,15.801538461538463,15.801538461538463,15.801538461538463,15.357692307692311,15.75,15.75,15.75,15.75,15.75,16.454615384615384,16.454615384615384,16.454615384615384,16.454615384615384,16.454615384615384,16.424615384615386,16.437692307692313,16.411538461538463,16.013846153846156]
[]
[]
[]
[]
[]
[]
[]
[]
[]
[]
[]
[]
[]
[]
[]
[]
[]
[]
[]
[]
[]
[]
[]
[]
[]
[]
[]
[]
[]
[]
[]
[]
[]
[]
[]
[]
[]
[]
[null,"Derzeit durchschnittlicher Strompreis:",null,null,null,null,{"$f":"CI55","v":16.013846153846156},"cent/kWh"]
[null,"Derzeit Ökostrompreis (ökostrom-ag):",null,null,null,null,21.5,"cent/kWh"]
[null,"Einspeisepreis für Ökostrom:",null,null,null,null,5.59,"cent/kWh"]
[]
[]
[]
[]
[]
[{"$f":"$B$55*(1+(D102/100))^7","v":16.26260280854213},null,null,1.5]
[{"$f":"Eingabe!$H$79*(1+(Eingabe!$H$105/100))^Berechnungen!#REF!","v":{"$error":"#REF!"}}]
[{"$f":"Eingabe!$H$79*(1+(Eingabe!$H$105/100))^Berechnungen!#REF!","v":{"$error":"#REF!"}}]
[{"$f":"Eingabe!$H$79*(1+(Eingabe!$H$105/100))^Berechnungen!#REF!","v":{"$error":"#REF!"}}]
[{"$f":"Eingabe!$H$79*(1+(Eingabe!$H$105/100))^Berechnungen!#REF!","v":{"$error":"#REF!"}}]
[{"$f":"Eingabe!$H$79*(1+(Eingabe!$H$105/100))^Berechnungen!#REF!","v":{"$error":"#REF!"}}]
[{"$f":"Eingabe!$H$79*(1+(Eingabe!$H$105/100))^Berechnungen!#REF!","v":{"$error":"#REF!"}}]
[{"$f":"Eingabe!$H$79*(1+(Eingabe!$H$105/100))^Berechnungen!#REF!","v":{"$error":"#REF!"}}]
[{"$f":"Eingabe!$H$79*(1+(Eingabe!$H$105/100))^Berechnungen!#REF!","v":{"$error":"#REF!"}}]
[{"$f":"Eingabe!$H$79*(1+(Eingabe!$H$105/100))^Berechnungen!#REF!","v":{"$error":"#REF!"}}]
[{"$f":"Eingabe!$H$79*(1+(Eingabe!$H$105/100))^Berechnungen!#REF!","v":{"$error":"#REF!"}}]
[{"$f":"Eingabe!$H$79*(1+(Eingabe!$H$105/100))^Berechnungen!#REF!","v":{"$error":"#REF!"}}]
[{"$f":"Eingabe!$H$79*(1+(Eingabe!$H$105/100))^Berechnungen!#REF!","v":{"$error":"#REF!"}}]
[{"$f":"Eingabe!$H$79*(1+(Eingabe!$H$105/100))^Berechnungen!#REF!","v":{"$error":"#REF!"}}]
[{"$f":"Eingabe!$H$79*(1+(Eingabe!$H$105/100))^Berechnungen!#REF!","v":{"$error":"#REF!"}}]
[{"$f":"Eingabe!$H$79*(1+(Eingabe!$H$105/100))^Berechnungen!#REF!","v":{"$error":"#REF!"}}]
[{"$f":"Eingabe!$H$79*(1+(Eingabe!$H$105/100))^Berechnungen!#REF!","v":{"$error":"#REF!"}}]
[{"$f":"Eingabe!$H$79*(1+(Eingabe!$H$105/100))^Berechnungen!#REF!","v":{"$error":"#REF!"}}]
[{"$f":"Eingabe!$H$79*(1+(Eingabe!$H$105/100))^Berechnungen!#REF!","v":{"$error":"#REF!"}}]
[{"$f":"Eingabe!$H$79*(1+(Eingabe!$H$105/100))^Berechnungen!#REF!","v":{"$error":"#REF!"}}]
[{"$f":"Eingabe!$H$79*(1+(Eingabe!$H$105/100))^Berechnungen!#REF!","v":{"$error":"#REF!"}}]
[{"$f":"Eingabe!$H$79*(1+(Eingabe!$H$105/100))^Berechnungen!#REF!","v":{"$error":"#REF!"}}]
[{"$f":"Eingabe!$H$79*(1+(Eingabe!$H$105/100))^Berechnungen!#REF!","v":{"$error":"#REF!"}}]
[{"$f":"Eingabe!$H$79*(1+(Eingabe!$H$105/100))^Berechnungen!#REF!","v":{"$error":"#REF!"}}]
[{"$f":"Eingabe!$H$79*(1+(Eingabe!$H$105/100))^Berechnungen!#REF!","v":{"$error":"#REF!"}}]